You are viewing a plain text version of this content. The canonical link for it is here.
Posted to builds@beam.apache.org by Apache Jenkins Server <je...@builds.apache.org> on 2023/02/19 09:31:32 UTC
Build failed in Jenkins: beam_PostCommit_Java_Nexmark_Dataflow_V2_Java17 #1697
See <https://ci-beam.apache.org/job/beam_PostCommit_Java_Nexmark_Dataflow_V2_Java17/1697/display/redirect>
Changes:
------------------------------------------
[...truncated 1.17 MB...]
0016 *** not run ***
==========================================================================================
Feb 19, 2023 9:31:10 AM org.apache.beam.sdk.testutils.metrics.MetricsReader getCounterMetric
SEVERE: Failed to get metric event.bytes, from namespace Query14.Events
Feb 19, 2023 9:31:10 AM org.apache.beam.sdk.testutils.metrics.MetricsReader getCounterMetric
SEVERE: Failed to get metric result.elements, from namespace Query14.Results
Feb 19, 2023 9:31:10 AM org.apache.beam.sdk.testutils.metrics.MetricsReader getCounterMetric
SEVERE: Failed to get metric result.bytes, from namespace Query14.Results
2023-02-19T09:31:10.467Z no activity
2023-02-19T09:31:24.884Z FAILED Query10
Feb 19, 2023 9:31:24 AM org.apache.beam.sdk.testutils.metrics.MetricsReader getCounterMetric
SEVERE: Failed to get metric event.elements, from namespace Query10.Events
Feb 19, 2023 9:31:24 AM org.apache.beam.sdk.testutils.metrics.MetricsReader getCounterMetric
SEVERE: Failed to get metric event.bytes, from namespace Query10.Events
Feb 19, 2023 9:31:24 AM org.apache.beam.sdk.testutils.metrics.MetricsReader getCounterMetric
SEVERE: Failed to get metric result.elements, from namespace Query10.Results
Feb 19, 2023 9:31:24 AM org.apache.beam.sdk.testutils.metrics.MetricsReader getCounterMetric
SEVERE: Failed to get metric result.bytes, from namespace Query10.Results
==========================================================================================
Run started 2023-02-19T09:25:37.787Z and ran for PT347.125S
Default configuration:
{"debug":true,"query":null,"sourceType":"DIRECT","generateEventFilePathPrefix":null,"sinkType":"DEVNULL","exportSummaryToBigQuery":false,"pubSubMode":"COMBINED","pubsubMessageSerializationMethod":"CODER","sideInputType":"DIRECT","sideInputRowCount":500,"sideInputNumShards":3,"sideInputUrl":null,"sessionGap":600000,"numEvents":100000,"numEventGenerators":100,"rateShape":"SINE","firstEventRate":10000,"nextEventRate":10000,"rateUnit":"PER_SECOND","ratePeriodSec":600,"preloadSeconds":0,"streamTimeout":240,"isRateLimited":false,"useWallclockEventTime":false,"avgPersonByteSize":200,"avgAuctionByteSize":500,"avgBidByteSize":100,"hotAuctionRatio":2,"hotSellersRatio":4,"hotBiddersRatio":4,"windowSizeSec":10,"windowPeriodSec":5,"watermarkHoldbackSec":0,"numInFlightAuctions":100,"numActivePeople":1000,"coderStrategy":"HAND","cpuDelayMs":0,"diskBusyBytes":0,"auctionSkip":123,"fanout":5,"maxAuctionsWaitingTime":600,"occasionalDelaySec":3,"probDelayedEvent":0.1,"maxLogEvents":100000,"usePubsubPublishTime":false,"outOfOrderGroupSize":1,"numKeyBuckets":20000,"pardoCPUFactor":1.0}
Configurations:
Conf Description
0000 query:PASSTHROUGH; numEvents:10000000
0001 query:CURRENCY_CONVERSION; numEvents:10000000
0002 query:SELECTION; numEvents:10000000
0003 query:LOCAL_ITEM_SUGGESTION; numEvents:10000000
0004 query:AVERAGE_PRICE_FOR_CATEGORY; numEvents:1000000
0005 query:HOT_ITEMS; numEvents:10000000
0006 query:AVERAGE_SELLING_PRICE_BY_SELLER; numEvents:1000000
0007 query:HIGHEST_BID; numEvents:10000000
0008 query:MONITOR_NEW_USERS; numEvents:10000000
0009 query:WINNING_BIDS; numEvents:1000000
0010 query:LOG_TO_SHARDED_FILES; numEvents:10000000
0011 query:USER_SESSIONS; numEvents:10000000
0012 query:PROCESSING_TIME_WINDOWS; numEvents:10000000
0013 query:PORTABILITY_BATCH; numEvents:10000000
0014 query:RESHUFFLE; numEvents:10000000
0015 query:BOUNDED_SIDE_INPUT_JOIN; numEvents:10000000
0016 query:SESSION_SIDE_INPUT_JOIN; numEvents:10000000
Performance:
Conf Runtime(sec) (Baseline) Events(/sec) (Baseline) Results (Baseline)
0000 -1.0 -1.0 -1
*** Job was unexpectedly updated ***
0001 -1.0 -1.0 -1
*** Job was unexpectedly updated ***
0002 -1.0 -1.0 -1
*** Job was unexpectedly updated ***
0003 *** not run ***
0004 *** not run ***
0005 -1.0 -1.0 -1
*** Job was unexpectedly updated ***
0006 *** not run ***
0007 *** not run ***
0008 -1.0 -1.0 -1
*** Job was unexpectedly updated ***
0009 *** not run ***
0010 -1.0 -1.0 -1
*** Job was unexpectedly updated ***
0011 -1.0 -1.0 -1
*** Job was unexpectedly updated ***
0012 -1.0 -1.0 -1
*** Job was unexpectedly updated ***
0013 -1.0 -1.0 -1
*** Job was unexpectedly updated ***
0014 *** not run ***
0015 *** not run ***
0016 *** not run ***
==========================================================================================
2023-02-19T09:31:25.496Z FAILED Query14
Feb 19, 2023 9:31:25 AM org.apache.beam.sdk.testutils.metrics.MetricsReader getCounterMetric
SEVERE: Failed to get metric event.elements, from namespace Query14.Events
Feb 19, 2023 9:31:25 AM org.apache.beam.sdk.testutils.metrics.MetricsReader getCounterMetric
SEVERE: Failed to get metric event.bytes, from namespace Query14.Events
Feb 19, 2023 9:31:25 AM org.apache.beam.sdk.testutils.metrics.MetricsReader getCounterMetric
SEVERE: Failed to get metric result.elements, from namespace Query14.Results
Feb 19, 2023 9:31:25 AM org.apache.beam.sdk.testutils.metrics.MetricsReader getCounterMetric
SEVERE: Failed to get metric result.bytes, from namespace Query14.Results
==========================================================================================
Run started 2023-02-19T09:25:37.787Z and ran for PT347.728S
Default configuration:
{"debug":true,"query":null,"sourceType":"DIRECT","generateEventFilePathPrefix":null,"sinkType":"DEVNULL","exportSummaryToBigQuery":false,"pubSubMode":"COMBINED","pubsubMessageSerializationMethod":"CODER","sideInputType":"DIRECT","sideInputRowCount":500,"sideInputNumShards":3,"sideInputUrl":null,"sessionGap":600000,"numEvents":100000,"numEventGenerators":100,"rateShape":"SINE","firstEventRate":10000,"nextEventRate":10000,"rateUnit":"PER_SECOND","ratePeriodSec":600,"preloadSeconds":0,"streamTimeout":240,"isRateLimited":false,"useWallclockEventTime":false,"avgPersonByteSize":200,"avgAuctionByteSize":500,"avgBidByteSize":100,"hotAuctionRatio":2,"hotSellersRatio":4,"hotBiddersRatio":4,"windowSizeSec":10,"windowPeriodSec":5,"watermarkHoldbackSec":0,"numInFlightAuctions":100,"numActivePeople":1000,"coderStrategy":"HAND","cpuDelayMs":0,"diskBusyBytes":0,"auctionSkip":123,"fanout":5,"maxAuctionsWaitingTime":600,"occasionalDelaySec":3,"probDelayedEvent":0.1,"maxLogEvents":100000,"usePubsubPublishTime":false,"outOfOrderGroupSize":1,"numKeyBuckets":20000,"pardoCPUFactor":1.0}
Configurations:
Conf Description
0000 query:PASSTHROUGH; numEvents:10000000
0001 query:CURRENCY_CONVERSION; numEvents:10000000
0002 query:SELECTION; numEvents:10000000
0003 query:LOCAL_ITEM_SUGGESTION; numEvents:10000000
0004 query:AVERAGE_PRICE_FOR_CATEGORY; numEvents:1000000
0005 query:HOT_ITEMS; numEvents:10000000
0006 query:AVERAGE_SELLING_PRICE_BY_SELLER; numEvents:1000000
0007 query:HIGHEST_BID; numEvents:10000000
0008 query:MONITOR_NEW_USERS; numEvents:10000000
0009 query:WINNING_BIDS; numEvents:1000000
0010 query:LOG_TO_SHARDED_FILES; numEvents:10000000
0011 query:USER_SESSIONS; numEvents:10000000
0012 query:PROCESSING_TIME_WINDOWS; numEvents:10000000
0013 query:PORTABILITY_BATCH; numEvents:10000000
0014 query:RESHUFFLE; numEvents:10000000
0015 query:BOUNDED_SIDE_INPUT_JOIN; numEvents:10000000
0016 query:SESSION_SIDE_INPUT_JOIN; numEvents:10000000
Performance:
Conf Runtime(sec) (Baseline) Events(/sec) (Baseline) Results (Baseline)
0000 -1.0 -1.0 -1
*** Job was unexpectedly updated ***
0001 -1.0 -1.0 -1
*** Job was unexpectedly updated ***
0002 -1.0 -1.0 -1
*** Job was unexpectedly updated ***
0003 *** not run ***
0004 *** not run ***
0005 -1.0 -1.0 -1
*** Job was unexpectedly updated ***
0006 *** not run ***
0007 *** not run ***
0008 -1.0 -1.0 -1
*** Job was unexpectedly updated ***
0009 *** not run ***
0010 -1.0 -1.0 -1
*** Job was unexpectedly updated ***
0011 -1.0 -1.0 -1
*** Job was unexpectedly updated ***
0012 -1.0 -1.0 -1
*** Job was unexpectedly updated ***
0013 -1.0 -1.0 -1
*** Job was unexpectedly updated ***
0014 -1.0 -1.0 -1
*** Job was unexpectedly updated ***
0015 *** not run ***
0016 *** not run ***
==========================================================================================
==========================================================================================
Run started 2023-02-19T09:25:37.787Z and ran for PT347.947S
Default configuration:
{"debug":true,"query":null,"sourceType":"DIRECT","generateEventFilePathPrefix":null,"sinkType":"DEVNULL","exportSummaryToBigQuery":false,"pubSubMode":"COMBINED","pubsubMessageSerializationMethod":"CODER","sideInputType":"DIRECT","sideInputRowCount":500,"sideInputNumShards":3,"sideInputUrl":null,"sessionGap":600000,"numEvents":100000,"numEventGenerators":100,"rateShape":"SINE","firstEventRate":10000,"nextEventRate":10000,"rateUnit":"PER_SECOND","ratePeriodSec":600,"preloadSeconds":0,"streamTimeout":240,"isRateLimited":false,"useWallclockEventTime":false,"avgPersonByteSize":200,"avgAuctionByteSize":500,"avgBidByteSize":100,"hotAuctionRatio":2,"hotSellersRatio":4,"hotBiddersRatio":4,"windowSizeSec":10,"windowPeriodSec":5,"watermarkHoldbackSec":0,"numInFlightAuctions":100,"numActivePeople":1000,"coderStrategy":"HAND","cpuDelayMs":0,"diskBusyBytes":0,"auctionSkip":123,"fanout":5,"maxAuctionsWaitingTime":600,"occasionalDelaySec":3,"probDelayedEvent":0.1,"maxLogEvents":100000,"usePubsubPublishTime":false,"outOfOrderGroupSize":1,"numKeyBuckets":20000,"pardoCPUFactor":1.0}
Configurations:
Conf Description
0000 query:PASSTHROUGH; numEvents:10000000
0001 query:CURRENCY_CONVERSION; numEvents:10000000
0002 query:SELECTION; numEvents:10000000
0003 query:LOCAL_ITEM_SUGGESTION; numEvents:10000000
0004 query:AVERAGE_PRICE_FOR_CATEGORY; numEvents:1000000
0005 query:HOT_ITEMS; numEvents:10000000
0006 query:AVERAGE_SELLING_PRICE_BY_SELLER; numEvents:1000000
0007 query:HIGHEST_BID; numEvents:10000000
0008 query:MONITOR_NEW_USERS; numEvents:10000000
0009 query:WINNING_BIDS; numEvents:1000000
0010 query:LOG_TO_SHARDED_FILES; numEvents:10000000
0011 query:USER_SESSIONS; numEvents:10000000
0012 query:PROCESSING_TIME_WINDOWS; numEvents:10000000
0013 query:PORTABILITY_BATCH; numEvents:10000000
0014 query:RESHUFFLE; numEvents:10000000
0015 query:BOUNDED_SIDE_INPUT_JOIN; numEvents:10000000
0016 query:SESSION_SIDE_INPUT_JOIN; numEvents:10000000
Performance:
Conf Runtime(sec) (Baseline) Events(/sec) (Baseline) Results (Baseline)
0000 -1.0 -1.0 -1
*** Job was unexpectedly updated ***
0001 -1.0 -1.0 -1
*** Job was unexpectedly updated ***
0002 -1.0 -1.0 -1
*** Job was unexpectedly updated ***
0003 *** not run ***
0004 *** not run ***
0005 -1.0 -1.0 -1
*** Job was unexpectedly updated ***
0006 *** not run ***
0007 *** not run ***
0008 -1.0 -1.0 -1
*** Job was unexpectedly updated ***
0009 *** not run ***
0010 -1.0 -1.0 -1
*** Job was unexpectedly updated ***
0011 -1.0 -1.0 -1
*** Job was unexpectedly updated ***
0012 -1.0 -1.0 -1
*** Job was unexpectedly updated ***
0013 -1.0 -1.0 -1
*** Job was unexpectedly updated ***
0014 -1.0 -1.0 -1
*** Job was unexpectedly updated ***
0015 *** not run ***
0016 *** not run ***
==========================================================================================
Exception in thread "main" java.lang.RuntimeException: Execution was not successful
at org.apache.beam.sdk.nexmark.Main.runAll(Main.java:169)
at org.apache.beam.sdk.nexmark.Main.main(Main.java:441)
> Task :sdks:java:testing:nexmark:run FAILED
> Task :runners:google-cloud-dataflow-java:cleanUpDockerJavaImages
Untagged: us.gcr.io/apache-beam-testing/java-postcommit-it/java:20230219092451
Untagged: us.gcr.io/apache-beam-testing/java-postcommit-it/java@sha256:5e4e73ab0f9f96000a410078072893e769873705396614d6e24e1f1950dcaa9d
WARNING: Successfully resolved tag to sha256, but it is recommended to use sha256 directly.
Tag: [us.gcr.io/apache-beam-testing/java-postcommit-it/java:20230219092451]
- referencing digest: [us.gcr.io/apache-beam-testing/java-postcommit-it/java@sha256:5e4e73ab0f9f96000a410078072893e769873705396614d6e24e1f1950dcaa9d]
Deleted [[us.gcr.io/apache-beam-testing/java-postcommit-it/java:20230219092451] (referencing [us.gcr.io/apache-beam-testing/java-postcommit-it/java@sha256:5e4e73ab0f9f96000a410078072893e769873705396614d6e24e1f1950dcaa9d])].
Removing untagged image us.gcr.io/apache-beam-testing/java-postcommit-it/java@sha256:5e4e73ab0f9f96000a410078072893e769873705396614d6e24e1f1950dcaa9d
Digests:
- us.gcr.io/apache-beam-testing/java-postcommit-it/java@sha256:5e4e73ab0f9f96000a410078072893e769873705396614d6e24e1f1950dcaa9d
Deleted [us.gcr.io/apache-beam-testing/java-postcommit-it/java@sha256:5e4e73ab0f9f96000a410078072893e769873705396614d6e24e1f1950dcaa9d].
FAILURE: Build failed with an exception.
* What went wrong:
Execution failed for task ':sdks:java:testing:nexmark:run'.
> Process 'command '/usr/lib/jvm/java-8-openjdk-amd64/bin/java'' finished with non-zero exit value 1
* Try:
> Run with --stacktrace option to get the stack trace.
> Run with --info or --debug option to get more log output.
* Get more help at https://help.gradle.org
Deprecated Gradle features were used in this build, making it incompatible with Gradle 8.0.
You can use '--warning-mode all' to show the individual deprecation warnings and determine if they come from your own scripts or plugins.
See https://docs.gradle.org/7.5.1/userguide/command_line_interface.html#sec:command_line_warnings
Execution optimizations have been disabled for 1 invalid unit(s) of work during this build to ensure correctness.
Please consult deprecation warnings for more details.
BUILD FAILED in 6m 56s
140 actionable tasks: 94 executed, 42 from cache, 4 up-to-date
Publishing build scan...
https://gradle.com/s/gboveakuwiz7k
Build step 'Invoke Gradle script' changed build result to FAILURE
Build step 'Invoke Gradle script' marked build as failure
---------------------------------------------------------------------
To unsubscribe, e-mail: builds-unsubscribe@beam.apache.org
For additional commands, e-mail: builds-help@beam.apache.org
Jenkins build is back to normal : beam_PostCommit_Java_Nexmark_Dataflow_V2_Java17 #1707
Posted by Apache Jenkins Server <je...@builds.apache.org>.
See <https://ci-beam.apache.org/job/beam_PostCommit_Java_Nexmark_Dataflow_V2_Java17/1707/display/redirect?page=changes>
---------------------------------------------------------------------
To unsubscribe, e-mail: builds-unsubscribe@beam.apache.org
For additional commands, e-mail: builds-help@beam.apache.org
Build failed in Jenkins: beam_PostCommit_Java_Nexmark_Dataflow_V2_Java17 #1706
Posted by Apache Jenkins Server <je...@builds.apache.org>.
See <https://ci-beam.apache.org/job/beam_PostCommit_Java_Nexmark_Dataflow_V2_Java17/1706/display/redirect>
Changes:
------------------------------------------
[...truncated 1.30 MB...]
2023-02-21T16:10:10.933Z FAILED Query5
Feb 21, 2023 4:10:10 PM org.apache.beam.sdk.testutils.metrics.MetricsReader getCounterMetric
SEVERE: Failed to get metric event.elements, from namespace Query5.Events
Feb 21, 2023 4:10:10 PM org.apache.beam.sdk.testutils.metrics.MetricsReader getCounterMetric
SEVERE: Failed to get metric event.bytes, from namespace Query5.Events
Feb 21, 2023 4:10:10 PM org.apache.beam.sdk.testutils.metrics.MetricsReader getCounterMetric
SEVERE: Failed to get metric result.elements, from namespace Query5.Results
Feb 21, 2023 4:10:10 PM org.apache.beam.sdk.testutils.metrics.MetricsReader getCounterMetric
SEVERE: Failed to get metric result.bytes, from namespace Query5.Results
==========================================================================================
Run started 2023-02-21T16:04:12.930Z and ran for PT358.051S
Default configuration:
{"debug":true,"query":null,"sourceType":"DIRECT","generateEventFilePathPrefix":null,"sinkType":"DEVNULL","exportSummaryToBigQuery":false,"pubSubMode":"COMBINED","pubsubMessageSerializationMethod":"CODER","sideInputType":"DIRECT","sideInputRowCount":500,"sideInputNumShards":3,"sideInputUrl":null,"sessionGap":600000,"numEvents":100000,"numEventGenerators":100,"rateShape":"SINE","firstEventRate":10000,"nextEventRate":10000,"rateUnit":"PER_SECOND","ratePeriodSec":600,"preloadSeconds":0,"streamTimeout":240,"isRateLimited":false,"useWallclockEventTime":false,"avgPersonByteSize":200,"avgAuctionByteSize":500,"avgBidByteSize":100,"hotAuctionRatio":2,"hotSellersRatio":4,"hotBiddersRatio":4,"windowSizeSec":10,"windowPeriodSec":5,"watermarkHoldbackSec":0,"numInFlightAuctions":100,"numActivePeople":1000,"coderStrategy":"HAND","cpuDelayMs":0,"diskBusyBytes":0,"auctionSkip":123,"fanout":5,"maxAuctionsWaitingTime":600,"occasionalDelaySec":3,"probDelayedEvent":0.1,"maxLogEvents":100000,"usePubsubPublishTime":false,"outOfOrderGroupSize":1,"numKeyBuckets":20000,"pardoCPUFactor":1.0}
Configurations:
Conf Description
0000 query:PASSTHROUGH; numEvents:10000000
0001 query:CURRENCY_CONVERSION; numEvents:10000000
0002 query:SELECTION; numEvents:10000000
0003 query:LOCAL_ITEM_SUGGESTION; numEvents:10000000
0004 query:AVERAGE_PRICE_FOR_CATEGORY; numEvents:1000000
0005 query:HOT_ITEMS; numEvents:10000000
0006 query:AVERAGE_SELLING_PRICE_BY_SELLER; numEvents:1000000
0007 query:HIGHEST_BID; numEvents:10000000
0008 query:MONITOR_NEW_USERS; numEvents:10000000
0009 query:WINNING_BIDS; numEvents:1000000
0010 query:LOG_TO_SHARDED_FILES; numEvents:10000000
0011 query:USER_SESSIONS; numEvents:10000000
0012 query:PROCESSING_TIME_WINDOWS; numEvents:10000000
0013 query:PORTABILITY_BATCH; numEvents:10000000
0014 query:RESHUFFLE; numEvents:10000000
0015 query:BOUNDED_SIDE_INPUT_JOIN; numEvents:10000000
0016 query:SESSION_SIDE_INPUT_JOIN; numEvents:10000000
Performance:
Conf Runtime(sec) (Baseline) Events(/sec) (Baseline) Results (Baseline)
0000 -1.0 -1.0 -1
*** Job was unexpectedly updated ***
0001 -1.0 -1.0 -1
*** Job was unexpectedly updated ***
0002 -1.0 -1.0 -1
*** Job was unexpectedly updated ***
0003 *** not run ***
0004 *** not run ***
0005 -1.0 -1.0 -1
*** Job was unexpectedly updated ***
0006 *** not run ***
0007 *** not run ***
0008 *** not run ***
0009 *** not run ***
0010 -1.0 -1.0 -1
*** Job was unexpectedly updated ***
0011 -1.0 -1.0 -1
*** Job was unexpectedly updated ***
0012 -1.0 -1.0 -1
*** Job was unexpectedly updated ***
0013 -1.0 -1.0 -1
*** Job was unexpectedly updated ***
0014 -1.0 -1.0 -1
*** Job was unexpectedly updated ***
0015 *** not run ***
0016 *** not run ***
==========================================================================================
2023-02-21T16:10:11.383Z RUNNING Query8
Feb 21, 2023 4:10:11 PM org.apache.beam.sdk.testutils.metrics.MetricsReader getCounterMetric
SEVERE: Failed to get metric event.elements, from namespace Query8.Events
Feb 21, 2023 4:10:11 PM org.apache.beam.sdk.testutils.metrics.MetricsReader getCounterMetric
SEVERE: Failed to get metric event.bytes, from namespace Query8.Events
Feb 21, 2023 4:10:11 PM org.apache.beam.sdk.testutils.metrics.MetricsReader getCounterMetric
SEVERE: Failed to get metric result.elements, from namespace Query8.Results
Feb 21, 2023 4:10:11 PM org.apache.beam.sdk.testutils.metrics.MetricsReader getCounterMetric
SEVERE: Failed to get metric result.bytes, from namespace Query8.Results
2023-02-21T16:10:12.045Z no activity
2023-02-21T16:10:27.132Z FAILED Query8
Feb 21, 2023 4:10:27 PM org.apache.beam.sdk.testutils.metrics.MetricsReader getCounterMetric
SEVERE: Failed to get metric event.elements, from namespace Query8.Events
Feb 21, 2023 4:10:27 PM org.apache.beam.sdk.testutils.metrics.MetricsReader getCounterMetric
SEVERE: Failed to get metric event.bytes, from namespace Query8.Events
Feb 21, 2023 4:10:27 PM org.apache.beam.sdk.testutils.metrics.MetricsReader getCounterMetric
SEVERE: Failed to get metric result.elements, from namespace Query8.Results
Feb 21, 2023 4:10:27 PM org.apache.beam.sdk.testutils.metrics.MetricsReader getCounterMetric
SEVERE: Failed to get metric result.bytes, from namespace Query8.Results
==========================================================================================
Run started 2023-02-21T16:04:12.930Z and ran for PT374.241S
Default configuration:
{"debug":true,"query":null,"sourceType":"DIRECT","generateEventFilePathPrefix":null,"sinkType":"DEVNULL","exportSummaryToBigQuery":false,"pubSubMode":"COMBINED","pubsubMessageSerializationMethod":"CODER","sideInputType":"DIRECT","sideInputRowCount":500,"sideInputNumShards":3,"sideInputUrl":null,"sessionGap":600000,"numEvents":100000,"numEventGenerators":100,"rateShape":"SINE","firstEventRate":10000,"nextEventRate":10000,"rateUnit":"PER_SECOND","ratePeriodSec":600,"preloadSeconds":0,"streamTimeout":240,"isRateLimited":false,"useWallclockEventTime":false,"avgPersonByteSize":200,"avgAuctionByteSize":500,"avgBidByteSize":100,"hotAuctionRatio":2,"hotSellersRatio":4,"hotBiddersRatio":4,"windowSizeSec":10,"windowPeriodSec":5,"watermarkHoldbackSec":0,"numInFlightAuctions":100,"numActivePeople":1000,"coderStrategy":"HAND","cpuDelayMs":0,"diskBusyBytes":0,"auctionSkip":123,"fanout":5,"maxAuctionsWaitingTime":600,"occasionalDelaySec":3,"probDelayedEvent":0.1,"maxLogEvents":100000,"usePubsubPublishTime":false,"outOfOrderGroupSize":1,"numKeyBuckets":20000,"pardoCPUFactor":1.0}
Configurations:
Conf Description
0000 query:PASSTHROUGH; numEvents:10000000
0001 query:CURRENCY_CONVERSION; numEvents:10000000
0002 query:SELECTION; numEvents:10000000
0003 query:LOCAL_ITEM_SUGGESTION; numEvents:10000000
0004 query:AVERAGE_PRICE_FOR_CATEGORY; numEvents:1000000
0005 query:HOT_ITEMS; numEvents:10000000
0006 query:AVERAGE_SELLING_PRICE_BY_SELLER; numEvents:1000000
0007 query:HIGHEST_BID; numEvents:10000000
0008 query:MONITOR_NEW_USERS; numEvents:10000000
0009 query:WINNING_BIDS; numEvents:1000000
0010 query:LOG_TO_SHARDED_FILES; numEvents:10000000
0011 query:USER_SESSIONS; numEvents:10000000
0012 query:PROCESSING_TIME_WINDOWS; numEvents:10000000
0013 query:PORTABILITY_BATCH; numEvents:10000000
0014 query:RESHUFFLE; numEvents:10000000
0015 query:BOUNDED_SIDE_INPUT_JOIN; numEvents:10000000
0016 query:SESSION_SIDE_INPUT_JOIN; numEvents:10000000
Performance:
Conf Runtime(sec) (Baseline) Events(/sec) (Baseline) Results (Baseline)
0000 -1.0 -1.0 -1
*** Job was unexpectedly updated ***
0001 -1.0 -1.0 -1
*** Job was unexpectedly updated ***
0002 -1.0 -1.0 -1
*** Job was unexpectedly updated ***
0003 *** not run ***
0004 *** not run ***
0005 -1.0 -1.0 -1
*** Job was unexpectedly updated ***
0006 *** not run ***
0007 *** not run ***
0008 -1.0 -1.0 -1
*** Job was unexpectedly updated ***
0009 *** not run ***
0010 -1.0 -1.0 -1
*** Job was unexpectedly updated ***
0011 -1.0 -1.0 -1
*** Job was unexpectedly updated ***
0012 -1.0 -1.0 -1
*** Job was unexpectedly updated ***
0013 -1.0 -1.0 -1
*** Job was unexpectedly updated ***
0014 -1.0 -1.0 -1
*** Job was unexpectedly updated ***
0015 *** not run ***
0016 *** not run ***
==========================================================================================
==========================================================================================
Run started 2023-02-21T16:04:12.930Z and ran for PT374.578S
Default configuration:
{"debug":true,"query":null,"sourceType":"DIRECT","generateEventFilePathPrefix":null,"sinkType":"DEVNULL","exportSummaryToBigQuery":false,"pubSubMode":"COMBINED","pubsubMessageSerializationMethod":"CODER","sideInputType":"DIRECT","sideInputRowCount":500,"sideInputNumShards":3,"sideInputUrl":null,"sessionGap":600000,"numEvents":100000,"numEventGenerators":100,"rateShape":"SINE","firstEventRate":10000,"nextEventRate":10000,"rateUnit":"PER_SECOND","ratePeriodSec":600,"preloadSeconds":0,"streamTimeout":240,"isRateLimited":false,"useWallclockEventTime":false,"avgPersonByteSize":200,"avgAuctionByteSize":500,"avgBidByteSize":100,"hotAuctionRatio":2,"hotSellersRatio":4,"hotBiddersRatio":4,"windowSizeSec":10,"windowPeriodSec":5,"watermarkHoldbackSec":0,"numInFlightAuctions":100,"numActivePeople":1000,"coderStrategy":"HAND","cpuDelayMs":0,"diskBusyBytes":0,"auctionSkip":123,"fanout":5,"maxAuctionsWaitingTime":600,"occasionalDelaySec":3,"probDelayedEvent":0.1,"maxLogEvents":100000,"usePubsubPublishTime":false,"outOfOrderGroupSize":1,"numKeyBuckets":20000,"pardoCPUFactor":1.0}
Configurations:
Conf Description
0000 query:PASSTHROUGH; numEvents:10000000
0001 query:CURRENCY_CONVERSION; numEvents:10000000
0002 query:SELECTION; numEvents:10000000
0003 query:LOCAL_ITEM_SUGGESTION; numEvents:10000000
0004 query:AVERAGE_PRICE_FOR_CATEGORY; numEvents:1000000
0005 query:HOT_ITEMS; numEvents:10000000
0006 query:AVERAGE_SELLING_PRICE_BY_SELLER; numEvents:1000000
0007 query:HIGHEST_BID; numEvents:10000000
0008 query:MONITOR_NEW_USERS; numEvents:10000000
0009 query:WINNING_BIDS; numEvents:1000000
0010 query:LOG_TO_SHARDED_FILES; numEvents:10000000
0011 query:USER_SESSIONS; numEvents:10000000
0012 query:PROCESSING_TIME_WINDOWS; numEvents:10000000
0013 query:PORTABILITY_BATCH; numEvents:10000000
0014 query:RESHUFFLE; numEvents:10000000
0015 query:BOUNDED_SIDE_INPUT_JOIN; numEvents:10000000
0016 query:SESSION_SIDE_INPUT_JOIN; numEvents:10000000
Performance:
Conf Runtime(sec) (Baseline) Events(/sec) (Baseline) Results (Baseline)
0000 -1.0 -1.0 -1
*** Job was unexpectedly updated ***
0001 -1.0 -1.0 -1
*** Job was unexpectedly updated ***
0002 -1.0 -1.0 -1
*** Job was unexpectedly updated ***
0003 *** not run ***
0004 *** not run ***
0005 -1.0 -1.0 -1
*** Job was unexpectedly updated ***
0006 *** not run ***
0007 *** not run ***
0008 -1.0 -1.0 -1
*** Job was unexpectedly updated ***
0009 *** not run ***
0010 -1.0 -1.0 -1
*** Job was unexpectedly updated ***
0011 -1.0 -1.0 -1
*** Job was unexpectedly updated ***
0012 -1.0 -1.0 -1
*** Job was unexpectedly updated ***
0013 -1.0 -1.0 -1
*** Job was unexpectedly updated ***
0014 -1.0 -1.0 -1
*** Job was unexpectedly updated ***
0015 *** not run ***
0016 *** not run ***
==========================================================================================
Exception in thread "main" java.lang.RuntimeException: Execution was not successful
at org.apache.beam.sdk.nexmark.Main.runAll(Main.java:169)
at org.apache.beam.sdk.nexmark.Main.main(Main.java:441)
> Task :sdks:java:testing:nexmark:run FAILED
> Task :runners:google-cloud-dataflow-java:cleanUpDockerJavaImages
Untagged: us.gcr.io/apache-beam-testing/java-postcommit-it/java:20230221160312
Untagged: us.gcr.io/apache-beam-testing/java-postcommit-it/java@sha256:bade6ab9cda8d04d33d850c6f12fa85b2bbb1aa2c4160dc9d1f91ab1df6010ae
WARNING: Successfully resolved tag to sha256, but it is recommended to use sha256 directly.
Tag: [us.gcr.io/apache-beam-testing/java-postcommit-it/java:20230221160312]
- referencing digest: [us.gcr.io/apache-beam-testing/java-postcommit-it/java@sha256:bade6ab9cda8d04d33d850c6f12fa85b2bbb1aa2c4160dc9d1f91ab1df6010ae]
Deleted [[us.gcr.io/apache-beam-testing/java-postcommit-it/java:20230221160312] (referencing [us.gcr.io/apache-beam-testing/java-postcommit-it/java@sha256:bade6ab9cda8d04d33d850c6f12fa85b2bbb1aa2c4160dc9d1f91ab1df6010ae])].
Removing untagged image us.gcr.io/apache-beam-testing/java-postcommit-it/java@sha256:bade6ab9cda8d04d33d850c6f12fa85b2bbb1aa2c4160dc9d1f91ab1df6010ae
Digests:
- us.gcr.io/apache-beam-testing/java-postcommit-it/java@sha256:bade6ab9cda8d04d33d850c6f12fa85b2bbb1aa2c4160dc9d1f91ab1df6010ae
Deleted [us.gcr.io/apache-beam-testing/java-postcommit-it/java@sha256:bade6ab9cda8d04d33d850c6f12fa85b2bbb1aa2c4160dc9d1f91ab1df6010ae].
FAILURE: Build failed with an exception.
* What went wrong:
Execution failed for task ':sdks:java:testing:nexmark:run'.
> Process 'command '/usr/lib/jvm/java-8-openjdk-amd64/bin/java'' finished with non-zero exit value 1
* Try:
> Run with --stacktrace option to get the stack trace.
> Run with --info or --debug option to get more log output.
* Get more help at https://help.gradle.org
Deprecated Gradle features were used in this build, making it incompatible with Gradle 8.0.
You can use '--warning-mode all' to show the individual deprecation warnings and determine if they come from your own scripts or plugins.
See https://docs.gradle.org/7.5.1/userguide/command_line_interface.html#sec:command_line_warnings
Execution optimizations have been disabled for 1 invalid unit(s) of work during this build to ensure correctness.
Please consult deprecation warnings for more details.
BUILD FAILED in 7m 37s
140 actionable tasks: 94 executed, 42 from cache, 4 up-to-date
Publishing build scan...
https://gradle.com/s/htbw76hgtgmc2
Build step 'Invoke Gradle script' changed build result to FAILURE
Build step 'Invoke Gradle script' marked build as failure
---------------------------------------------------------------------
To unsubscribe, e-mail: builds-unsubscribe@beam.apache.org
For additional commands, e-mail: builds-help@beam.apache.org
Build failed in Jenkins: beam_PostCommit_Java_Nexmark_Dataflow_V2_Java17 #1705
Posted by Apache Jenkins Server <je...@builds.apache.org>.
See <https://ci-beam.apache.org/job/beam_PostCommit_Java_Nexmark_Dataflow_V2_Java17/1705/display/redirect>
Changes:
------------------------------------------
[...truncated 1.15 MB...]
2023-02-21T09:31:05.577Z FAILED Query10
Feb 21, 2023 9:31:05 AM org.apache.beam.sdk.testutils.metrics.MetricsReader getCounterMetric
SEVERE: Failed to get metric event.elements, from namespace Query8.Events
Feb 21, 2023 9:31:05 AM org.apache.beam.sdk.testutils.metrics.MetricsReader getCounterMetric
SEVERE: Failed to get metric event.elements, from namespace Query10.Events
Feb 21, 2023 9:31:05 AM org.apache.beam.sdk.testutils.metrics.MetricsReader getCounterMetric
SEVERE: Failed to get metric event.bytes, from namespace Query10.Events
Feb 21, 2023 9:31:05 AM org.apache.beam.sdk.testutils.metrics.MetricsReader getCounterMetric
SEVERE: Failed to get metric result.elements, from namespace Query10.Results
Feb 21, 2023 9:31:05 AM org.apache.beam.sdk.testutils.metrics.MetricsReader getCounterMetric
SEVERE: Failed to get metric result.bytes, from namespace Query10.Results
==========================================================================================
Run started 2023-02-21T09:25:33.614Z and ran for PT332.004S
Default configuration:
{"debug":true,"query":null,"sourceType":"DIRECT","generateEventFilePathPrefix":null,"sinkType":"DEVNULL","exportSummaryToBigQuery":false,"pubSubMode":"COMBINED","pubsubMessageSerializationMethod":"CODER","sideInputType":"DIRECT","sideInputRowCount":500,"sideInputNumShards":3,"sideInputUrl":null,"sessionGap":600000,"numEvents":100000,"numEventGenerators":100,"rateShape":"SINE","firstEventRate":10000,"nextEventRate":10000,"rateUnit":"PER_SECOND","ratePeriodSec":600,"preloadSeconds":0,"streamTimeout":240,"isRateLimited":false,"useWallclockEventTime":false,"avgPersonByteSize":200,"avgAuctionByteSize":500,"avgBidByteSize":100,"hotAuctionRatio":2,"hotSellersRatio":4,"hotBiddersRatio":4,"windowSizeSec":10,"windowPeriodSec":5,"watermarkHoldbackSec":0,"numInFlightAuctions":100,"numActivePeople":1000,"coderStrategy":"HAND","cpuDelayMs":0,"diskBusyBytes":0,"auctionSkip":123,"fanout":5,"maxAuctionsWaitingTime":600,"occasionalDelaySec":3,"probDelayedEvent":0.1,"maxLogEvents":100000,"usePubsubPublishTime":false,"outOfOrderGroupSize":1,"numKeyBuckets":20000,"pardoCPUFactor":1.0}
Configurations:
Conf Description
0000 query:PASSTHROUGH; numEvents:10000000
0001 query:CURRENCY_CONVERSION; numEvents:10000000
0002 query:SELECTION; numEvents:10000000
0003 query:LOCAL_ITEM_SUGGESTION; numEvents:10000000
0004 query:AVERAGE_PRICE_FOR_CATEGORY; numEvents:1000000
0005 query:HOT_ITEMS; numEvents:10000000
0006 query:AVERAGE_SELLING_PRICE_BY_SELLER; numEvents:1000000
0007 query:HIGHEST_BID; numEvents:10000000
0008 query:MONITOR_NEW_USERS; numEvents:10000000
0009 query:WINNING_BIDS; numEvents:1000000
0010 query:LOG_TO_SHARDED_FILES; numEvents:10000000
0011 query:USER_SESSIONS; numEvents:10000000
0012 query:PROCESSING_TIME_WINDOWS; numEvents:10000000
0013 query:PORTABILITY_BATCH; numEvents:10000000
0014 query:RESHUFFLE; numEvents:10000000
0015 query:BOUNDED_SIDE_INPUT_JOIN; numEvents:10000000
0016 query:SESSION_SIDE_INPUT_JOIN; numEvents:10000000
Performance:
Conf Runtime(sec) (Baseline) Events(/sec) (Baseline) Results (Baseline)
0000 -1.0 -1.0 -1
*** Job was unexpectedly updated ***
0001 -1.0 -1.0 -1
*** Job was unexpectedly updated ***
0002 -1.0 -1.0 -1
*** Job was unexpectedly updated ***
0003 *** not run ***
0004 *** not run ***
0005 -1.0 -1.0 -1
*** Job was unexpectedly updated ***
0006 *** not run ***
0007 *** not run ***
0008 *** not run ***
0009 *** not run ***
0010 -1.0 -1.0 -1
*** Job was unexpectedly updated ***
0011 -1.0 -1.0 -1
*** Job was unexpectedly updated ***
0012 -1.0 -1.0 -1
*** Job was unexpectedly updated ***
0013 -1.0 -1.0 -1
*** Job was unexpectedly updated ***
0014 -1.0 -1.0 -1
*** Job was unexpectedly updated ***
0015 *** not run ***
0016 *** not run ***
==========================================================================================
Feb 21, 2023 9:31:05 AM org.apache.beam.sdk.testutils.metrics.MetricsReader getCounterMetric
SEVERE: Failed to get metric event.bytes, from namespace Query8.Events
Feb 21, 2023 9:31:05 AM org.apache.beam.sdk.testutils.metrics.MetricsReader getCounterMetric
SEVERE: Failed to get metric result.elements, from namespace Query8.Results
Feb 21, 2023 9:31:05 AM org.apache.beam.sdk.testutils.metrics.MetricsReader getCounterMetric
SEVERE: Failed to get metric result.bytes, from namespace Query8.Results
2023-02-21T09:31:06.112Z no activity
2023-02-21T09:31:21.165Z FAILED Query8
Feb 21, 2023 9:31:21 AM org.apache.beam.sdk.testutils.metrics.MetricsReader getCounterMetric
SEVERE: Failed to get metric event.elements, from namespace Query8.Events
Feb 21, 2023 9:31:21 AM org.apache.beam.sdk.testutils.metrics.MetricsReader getCounterMetric
SEVERE: Failed to get metric event.bytes, from namespace Query8.Events
Feb 21, 2023 9:31:21 AM org.apache.beam.sdk.testutils.metrics.MetricsReader getCounterMetric
SEVERE: Failed to get metric result.elements, from namespace Query8.Results
Feb 21, 2023 9:31:21 AM org.apache.beam.sdk.testutils.metrics.MetricsReader getCounterMetric
SEVERE: Failed to get metric result.bytes, from namespace Query8.Results
==========================================================================================
Run started 2023-02-21T09:25:33.614Z and ran for PT347.592S
Default configuration:
{"debug":true,"query":null,"sourceType":"DIRECT","generateEventFilePathPrefix":null,"sinkType":"DEVNULL","exportSummaryToBigQuery":false,"pubSubMode":"COMBINED","pubsubMessageSerializationMethod":"CODER","sideInputType":"DIRECT","sideInputRowCount":500,"sideInputNumShards":3,"sideInputUrl":null,"sessionGap":600000,"numEvents":100000,"numEventGenerators":100,"rateShape":"SINE","firstEventRate":10000,"nextEventRate":10000,"rateUnit":"PER_SECOND","ratePeriodSec":600,"preloadSeconds":0,"streamTimeout":240,"isRateLimited":false,"useWallclockEventTime":false,"avgPersonByteSize":200,"avgAuctionByteSize":500,"avgBidByteSize":100,"hotAuctionRatio":2,"hotSellersRatio":4,"hotBiddersRatio":4,"windowSizeSec":10,"windowPeriodSec":5,"watermarkHoldbackSec":0,"numInFlightAuctions":100,"numActivePeople":1000,"coderStrategy":"HAND","cpuDelayMs":0,"diskBusyBytes":0,"auctionSkip":123,"fanout":5,"maxAuctionsWaitingTime":600,"occasionalDelaySec":3,"probDelayedEvent":0.1,"maxLogEvents":100000,"usePubsubPublishTime":false,"outOfOrderGroupSize":1,"numKeyBuckets":20000,"pardoCPUFactor":1.0}
Configurations:
Conf Description
0000 query:PASSTHROUGH; numEvents:10000000
0001 query:CURRENCY_CONVERSION; numEvents:10000000
0002 query:SELECTION; numEvents:10000000
0003 query:LOCAL_ITEM_SUGGESTION; numEvents:10000000
0004 query:AVERAGE_PRICE_FOR_CATEGORY; numEvents:1000000
0005 query:HOT_ITEMS; numEvents:10000000
0006 query:AVERAGE_SELLING_PRICE_BY_SELLER; numEvents:1000000
0007 query:HIGHEST_BID; numEvents:10000000
0008 query:MONITOR_NEW_USERS; numEvents:10000000
0009 query:WINNING_BIDS; numEvents:1000000
0010 query:LOG_TO_SHARDED_FILES; numEvents:10000000
0011 query:USER_SESSIONS; numEvents:10000000
0012 query:PROCESSING_TIME_WINDOWS; numEvents:10000000
0013 query:PORTABILITY_BATCH; numEvents:10000000
0014 query:RESHUFFLE; numEvents:10000000
0015 query:BOUNDED_SIDE_INPUT_JOIN; numEvents:10000000
0016 query:SESSION_SIDE_INPUT_JOIN; numEvents:10000000
Performance:
Conf Runtime(sec) (Baseline) Events(/sec) (Baseline) Results (Baseline)
0000 -1.0 -1.0 -1
*** Job was unexpectedly updated ***
0001 -1.0 -1.0 -1
*** Job was unexpectedly updated ***
0002 -1.0 -1.0 -1
*** Job was unexpectedly updated ***
0003 *** not run ***
0004 *** not run ***
0005 -1.0 -1.0 -1
*** Job was unexpectedly updated ***
0006 *** not run ***
0007 *** not run ***
0008 -1.0 -1.0 -1
*** Job was unexpectedly updated ***
0009 *** not run ***
0010 -1.0 -1.0 -1
*** Job was unexpectedly updated ***
0011 -1.0 -1.0 -1
*** Job was unexpectedly updated ***
0012 -1.0 -1.0 -1
*** Job was unexpectedly updated ***
0013 -1.0 -1.0 -1
*** Job was unexpectedly updated ***
0014 -1.0 -1.0 -1
*** Job was unexpectedly updated ***
0015 *** not run ***
0016 *** not run ***
==========================================================================================
==========================================================================================
Run started 2023-02-21T09:25:33.614Z and ran for PT347.824S
Default configuration:
{"debug":true,"query":null,"sourceType":"DIRECT","generateEventFilePathPrefix":null,"sinkType":"DEVNULL","exportSummaryToBigQuery":false,"pubSubMode":"COMBINED","pubsubMessageSerializationMethod":"CODER","sideInputType":"DIRECT","sideInputRowCount":500,"sideInputNumShards":3,"sideInputUrl":null,"sessionGap":600000,"numEvents":100000,"numEventGenerators":100,"rateShape":"SINE","firstEventRate":10000,"nextEventRate":10000,"rateUnit":"PER_SECOND","ratePeriodSec":600,"preloadSeconds":0,"streamTimeout":240,"isRateLimited":false,"useWallclockEventTime":false,"avgPersonByteSize":200,"avgAuctionByteSize":500,"avgBidByteSize":100,"hotAuctionRatio":2,"hotSellersRatio":4,"hotBiddersRatio":4,"windowSizeSec":10,"windowPeriodSec":5,"watermarkHoldbackSec":0,"numInFlightAuctions":100,"numActivePeople":1000,"coderStrategy":"HAND","cpuDelayMs":0,"diskBusyBytes":0,"auctionSkip":123,"fanout":5,"maxAuctionsWaitingTime":600,"occasionalDelaySec":3,"probDelayedEvent":0.1,"maxLogEvents":100000,"usePubsubPublishTime":false,"outOfOrderGroupSize":1,"numKeyBuckets":20000,"pardoCPUFactor":1.0}
Configurations:
Conf Description
0000 query:PASSTHROUGH; numEvents:10000000
0001 query:CURRENCY_CONVERSION; numEvents:10000000
0002 query:SELECTION; numEvents:10000000
0003 query:LOCAL_ITEM_SUGGESTION; numEvents:10000000
0004 query:AVERAGE_PRICE_FOR_CATEGORY; numEvents:1000000
0005 query:HOT_ITEMS; numEvents:10000000
0006 query:AVERAGE_SELLING_PRICE_BY_SELLER; numEvents:1000000
0007 query:HIGHEST_BID; numEvents:10000000
0008 query:MONITOR_NEW_USERS; numEvents:10000000
0009 query:WINNING_BIDS; numEvents:1000000
0010 query:LOG_TO_SHARDED_FILES; numEvents:10000000
0011 query:USER_SESSIONS; numEvents:10000000
0012 query:PROCESSING_TIME_WINDOWS; numEvents:10000000
0013 query:PORTABILITY_BATCH; numEvents:10000000
0014 query:RESHUFFLE; numEvents:10000000
0015 query:BOUNDED_SIDE_INPUT_JOIN; numEvents:10000000
0016 query:SESSION_SIDE_INPUT_JOIN; numEvents:10000000
Performance:
Conf Runtime(sec) (Baseline) Events(/sec) (Baseline) Results (Baseline)
0000 -1.0 -1.0 -1
*** Job was unexpectedly updated ***
0001 -1.0 -1.0 -1
*** Job was unexpectedly updated ***
0002 -1.0 -1.0 -1
*** Job was unexpectedly updated ***
0003 *** not run ***
0004 *** not run ***
0005 -1.0 -1.0 -1
*** Job was unexpectedly updated ***
0006 *** not run ***
0007 *** not run ***
0008 -1.0 -1.0 -1
*** Job was unexpectedly updated ***
0009 *** not run ***
0010 -1.0 -1.0 -1
*** Job was unexpectedly updated ***
0011 -1.0 -1.0 -1
*** Job was unexpectedly updated ***
0012 -1.0 -1.0 -1
*** Job was unexpectedly updated ***
0013 -1.0 -1.0 -1
*** Job was unexpectedly updated ***
0014 -1.0 -1.0 -1
*** Job was unexpectedly updated ***
0015 *** not run ***
0016 *** not run ***
==========================================================================================
Exception in thread "main" java.lang.RuntimeException: Execution was not successful
at org.apache.beam.sdk.nexmark.Main.runAll(Main.java:169)
at org.apache.beam.sdk.nexmark.Main.main(Main.java:441)
> Task :sdks:java:testing:nexmark:run FAILED
> Task :runners:google-cloud-dataflow-java:cleanUpDockerJavaImages
Untagged: us.gcr.io/apache-beam-testing/java-postcommit-it/java:20230221092446
Untagged: us.gcr.io/apache-beam-testing/java-postcommit-it/java@sha256:4738cb847954bae23068ec32da560bd7e5d72009910d6f9eda4529e35211ee5d
WARNING: Successfully resolved tag to sha256, but it is recommended to use sha256 directly.
Tag: [us.gcr.io/apache-beam-testing/java-postcommit-it/java:20230221092446]
- referencing digest: [us.gcr.io/apache-beam-testing/java-postcommit-it/java@sha256:4738cb847954bae23068ec32da560bd7e5d72009910d6f9eda4529e35211ee5d]
Deleted [[us.gcr.io/apache-beam-testing/java-postcommit-it/java:20230221092446] (referencing [us.gcr.io/apache-beam-testing/java-postcommit-it/java@sha256:4738cb847954bae23068ec32da560bd7e5d72009910d6f9eda4529e35211ee5d])].
Removing untagged image us.gcr.io/apache-beam-testing/java-postcommit-it/java@sha256:4738cb847954bae23068ec32da560bd7e5d72009910d6f9eda4529e35211ee5d
Digests:
- us.gcr.io/apache-beam-testing/java-postcommit-it/java@sha256:4738cb847954bae23068ec32da560bd7e5d72009910d6f9eda4529e35211ee5d
Deleted [us.gcr.io/apache-beam-testing/java-postcommit-it/java@sha256:4738cb847954bae23068ec32da560bd7e5d72009910d6f9eda4529e35211ee5d].
FAILURE: Build failed with an exception.
* What went wrong:
Execution failed for task ':sdks:java:testing:nexmark:run'.
> Process 'command '/usr/lib/jvm/java-8-openjdk-amd64/bin/java'' finished with non-zero exit value 1
* Try:
> Run with --stacktrace option to get the stack trace.
> Run with --info or --debug option to get more log output.
* Get more help at https://help.gradle.org
Deprecated Gradle features were used in this build, making it incompatible with Gradle 8.0.
You can use '--warning-mode all' to show the individual deprecation warnings and determine if they come from your own scripts or plugins.
See https://docs.gradle.org/7.5.1/userguide/command_line_interface.html#sec:command_line_warnings
Execution optimizations have been disabled for 1 invalid unit(s) of work during this build to ensure correctness.
Please consult deprecation warnings for more details.
BUILD FAILED in 6m 55s
140 actionable tasks: 94 executed, 42 from cache, 4 up-to-date
Publishing build scan...
https://gradle.com/s/wd52i5jpn75lm
Build step 'Invoke Gradle script' changed build result to FAILURE
Build step 'Invoke Gradle script' marked build as failure
---------------------------------------------------------------------
To unsubscribe, e-mail: builds-unsubscribe@beam.apache.org
For additional commands, e-mail: builds-help@beam.apache.org
Build failed in Jenkins: beam_PostCommit_Java_Nexmark_Dataflow_V2_Java17 #1704
Posted by Apache Jenkins Server <je...@builds.apache.org>.
See <https://ci-beam.apache.org/job/beam_PostCommit_Java_Nexmark_Dataflow_V2_Java17/1704/display/redirect?page=changes>
Changes:
[noreply] [prism] Add in element manager (#25565)
------------------------------------------
[...truncated 1.15 MB...]
0011 -1.0 -1.0 -1
*** Job was unexpectedly updated ***
0012 -1.0 -1.0 -1
*** Job was unexpectedly updated ***
0013 -1.0 -1.0 -1
*** Job was unexpectedly updated ***
0014 *** not run ***
0015 *** not run ***
0016 *** not run ***
==========================================================================================
Feb 21, 2023 3:31:09 AM org.apache.beam.sdk.testutils.metrics.MetricsReader getCounterMetric
SEVERE: Failed to get metric event.elements, from namespace Query14.Events
Feb 21, 2023 3:31:09 AM org.apache.beam.sdk.testutils.metrics.MetricsReader getCounterMetric
SEVERE: Failed to get metric event.bytes, from namespace Query14.Events
Feb 21, 2023 3:31:09 AM org.apache.beam.sdk.testutils.metrics.MetricsReader getCounterMetric
SEVERE: Failed to get metric result.elements, from namespace Query14.Results
Feb 21, 2023 3:31:09 AM org.apache.beam.sdk.testutils.metrics.MetricsReader getCounterMetric
SEVERE: Failed to get metric result.bytes, from namespace Query14.Results
==========================================================================================
Run started 2023-02-21T03:25:37.701Z and ran for PT331.703S
Default configuration:
{"debug":true,"query":null,"sourceType":"DIRECT","generateEventFilePathPrefix":null,"sinkType":"DEVNULL","exportSummaryToBigQuery":false,"pubSubMode":"COMBINED","pubsubMessageSerializationMethod":"CODER","sideInputType":"DIRECT","sideInputRowCount":500,"sideInputNumShards":3,"sideInputUrl":null,"sessionGap":600000,"numEvents":100000,"numEventGenerators":100,"rateShape":"SINE","firstEventRate":10000,"nextEventRate":10000,"rateUnit":"PER_SECOND","ratePeriodSec":600,"preloadSeconds":0,"streamTimeout":240,"isRateLimited":false,"useWallclockEventTime":false,"avgPersonByteSize":200,"avgAuctionByteSize":500,"avgBidByteSize":100,"hotAuctionRatio":2,"hotSellersRatio":4,"hotBiddersRatio":4,"windowSizeSec":10,"windowPeriodSec":5,"watermarkHoldbackSec":0,"numInFlightAuctions":100,"numActivePeople":1000,"coderStrategy":"HAND","cpuDelayMs":0,"diskBusyBytes":0,"auctionSkip":123,"fanout":5,"maxAuctionsWaitingTime":600,"occasionalDelaySec":3,"probDelayedEvent":0.1,"maxLogEvents":100000,"usePubsubPublishTime":false,"outOfOrderGroupSize":1,"numKeyBuckets":20000,"pardoCPUFactor":1.0}
Configurations:
Conf Description
0000 query:PASSTHROUGH; numEvents:10000000
0001 query:CURRENCY_CONVERSION; numEvents:10000000
0002 query:SELECTION; numEvents:10000000
0003 query:LOCAL_ITEM_SUGGESTION; numEvents:10000000
0004 query:AVERAGE_PRICE_FOR_CATEGORY; numEvents:1000000
0005 query:HOT_ITEMS; numEvents:10000000
0006 query:AVERAGE_SELLING_PRICE_BY_SELLER; numEvents:1000000
0007 query:HIGHEST_BID; numEvents:10000000
0008 query:MONITOR_NEW_USERS; numEvents:10000000
0009 query:WINNING_BIDS; numEvents:1000000
0010 query:LOG_TO_SHARDED_FILES; numEvents:10000000
0011 query:USER_SESSIONS; numEvents:10000000
0012 query:PROCESSING_TIME_WINDOWS; numEvents:10000000
0013 query:PORTABILITY_BATCH; numEvents:10000000
0014 query:RESHUFFLE; numEvents:10000000
0015 query:BOUNDED_SIDE_INPUT_JOIN; numEvents:10000000
0016 query:SESSION_SIDE_INPUT_JOIN; numEvents:10000000
Performance:
Conf Runtime(sec) (Baseline) Events(/sec) (Baseline) Results (Baseline)
0000 -1.0 -1.0 -1
*** Job was unexpectedly updated ***
0001 -1.0 -1.0 -1
*** Job was unexpectedly updated ***
0002 -1.0 -1.0 -1
*** Job was unexpectedly updated ***
0003 *** not run ***
0004 *** not run ***
0005 -1.0 -1.0 -1
*** Job was unexpectedly updated ***
0006 *** not run ***
0007 *** not run ***
0008 -1.0 -1.0 -1
*** Job was unexpectedly updated ***
0009 *** not run ***
0010 *** not run ***
0011 -1.0 -1.0 -1
*** Job was unexpectedly updated ***
0012 -1.0 -1.0 -1
*** Job was unexpectedly updated ***
0013 -1.0 -1.0 -1
*** Job was unexpectedly updated ***
0014 -1.0 -1.0 -1
*** Job was unexpectedly updated ***
0015 *** not run ***
0016 *** not run ***
==========================================================================================
2023-02-21T03:31:09.713Z FAILED Query10
Feb 21, 2023 3:31:09 AM org.apache.beam.sdk.testutils.metrics.MetricsReader getCounterMetric
SEVERE: Failed to get metric event.elements, from namespace Query10.Events
Feb 21, 2023 3:31:09 AM org.apache.beam.sdk.testutils.metrics.MetricsReader getCounterMetric
SEVERE: Failed to get metric event.bytes, from namespace Query10.Events
Feb 21, 2023 3:31:09 AM org.apache.beam.sdk.testutils.metrics.MetricsReader getCounterMetric
SEVERE: Failed to get metric result.elements, from namespace Query10.Results
Feb 21, 2023 3:31:09 AM org.apache.beam.sdk.testutils.metrics.MetricsReader getCounterMetric
SEVERE: Failed to get metric result.bytes, from namespace Query10.Results
==========================================================================================
Run started 2023-02-21T03:25:37.701Z and ran for PT332.051S
Default configuration:
{"debug":true,"query":null,"sourceType":"DIRECT","generateEventFilePathPrefix":null,"sinkType":"DEVNULL","exportSummaryToBigQuery":false,"pubSubMode":"COMBINED","pubsubMessageSerializationMethod":"CODER","sideInputType":"DIRECT","sideInputRowCount":500,"sideInputNumShards":3,"sideInputUrl":null,"sessionGap":600000,"numEvents":100000,"numEventGenerators":100,"rateShape":"SINE","firstEventRate":10000,"nextEventRate":10000,"rateUnit":"PER_SECOND","ratePeriodSec":600,"preloadSeconds":0,"streamTimeout":240,"isRateLimited":false,"useWallclockEventTime":false,"avgPersonByteSize":200,"avgAuctionByteSize":500,"avgBidByteSize":100,"hotAuctionRatio":2,"hotSellersRatio":4,"hotBiddersRatio":4,"windowSizeSec":10,"windowPeriodSec":5,"watermarkHoldbackSec":0,"numInFlightAuctions":100,"numActivePeople":1000,"coderStrategy":"HAND","cpuDelayMs":0,"diskBusyBytes":0,"auctionSkip":123,"fanout":5,"maxAuctionsWaitingTime":600,"occasionalDelaySec":3,"probDelayedEvent":0.1,"maxLogEvents":100000,"usePubsubPublishTime":false,"outOfOrderGroupSize":1,"numKeyBuckets":20000,"pardoCPUFactor":1.0}
Configurations:
Conf Description
0000 query:PASSTHROUGH; numEvents:10000000
0001 query:CURRENCY_CONVERSION; numEvents:10000000
0002 query:SELECTION; numEvents:10000000
0003 query:LOCAL_ITEM_SUGGESTION; numEvents:10000000
0004 query:AVERAGE_PRICE_FOR_CATEGORY; numEvents:1000000
0005 query:HOT_ITEMS; numEvents:10000000
0006 query:AVERAGE_SELLING_PRICE_BY_SELLER; numEvents:1000000
0007 query:HIGHEST_BID; numEvents:10000000
0008 query:MONITOR_NEW_USERS; numEvents:10000000
0009 query:WINNING_BIDS; numEvents:1000000
0010 query:LOG_TO_SHARDED_FILES; numEvents:10000000
0011 query:USER_SESSIONS; numEvents:10000000
0012 query:PROCESSING_TIME_WINDOWS; numEvents:10000000
0013 query:PORTABILITY_BATCH; numEvents:10000000
0014 query:RESHUFFLE; numEvents:10000000
0015 query:BOUNDED_SIDE_INPUT_JOIN; numEvents:10000000
0016 query:SESSION_SIDE_INPUT_JOIN; numEvents:10000000
Performance:
Conf Runtime(sec) (Baseline) Events(/sec) (Baseline) Results (Baseline)
0000 -1.0 -1.0 -1
*** Job was unexpectedly updated ***
0001 -1.0 -1.0 -1
*** Job was unexpectedly updated ***
0002 -1.0 -1.0 -1
*** Job was unexpectedly updated ***
0003 *** not run ***
0004 *** not run ***
0005 -1.0 -1.0 -1
*** Job was unexpectedly updated ***
0006 *** not run ***
0007 *** not run ***
0008 -1.0 -1.0 -1
*** Job was unexpectedly updated ***
0009 *** not run ***
0010 -1.0 -1.0 -1
*** Job was unexpectedly updated ***
0011 -1.0 -1.0 -1
*** Job was unexpectedly updated ***
0012 -1.0 -1.0 -1
*** Job was unexpectedly updated ***
0013 -1.0 -1.0 -1
*** Job was unexpectedly updated ***
0014 -1.0 -1.0 -1
*** Job was unexpectedly updated ***
0015 *** not run ***
0016 *** not run ***
==========================================================================================
==========================================================================================
Run started 2023-02-21T03:25:37.701Z and ran for PT332.356S
Default configuration:
{"debug":true,"query":null,"sourceType":"DIRECT","generateEventFilePathPrefix":null,"sinkType":"DEVNULL","exportSummaryToBigQuery":false,"pubSubMode":"COMBINED","pubsubMessageSerializationMethod":"CODER","sideInputType":"DIRECT","sideInputRowCount":500,"sideInputNumShards":3,"sideInputUrl":null,"sessionGap":600000,"numEvents":100000,"numEventGenerators":100,"rateShape":"SINE","firstEventRate":10000,"nextEventRate":10000,"rateUnit":"PER_SECOND","ratePeriodSec":600,"preloadSeconds":0,"streamTimeout":240,"isRateLimited":false,"useWallclockEventTime":false,"avgPersonByteSize":200,"avgAuctionByteSize":500,"avgBidByteSize":100,"hotAuctionRatio":2,"hotSellersRatio":4,"hotBiddersRatio":4,"windowSizeSec":10,"windowPeriodSec":5,"watermarkHoldbackSec":0,"numInFlightAuctions":100,"numActivePeople":1000,"coderStrategy":"HAND","cpuDelayMs":0,"diskBusyBytes":0,"auctionSkip":123,"fanout":5,"maxAuctionsWaitingTime":600,"occasionalDelaySec":3,"probDelayedEvent":0.1,"maxLogEvents":100000,"usePubsubPublishTime":false,"outOfOrderGroupSize":1,"numKeyBuckets":20000,"pardoCPUFactor":1.0}
Configurations:
Conf Description
0000 query:PASSTHROUGH; numEvents:10000000
0001 query:CURRENCY_CONVERSION; numEvents:10000000
0002 query:SELECTION; numEvents:10000000
0003 query:LOCAL_ITEM_SUGGESTION; numEvents:10000000
0004 query:AVERAGE_PRICE_FOR_CATEGORY; numEvents:1000000
0005 query:HOT_ITEMS; numEvents:10000000
0006 query:AVERAGE_SELLING_PRICE_BY_SELLER; numEvents:1000000
0007 query:HIGHEST_BID; numEvents:10000000
0008 query:MONITOR_NEW_USERS; numEvents:10000000
0009 query:WINNING_BIDS; numEvents:1000000
0010 query:LOG_TO_SHARDED_FILES; numEvents:10000000
0011 query:USER_SESSIONS; numEvents:10000000
0012 query:PROCESSING_TIME_WINDOWS; numEvents:10000000
0013 query:PORTABILITY_BATCH; numEvents:10000000
0014 query:RESHUFFLE; numEvents:10000000
0015 query:BOUNDED_SIDE_INPUT_JOIN; numEvents:10000000
0016 query:SESSION_SIDE_INPUT_JOIN; numEvents:10000000
Performance:
Conf Runtime(sec) (Baseline) Events(/sec) (Baseline) Results (Baseline)
0000 -1.0 -1.0 -1
*** Job was unexpectedly updated ***
0001 -1.0 -1.0 -1
*** Job was unexpectedly updated ***
0002 -1.0 -1.0 -1
*** Job was unexpectedly updated ***
0003 *** not run ***
0004 *** not run ***
0005 -1.0 -1.0 -1
*** Job was unexpectedly updated ***
0006 *** not run ***
0007 *** not run ***
0008 -1.0 -1.0 -1
*** Job was unexpectedly updated ***
0009 *** not run ***
0010 -1.0 -1.0 -1
*** Job was unexpectedly updated ***
0011 -1.0 -1.0 -1
*** Job was unexpectedly updated ***
0012 -1.0 -1.0 -1
*** Job was unexpectedly updated ***
0013 -1.0 -1.0 -1
*** Job was unexpectedly updated ***
0014 -1.0 -1.0 -1
*** Job was unexpectedly updated ***
0015 *** not run ***
0016 *** not run ***
==========================================================================================
Exception in thread "main" java.lang.RuntimeException: Execution was not successful
at org.apache.beam.sdk.nexmark.Main.runAll(Main.java:169)
at org.apache.beam.sdk.nexmark.Main.main(Main.java:441)
> Task :sdks:java:testing:nexmark:run FAILED
> Task :runners:google-cloud-dataflow-java:cleanUpDockerJavaImages
Untagged: us.gcr.io/apache-beam-testing/java-postcommit-it/java:20230221032450
Untagged: us.gcr.io/apache-beam-testing/java-postcommit-it/java@sha256:d4adae69b443c7d79bf4a71fcf2eae75242887fc10e8c239eabcbbb8e545e1d8
WARNING: Successfully resolved tag to sha256, but it is recommended to use sha256 directly.
Tag: [us.gcr.io/apache-beam-testing/java-postcommit-it/java:20230221032450]
- referencing digest: [us.gcr.io/apache-beam-testing/java-postcommit-it/java@sha256:d4adae69b443c7d79bf4a71fcf2eae75242887fc10e8c239eabcbbb8e545e1d8]
Deleted [[us.gcr.io/apache-beam-testing/java-postcommit-it/java:20230221032450] (referencing [us.gcr.io/apache-beam-testing/java-postcommit-it/java@sha256:d4adae69b443c7d79bf4a71fcf2eae75242887fc10e8c239eabcbbb8e545e1d8])].
Removing untagged image us.gcr.io/apache-beam-testing/java-postcommit-it/java@sha256:d4adae69b443c7d79bf4a71fcf2eae75242887fc10e8c239eabcbbb8e545e1d8
Digests:
- us.gcr.io/apache-beam-testing/java-postcommit-it/java@sha256:d4adae69b443c7d79bf4a71fcf2eae75242887fc10e8c239eabcbbb8e545e1d8
Deleted [us.gcr.io/apache-beam-testing/java-postcommit-it/java@sha256:d4adae69b443c7d79bf4a71fcf2eae75242887fc10e8c239eabcbbb8e545e1d8].
FAILURE: Build failed with an exception.
* What went wrong:
Execution failed for task ':sdks:java:testing:nexmark:run'.
> Process 'command '/usr/lib/jvm/java-8-openjdk-amd64/bin/java'' finished with non-zero exit value 1
* Try:
> Run with --stacktrace option to get the stack trace.
> Run with --info or --debug option to get more log output.
* Get more help at https://help.gradle.org
Deprecated Gradle features were used in this build, making it incompatible with Gradle 8.0.
You can use '--warning-mode all' to show the individual deprecation warnings and determine if they come from your own scripts or plugins.
See https://docs.gradle.org/7.5.1/userguide/command_line_interface.html#sec:command_line_warnings
Execution optimizations have been disabled for 1 invalid unit(s) of work during this build to ensure correctness.
Please consult deprecation warnings for more details.
BUILD FAILED in 6m 40s
140 actionable tasks: 94 executed, 42 from cache, 4 up-to-date
Publishing build scan...
https://gradle.com/s/zt7opzeaizoc2
Build step 'Invoke Gradle script' changed build result to FAILURE
Build step 'Invoke Gradle script' marked build as failure
---------------------------------------------------------------------
To unsubscribe, e-mail: builds-unsubscribe@beam.apache.org
For additional commands, e-mail: builds-help@beam.apache.org
Build failed in Jenkins: beam_PostCommit_Java_Nexmark_Dataflow_V2_Java17 #1703
Posted by Apache Jenkins Server <je...@builds.apache.org>.
See <https://ci-beam.apache.org/job/beam_PostCommit_Java_Nexmark_Dataflow_V2_Java17/1703/display/redirect?page=changes>
Changes:
[noreply] [#24789][prism] Add testdofns for later (#25557)
[noreply] [#24789][prism] Minimum required jobservices (#25556)
[noreply] [#24789][prism] Handlers for combine, ParDo, GBK, Flatten (#25558)
[noreply] [prism] Tiny lint fixes (#25564)
[noreply] minor error handling fixes (#25555)
------------------------------------------
[...truncated 1.15 MB...]
*** Job was unexpectedly updated ***
0012 -1.0 -1.0 -1
*** Job was unexpectedly updated ***
0013 -1.0 -1.0 -1
*** Job was unexpectedly updated ***
0014 *** not run ***
0015 *** not run ***
0016 *** not run ***
==========================================================================================
2023-02-20T21:31:56.608Z FAILED Query14
Feb 20, 2023 9:31:56 PM org.apache.beam.sdk.testutils.metrics.MetricsReader getCounterMetric
SEVERE: Failed to get metric event.elements, from namespace Query14.Events
Feb 20, 2023 9:31:56 PM org.apache.beam.sdk.testutils.metrics.MetricsReader getCounterMetric
SEVERE: Failed to get metric event.bytes, from namespace Query14.Events
Feb 20, 2023 9:31:56 PM org.apache.beam.sdk.testutils.metrics.MetricsReader getCounterMetric
SEVERE: Failed to get metric result.elements, from namespace Query14.Results
Feb 20, 2023 9:31:56 PM org.apache.beam.sdk.testutils.metrics.MetricsReader getCounterMetric
SEVERE: Failed to get metric result.bytes, from namespace Query14.Results
==========================================================================================
Run started 2023-02-20T21:26:24.148Z and ran for PT332.495S
Default configuration:
{"debug":true,"query":null,"sourceType":"DIRECT","generateEventFilePathPrefix":null,"sinkType":"DEVNULL","exportSummaryToBigQuery":false,"pubSubMode":"COMBINED","pubsubMessageSerializationMethod":"CODER","sideInputType":"DIRECT","sideInputRowCount":500,"sideInputNumShards":3,"sideInputUrl":null,"sessionGap":600000,"numEvents":100000,"numEventGenerators":100,"rateShape":"SINE","firstEventRate":10000,"nextEventRate":10000,"rateUnit":"PER_SECOND","ratePeriodSec":600,"preloadSeconds":0,"streamTimeout":240,"isRateLimited":false,"useWallclockEventTime":false,"avgPersonByteSize":200,"avgAuctionByteSize":500,"avgBidByteSize":100,"hotAuctionRatio":2,"hotSellersRatio":4,"hotBiddersRatio":4,"windowSizeSec":10,"windowPeriodSec":5,"watermarkHoldbackSec":0,"numInFlightAuctions":100,"numActivePeople":1000,"coderStrategy":"HAND","cpuDelayMs":0,"diskBusyBytes":0,"auctionSkip":123,"fanout":5,"maxAuctionsWaitingTime":600,"occasionalDelaySec":3,"probDelayedEvent":0.1,"maxLogEvents":100000,"usePubsubPublishTime":false,"outOfOrderGroupSize":1,"numKeyBuckets":20000,"pardoCPUFactor":1.0}
Configurations:
Conf Description
0000 query:PASSTHROUGH; numEvents:10000000
0001 query:CURRENCY_CONVERSION; numEvents:10000000
0002 query:SELECTION; numEvents:10000000
0003 query:LOCAL_ITEM_SUGGESTION; numEvents:10000000
0004 query:AVERAGE_PRICE_FOR_CATEGORY; numEvents:1000000
0005 query:HOT_ITEMS; numEvents:10000000
0006 query:AVERAGE_SELLING_PRICE_BY_SELLER; numEvents:1000000
0007 query:HIGHEST_BID; numEvents:10000000
0008 query:MONITOR_NEW_USERS; numEvents:10000000
0009 query:WINNING_BIDS; numEvents:1000000
0010 query:LOG_TO_SHARDED_FILES; numEvents:10000000
0011 query:USER_SESSIONS; numEvents:10000000
0012 query:PROCESSING_TIME_WINDOWS; numEvents:10000000
0013 query:PORTABILITY_BATCH; numEvents:10000000
0014 query:RESHUFFLE; numEvents:10000000
0015 query:BOUNDED_SIDE_INPUT_JOIN; numEvents:10000000
0016 query:SESSION_SIDE_INPUT_JOIN; numEvents:10000000
Performance:
Conf Runtime(sec) (Baseline) Events(/sec) (Baseline) Results (Baseline)
0000 -1.0 -1.0 -1
*** Job was unexpectedly updated ***
0001 -1.0 -1.0 -1
*** Job was unexpectedly updated ***
0002 -1.0 -1.0 -1
*** Job was unexpectedly updated ***
0003 *** not run ***
0004 *** not run ***
0005 -1.0 -1.0 -1
*** Job was unexpectedly updated ***
0006 *** not run ***
0007 *** not run ***
0008 *** not run ***
0009 *** not run ***
0010 -1.0 -1.0 -1
*** Job was unexpectedly updated ***
0011 -1.0 -1.0 -1
*** Job was unexpectedly updated ***
0012 -1.0 -1.0 -1
*** Job was unexpectedly updated ***
0013 -1.0 -1.0 -1
*** Job was unexpectedly updated ***
0014 -1.0 -1.0 -1
*** Job was unexpectedly updated ***
0015 *** not run ***
0016 *** not run ***
==========================================================================================
2023-02-20T21:31:56.712Z FAILED Query8
Feb 20, 2023 9:31:56 PM org.apache.beam.sdk.testutils.metrics.MetricsReader getCounterMetric
SEVERE: Failed to get metric event.elements, from namespace Query8.Events
Feb 20, 2023 9:31:56 PM org.apache.beam.sdk.testutils.metrics.MetricsReader getCounterMetric
SEVERE: Failed to get metric event.bytes, from namespace Query8.Events
Feb 20, 2023 9:31:56 PM org.apache.beam.sdk.testutils.metrics.MetricsReader getCounterMetric
SEVERE: Failed to get metric result.elements, from namespace Query8.Results
Feb 20, 2023 9:31:56 PM org.apache.beam.sdk.testutils.metrics.MetricsReader getCounterMetric
SEVERE: Failed to get metric result.bytes, from namespace Query8.Results
==========================================================================================
Run started 2023-02-20T21:26:24.148Z and ran for PT332.612S
Default configuration:
{"debug":true,"query":null,"sourceType":"DIRECT","generateEventFilePathPrefix":null,"sinkType":"DEVNULL","exportSummaryToBigQuery":false,"pubSubMode":"COMBINED","pubsubMessageSerializationMethod":"CODER","sideInputType":"DIRECT","sideInputRowCount":500,"sideInputNumShards":3,"sideInputUrl":null,"sessionGap":600000,"numEvents":100000,"numEventGenerators":100,"rateShape":"SINE","firstEventRate":10000,"nextEventRate":10000,"rateUnit":"PER_SECOND","ratePeriodSec":600,"preloadSeconds":0,"streamTimeout":240,"isRateLimited":false,"useWallclockEventTime":false,"avgPersonByteSize":200,"avgAuctionByteSize":500,"avgBidByteSize":100,"hotAuctionRatio":2,"hotSellersRatio":4,"hotBiddersRatio":4,"windowSizeSec":10,"windowPeriodSec":5,"watermarkHoldbackSec":0,"numInFlightAuctions":100,"numActivePeople":1000,"coderStrategy":"HAND","cpuDelayMs":0,"diskBusyBytes":0,"auctionSkip":123,"fanout":5,"maxAuctionsWaitingTime":600,"occasionalDelaySec":3,"probDelayedEvent":0.1,"maxLogEvents":100000,"usePubsubPublishTime":false,"outOfOrderGroupSize":1,"numKeyBuckets":20000,"pardoCPUFactor":1.0}
Configurations:
Conf Description
0000 query:PASSTHROUGH; numEvents:10000000
0001 query:CURRENCY_CONVERSION; numEvents:10000000
0002 query:SELECTION; numEvents:10000000
0003 query:LOCAL_ITEM_SUGGESTION; numEvents:10000000
0004 query:AVERAGE_PRICE_FOR_CATEGORY; numEvents:1000000
0005 query:HOT_ITEMS; numEvents:10000000
0006 query:AVERAGE_SELLING_PRICE_BY_SELLER; numEvents:1000000
0007 query:HIGHEST_BID; numEvents:10000000
0008 query:MONITOR_NEW_USERS; numEvents:10000000
0009 query:WINNING_BIDS; numEvents:1000000
0010 query:LOG_TO_SHARDED_FILES; numEvents:10000000
0011 query:USER_SESSIONS; numEvents:10000000
0012 query:PROCESSING_TIME_WINDOWS; numEvents:10000000
0013 query:PORTABILITY_BATCH; numEvents:10000000
0014 query:RESHUFFLE; numEvents:10000000
0015 query:BOUNDED_SIDE_INPUT_JOIN; numEvents:10000000
0016 query:SESSION_SIDE_INPUT_JOIN; numEvents:10000000
Performance:
Conf Runtime(sec) (Baseline) Events(/sec) (Baseline) Results (Baseline)
0000 -1.0 -1.0 -1
*** Job was unexpectedly updated ***
0001 -1.0 -1.0 -1
*** Job was unexpectedly updated ***
0002 -1.0 -1.0 -1
*** Job was unexpectedly updated ***
0003 *** not run ***
0004 *** not run ***
0005 -1.0 -1.0 -1
*** Job was unexpectedly updated ***
0006 *** not run ***
0007 *** not run ***
0008 -1.0 -1.0 -1
*** Job was unexpectedly updated ***
0009 *** not run ***
0010 -1.0 -1.0 -1
*** Job was unexpectedly updated ***
0011 -1.0 -1.0 -1
*** Job was unexpectedly updated ***
0012 -1.0 -1.0 -1
*** Job was unexpectedly updated ***
0013 -1.0 -1.0 -1
*** Job was unexpectedly updated ***
0014 -1.0 -1.0 -1
*** Job was unexpectedly updated ***
0015 *** not run ***
0016 *** not run ***
==========================================================================================
==========================================================================================
Run started 2023-02-20T21:26:24.148Z and ran for PT332.867S
Default configuration:
{"debug":true,"query":null,"sourceType":"DIRECT","generateEventFilePathPrefix":null,"sinkType":"DEVNULL","exportSummaryToBigQuery":false,"pubSubMode":"COMBINED","pubsubMessageSerializationMethod":"CODER","sideInputType":"DIRECT","sideInputRowCount":500,"sideInputNumShards":3,"sideInputUrl":null,"sessionGap":600000,"numEvents":100000,"numEventGenerators":100,"rateShape":"SINE","firstEventRate":10000,"nextEventRate":10000,"rateUnit":"PER_SECOND","ratePeriodSec":600,"preloadSeconds":0,"streamTimeout":240,"isRateLimited":false,"useWallclockEventTime":false,"avgPersonByteSize":200,"avgAuctionByteSize":500,"avgBidByteSize":100,"hotAuctionRatio":2,"hotSellersRatio":4,"hotBiddersRatio":4,"windowSizeSec":10,"windowPeriodSec":5,"watermarkHoldbackSec":0,"numInFlightAuctions":100,"numActivePeople":1000,"coderStrategy":"HAND","cpuDelayMs":0,"diskBusyBytes":0,"auctionSkip":123,"fanout":5,"maxAuctionsWaitingTime":600,"occasionalDelaySec":3,"probDelayedEvent":0.1,"maxLogEvents":100000,"usePubsubPublishTime":false,"outOfOrderGroupSize":1,"numKeyBuckets":20000,"pardoCPUFactor":1.0}
Configurations:
Conf Description
0000 query:PASSTHROUGH; numEvents:10000000
0001 query:CURRENCY_CONVERSION; numEvents:10000000
0002 query:SELECTION; numEvents:10000000
0003 query:LOCAL_ITEM_SUGGESTION; numEvents:10000000
0004 query:AVERAGE_PRICE_FOR_CATEGORY; numEvents:1000000
0005 query:HOT_ITEMS; numEvents:10000000
0006 query:AVERAGE_SELLING_PRICE_BY_SELLER; numEvents:1000000
0007 query:HIGHEST_BID; numEvents:10000000
0008 query:MONITOR_NEW_USERS; numEvents:10000000
0009 query:WINNING_BIDS; numEvents:1000000
0010 query:LOG_TO_SHARDED_FILES; numEvents:10000000
0011 query:USER_SESSIONS; numEvents:10000000
0012 query:PROCESSING_TIME_WINDOWS; numEvents:10000000
0013 query:PORTABILITY_BATCH; numEvents:10000000
0014 query:RESHUFFLE; numEvents:10000000
0015 query:BOUNDED_SIDE_INPUT_JOIN; numEvents:10000000
0016 query:SESSION_SIDE_INPUT_JOIN; numEvents:10000000
Performance:
Conf Runtime(sec) (Baseline) Events(/sec) (Baseline) Results (Baseline)
0000 -1.0 -1.0 -1
*** Job was unexpectedly updated ***
0001 -1.0 -1.0 -1
*** Job was unexpectedly updated ***
0002 -1.0 -1.0 -1
*** Job was unexpectedly updated ***
0003 *** not run ***
0004 *** not run ***
0005 -1.0 -1.0 -1
*** Job was unexpectedly updated ***
0006 *** not run ***
0007 *** not run ***
0008 -1.0 -1.0 -1
*** Job was unexpectedly updated ***
0009 *** not run ***
0010 -1.0 -1.0 -1
*** Job was unexpectedly updated ***
0011 -1.0 -1.0 -1
*** Job was unexpectedly updated ***
0012 -1.0 -1.0 -1
*** Job was unexpectedly updated ***
0013 -1.0 -1.0 -1
*** Job was unexpectedly updated ***
0014 -1.0 -1.0 -1
*** Job was unexpectedly updated ***
0015 *** not run ***
0016 *** not run ***
==========================================================================================
Exception in thread "main" java.lang.RuntimeException: Execution was not successful
at org.apache.beam.sdk.nexmark.Main.runAll(Main.java:169)
at org.apache.beam.sdk.nexmark.Main.main(Main.java:441)
> Task :sdks:java:testing:nexmark:run FAILED
> Task :runners:google-cloud-dataflow-java:cleanUpDockerJavaImages
Untagged: us.gcr.io/apache-beam-testing/java-postcommit-it/java:20230220212448
Untagged: us.gcr.io/apache-beam-testing/java-postcommit-it/java@sha256:0092ba0909b72846164e6965267423eba0375739645941f6b5bffe9d541050ee
WARNING: Successfully resolved tag to sha256, but it is recommended to use sha256 directly.
Tag: [us.gcr.io/apache-beam-testing/java-postcommit-it/java:20230220212448]
- referencing digest: [us.gcr.io/apache-beam-testing/java-postcommit-it/java@sha256:0092ba0909b72846164e6965267423eba0375739645941f6b5bffe9d541050ee]
Deleted [[us.gcr.io/apache-beam-testing/java-postcommit-it/java:20230220212448] (referencing [us.gcr.io/apache-beam-testing/java-postcommit-it/java@sha256:0092ba0909b72846164e6965267423eba0375739645941f6b5bffe9d541050ee])].
Removing untagged image us.gcr.io/apache-beam-testing/java-postcommit-it/java@sha256:0092ba0909b72846164e6965267423eba0375739645941f6b5bffe9d541050ee
Digests:
- us.gcr.io/apache-beam-testing/java-postcommit-it/java@sha256:0092ba0909b72846164e6965267423eba0375739645941f6b5bffe9d541050ee
Deleted [us.gcr.io/apache-beam-testing/java-postcommit-it/java@sha256:0092ba0909b72846164e6965267423eba0375739645941f6b5bffe9d541050ee].
FAILURE: Build failed with an exception.
* What went wrong:
Execution failed for task ':sdks:java:testing:nexmark:run'.
> Process 'command '/usr/lib/jvm/java-8-openjdk-amd64/bin/java'' finished with non-zero exit value 1
* Try:
> Run with --stacktrace option to get the stack trace.
> Run with --info or --debug option to get more log output.
* Get more help at https://help.gradle.org
Deprecated Gradle features were used in this build, making it incompatible with Gradle 8.0.
You can use '--warning-mode all' to show the individual deprecation warnings and determine if they come from your own scripts or plugins.
See https://docs.gradle.org/7.5.1/userguide/command_line_interface.html#sec:command_line_warnings
Execution optimizations have been disabled for 1 invalid unit(s) of work during this build to ensure correctness.
Please consult deprecation warnings for more details.
BUILD FAILED in 7m 28s
140 actionable tasks: 94 executed, 42 from cache, 4 up-to-date
Publishing build scan...
https://gradle.com/s/poxaozvf5pgfw
Build step 'Invoke Gradle script' changed build result to FAILURE
Build step 'Invoke Gradle script' marked build as failure
---------------------------------------------------------------------
To unsubscribe, e-mail: builds-unsubscribe@beam.apache.org
For additional commands, e-mail: builds-help@beam.apache.org
Build failed in Jenkins: beam_PostCommit_Java_Nexmark_Dataflow_V2_Java17 #1702
Posted by Apache Jenkins Server <je...@builds.apache.org>.
See <https://ci-beam.apache.org/job/beam_PostCommit_Java_Nexmark_Dataflow_V2_Java17/1702/display/redirect>
Changes:
------------------------------------------
[...truncated 1.16 MB...]
*** Job was unexpectedly updated ***
0012 *** not run ***
0013 -1.0 -1.0 -1
*** Job was unexpectedly updated ***
0014 -1.0 -1.0 -1
*** Job was unexpectedly updated ***
0015 *** not run ***
0016 *** not run ***
==========================================================================================
2023-02-20T15:59:03.253Z FAILED Query8
Feb 20, 2023 3:59:03 PM org.apache.beam.sdk.testutils.metrics.MetricsReader getCounterMetric
SEVERE: Failed to get metric event.elements, from namespace Query8.Events
Feb 20, 2023 3:59:03 PM org.apache.beam.sdk.testutils.metrics.MetricsReader getCounterMetric
SEVERE: Failed to get metric event.bytes, from namespace Query8.Events
Feb 20, 2023 3:59:03 PM org.apache.beam.sdk.testutils.metrics.MetricsReader getCounterMetric
SEVERE: Failed to get metric result.elements, from namespace Query8.Results
Feb 20, 2023 3:59:03 PM org.apache.beam.sdk.testutils.metrics.MetricsReader getCounterMetric
SEVERE: Failed to get metric result.bytes, from namespace Query8.Results
==========================================================================================
Run started 2023-02-20T15:53:13.908Z and ran for PT349.390S
Default configuration:
{"debug":true,"query":null,"sourceType":"DIRECT","generateEventFilePathPrefix":null,"sinkType":"DEVNULL","exportSummaryToBigQuery":false,"pubSubMode":"COMBINED","pubsubMessageSerializationMethod":"CODER","sideInputType":"DIRECT","sideInputRowCount":500,"sideInputNumShards":3,"sideInputUrl":null,"sessionGap":600000,"numEvents":100000,"numEventGenerators":100,"rateShape":"SINE","firstEventRate":10000,"nextEventRate":10000,"rateUnit":"PER_SECOND","ratePeriodSec":600,"preloadSeconds":0,"streamTimeout":240,"isRateLimited":false,"useWallclockEventTime":false,"avgPersonByteSize":200,"avgAuctionByteSize":500,"avgBidByteSize":100,"hotAuctionRatio":2,"hotSellersRatio":4,"hotBiddersRatio":4,"windowSizeSec":10,"windowPeriodSec":5,"watermarkHoldbackSec":0,"numInFlightAuctions":100,"numActivePeople":1000,"coderStrategy":"HAND","cpuDelayMs":0,"diskBusyBytes":0,"auctionSkip":123,"fanout":5,"maxAuctionsWaitingTime":600,"occasionalDelaySec":3,"probDelayedEvent":0.1,"maxLogEvents":100000,"usePubsubPublishTime":false,"outOfOrderGroupSize":1,"numKeyBuckets":20000,"pardoCPUFactor":1.0}
Configurations:
Conf Description
0000 query:PASSTHROUGH; numEvents:10000000
0001 query:CURRENCY_CONVERSION; numEvents:10000000
0002 query:SELECTION; numEvents:10000000
0003 query:LOCAL_ITEM_SUGGESTION; numEvents:10000000
0004 query:AVERAGE_PRICE_FOR_CATEGORY; numEvents:1000000
0005 query:HOT_ITEMS; numEvents:10000000
0006 query:AVERAGE_SELLING_PRICE_BY_SELLER; numEvents:1000000
0007 query:HIGHEST_BID; numEvents:10000000
0008 query:MONITOR_NEW_USERS; numEvents:10000000
0009 query:WINNING_BIDS; numEvents:1000000
0010 query:LOG_TO_SHARDED_FILES; numEvents:10000000
0011 query:USER_SESSIONS; numEvents:10000000
0012 query:PROCESSING_TIME_WINDOWS; numEvents:10000000
0013 query:PORTABILITY_BATCH; numEvents:10000000
0014 query:RESHUFFLE; numEvents:10000000
0015 query:BOUNDED_SIDE_INPUT_JOIN; numEvents:10000000
0016 query:SESSION_SIDE_INPUT_JOIN; numEvents:10000000
Performance:
Conf Runtime(sec) (Baseline) Events(/sec) (Baseline) Results (Baseline)
0000 -1.0 -1.0 -1
*** Job was unexpectedly updated ***
0001 -1.0 -1.0 -1
*** Job was unexpectedly updated ***
0002 -1.0 -1.0 -1
*** Job was unexpectedly updated ***
0003 *** not run ***
0004 *** not run ***
0005 -1.0 -1.0 -1
*** Job was unexpectedly updated ***
0006 *** not run ***
0007 *** not run ***
0008 -1.0 -1.0 -1
*** Job was unexpectedly updated ***
0009 *** not run ***
0010 -1.0 -1.0 -1
*** Job was unexpectedly updated ***
0011 -1.0 -1.0 -1
*** Job was unexpectedly updated ***
0012 *** not run ***
0013 -1.0 -1.0 -1
*** Job was unexpectedly updated ***
0014 -1.0 -1.0 -1
*** Job was unexpectedly updated ***
0015 *** not run ***
0016 *** not run ***
==========================================================================================
2023-02-20T15:59:03.401Z FAILED Query12
Feb 20, 2023 3:59:03 PM org.apache.beam.sdk.testutils.metrics.MetricsReader getCounterMetric
SEVERE: Failed to get metric event.elements, from namespace Query12.Events
Feb 20, 2023 3:59:03 PM org.apache.beam.sdk.testutils.metrics.MetricsReader getCounterMetric
SEVERE: Failed to get metric event.bytes, from namespace Query12.Events
Feb 20, 2023 3:59:03 PM org.apache.beam.sdk.testutils.metrics.MetricsReader getCounterMetric
SEVERE: Failed to get metric result.elements, from namespace Query12.Results
Feb 20, 2023 3:59:03 PM org.apache.beam.sdk.testutils.metrics.MetricsReader getCounterMetric
SEVERE: Failed to get metric result.bytes, from namespace Query12.Results
==========================================================================================
Run started 2023-02-20T15:53:13.908Z and ran for PT349.509S
Default configuration:
{"debug":true,"query":null,"sourceType":"DIRECT","generateEventFilePathPrefix":null,"sinkType":"DEVNULL","exportSummaryToBigQuery":false,"pubSubMode":"COMBINED","pubsubMessageSerializationMethod":"CODER","sideInputType":"DIRECT","sideInputRowCount":500,"sideInputNumShards":3,"sideInputUrl":null,"sessionGap":600000,"numEvents":100000,"numEventGenerators":100,"rateShape":"SINE","firstEventRate":10000,"nextEventRate":10000,"rateUnit":"PER_SECOND","ratePeriodSec":600,"preloadSeconds":0,"streamTimeout":240,"isRateLimited":false,"useWallclockEventTime":false,"avgPersonByteSize":200,"avgAuctionByteSize":500,"avgBidByteSize":100,"hotAuctionRatio":2,"hotSellersRatio":4,"hotBiddersRatio":4,"windowSizeSec":10,"windowPeriodSec":5,"watermarkHoldbackSec":0,"numInFlightAuctions":100,"numActivePeople":1000,"coderStrategy":"HAND","cpuDelayMs":0,"diskBusyBytes":0,"auctionSkip":123,"fanout":5,"maxAuctionsWaitingTime":600,"occasionalDelaySec":3,"probDelayedEvent":0.1,"maxLogEvents":100000,"usePubsubPublishTime":false,"outOfOrderGroupSize":1,"numKeyBuckets":20000,"pardoCPUFactor":1.0}
Configurations:
Conf Description
0000 query:PASSTHROUGH; numEvents:10000000
0001 query:CURRENCY_CONVERSION; numEvents:10000000
0002 query:SELECTION; numEvents:10000000
0003 query:LOCAL_ITEM_SUGGESTION; numEvents:10000000
0004 query:AVERAGE_PRICE_FOR_CATEGORY; numEvents:1000000
0005 query:HOT_ITEMS; numEvents:10000000
0006 query:AVERAGE_SELLING_PRICE_BY_SELLER; numEvents:1000000
0007 query:HIGHEST_BID; numEvents:10000000
0008 query:MONITOR_NEW_USERS; numEvents:10000000
0009 query:WINNING_BIDS; numEvents:1000000
0010 query:LOG_TO_SHARDED_FILES; numEvents:10000000
0011 query:USER_SESSIONS; numEvents:10000000
0012 query:PROCESSING_TIME_WINDOWS; numEvents:10000000
0013 query:PORTABILITY_BATCH; numEvents:10000000
0014 query:RESHUFFLE; numEvents:10000000
0015 query:BOUNDED_SIDE_INPUT_JOIN; numEvents:10000000
0016 query:SESSION_SIDE_INPUT_JOIN; numEvents:10000000
Performance:
Conf Runtime(sec) (Baseline) Events(/sec) (Baseline) Results (Baseline)
0000 -1.0 -1.0 -1
*** Job was unexpectedly updated ***
0001 -1.0 -1.0 -1
*** Job was unexpectedly updated ***
0002 -1.0 -1.0 -1
*** Job was unexpectedly updated ***
0003 *** not run ***
0004 *** not run ***
0005 -1.0 -1.0 -1
*** Job was unexpectedly updated ***
0006 *** not run ***
0007 *** not run ***
0008 -1.0 -1.0 -1
*** Job was unexpectedly updated ***
0009 *** not run ***
0010 -1.0 -1.0 -1
*** Job was unexpectedly updated ***
0011 -1.0 -1.0 -1
*** Job was unexpectedly updated ***
0012 -1.0 -1.0 -1
*** Job was unexpectedly updated ***
0013 -1.0 -1.0 -1
*** Job was unexpectedly updated ***
0014 -1.0 -1.0 -1
*** Job was unexpectedly updated ***
0015 *** not run ***
0016 *** not run ***
==========================================================================================
==========================================================================================
Run started 2023-02-20T15:53:13.908Z and ran for PT349.756S
Default configuration:
{"debug":true,"query":null,"sourceType":"DIRECT","generateEventFilePathPrefix":null,"sinkType":"DEVNULL","exportSummaryToBigQuery":false,"pubSubMode":"COMBINED","pubsubMessageSerializationMethod":"CODER","sideInputType":"DIRECT","sideInputRowCount":500,"sideInputNumShards":3,"sideInputUrl":null,"sessionGap":600000,"numEvents":100000,"numEventGenerators":100,"rateShape":"SINE","firstEventRate":10000,"nextEventRate":10000,"rateUnit":"PER_SECOND","ratePeriodSec":600,"preloadSeconds":0,"streamTimeout":240,"isRateLimited":false,"useWallclockEventTime":false,"avgPersonByteSize":200,"avgAuctionByteSize":500,"avgBidByteSize":100,"hotAuctionRatio":2,"hotSellersRatio":4,"hotBiddersRatio":4,"windowSizeSec":10,"windowPeriodSec":5,"watermarkHoldbackSec":0,"numInFlightAuctions":100,"numActivePeople":1000,"coderStrategy":"HAND","cpuDelayMs":0,"diskBusyBytes":0,"auctionSkip":123,"fanout":5,"maxAuctionsWaitingTime":600,"occasionalDelaySec":3,"probDelayedEvent":0.1,"maxLogEvents":100000,"usePubsubPublishTime":false,"outOfOrderGroupSize":1,"numKeyBuckets":20000,"pardoCPUFactor":1.0}
Configurations:
Conf Description
0000 query:PASSTHROUGH; numEvents:10000000
0001 query:CURRENCY_CONVERSION; numEvents:10000000
0002 query:SELECTION; numEvents:10000000
0003 query:LOCAL_ITEM_SUGGESTION; numEvents:10000000
0004 query:AVERAGE_PRICE_FOR_CATEGORY; numEvents:1000000
0005 query:HOT_ITEMS; numEvents:10000000
0006 query:AVERAGE_SELLING_PRICE_BY_SELLER; numEvents:1000000
0007 query:HIGHEST_BID; numEvents:10000000
0008 query:MONITOR_NEW_USERS; numEvents:10000000
0009 query:WINNING_BIDS; numEvents:1000000
0010 query:LOG_TO_SHARDED_FILES; numEvents:10000000
0011 query:USER_SESSIONS; numEvents:10000000
0012 query:PROCESSING_TIME_WINDOWS; numEvents:10000000
0013 query:PORTABILITY_BATCH; numEvents:10000000
0014 query:RESHUFFLE; numEvents:10000000
0015 query:BOUNDED_SIDE_INPUT_JOIN; numEvents:10000000
0016 query:SESSION_SIDE_INPUT_JOIN; numEvents:10000000
Performance:
Conf Runtime(sec) (Baseline) Events(/sec) (Baseline) Results (Baseline)
0000 -1.0 -1.0 -1
*** Job was unexpectedly updated ***
0001 -1.0 -1.0 -1
*** Job was unexpectedly updated ***
0002 -1.0 -1.0 -1
*** Job was unexpectedly updated ***
0003 *** not run ***
0004 *** not run ***
0005 -1.0 -1.0 -1
*** Job was unexpectedly updated ***
0006 *** not run ***
0007 *** not run ***
0008 -1.0 -1.0 -1
*** Job was unexpectedly updated ***
0009 *** not run ***
0010 -1.0 -1.0 -1
*** Job was unexpectedly updated ***
0011 -1.0 -1.0 -1
*** Job was unexpectedly updated ***
0012 -1.0 -1.0 -1
*** Job was unexpectedly updated ***
0013 -1.0 -1.0 -1
*** Job was unexpectedly updated ***
0014 -1.0 -1.0 -1
*** Job was unexpectedly updated ***
0015 *** not run ***
0016 *** not run ***
==========================================================================================
Exception in thread "main" java.lang.RuntimeException: Execution was not successful
at org.apache.beam.sdk.nexmark.Main.runAll(Main.java:169)
at org.apache.beam.sdk.nexmark.Main.main(Main.java:441)
> Task :sdks:java:testing:nexmark:run FAILED
> Task :runners:google-cloud-dataflow-java:cleanUpDockerJavaImages
Untagged: us.gcr.io/apache-beam-testing/java-postcommit-it/java:20230220155217
Untagged: us.gcr.io/apache-beam-testing/java-postcommit-it/java@sha256:109a5c00d3ff47b3092a55afebd5d9138e4b45e6c0009b3839d35f0b227e0e2f
WARNING: Successfully resolved tag to sha256, but it is recommended to use sha256 directly.
Tag: [us.gcr.io/apache-beam-testing/java-postcommit-it/java:20230220155217]
- referencing digest: [us.gcr.io/apache-beam-testing/java-postcommit-it/java@sha256:109a5c00d3ff47b3092a55afebd5d9138e4b45e6c0009b3839d35f0b227e0e2f]
Deleted [[us.gcr.io/apache-beam-testing/java-postcommit-it/java:20230220155217] (referencing [us.gcr.io/apache-beam-testing/java-postcommit-it/java@sha256:109a5c00d3ff47b3092a55afebd5d9138e4b45e6c0009b3839d35f0b227e0e2f])].
Removing untagged image us.gcr.io/apache-beam-testing/java-postcommit-it/java@sha256:109a5c00d3ff47b3092a55afebd5d9138e4b45e6c0009b3839d35f0b227e0e2f
Digests:
- us.gcr.io/apache-beam-testing/java-postcommit-it/java@sha256:109a5c00d3ff47b3092a55afebd5d9138e4b45e6c0009b3839d35f0b227e0e2f
Deleted [us.gcr.io/apache-beam-testing/java-postcommit-it/java@sha256:109a5c00d3ff47b3092a55afebd5d9138e4b45e6c0009b3839d35f0b227e0e2f].
FAILURE: Build failed with an exception.
* What went wrong:
Execution failed for task ':sdks:java:testing:nexmark:run'.
> Process 'command '/usr/lib/jvm/java-8-openjdk-amd64/bin/java'' finished with non-zero exit value 1
* Try:
> Run with --stacktrace option to get the stack trace.
> Run with --info or --debug option to get more log output.
* Get more help at https://help.gradle.org
Deprecated Gradle features were used in this build, making it incompatible with Gradle 8.0.
You can use '--warning-mode all' to show the individual deprecation warnings and determine if they come from your own scripts or plugins.
See https://docs.gradle.org/7.5.1/userguide/command_line_interface.html#sec:command_line_warnings
Execution optimizations have been disabled for 1 invalid unit(s) of work during this build to ensure correctness.
Please consult deprecation warnings for more details.
BUILD FAILED in 7m 8s
140 actionable tasks: 94 executed, 42 from cache, 4 up-to-date
Publishing build scan...
https://gradle.com/s/2pqqcw6liunm6
Build step 'Invoke Gradle script' changed build result to FAILURE
Build step 'Invoke Gradle script' marked build as failure
---------------------------------------------------------------------
To unsubscribe, e-mail: builds-unsubscribe@beam.apache.org
For additional commands, e-mail: builds-help@beam.apache.org
Build failed in Jenkins: beam_PostCommit_Java_Nexmark_Dataflow_V2_Java17 #1701
Posted by Apache Jenkins Server <je...@builds.apache.org>.
See <https://ci-beam.apache.org/job/beam_PostCommit_Java_Nexmark_Dataflow_V2_Java17/1701/display/redirect?page=changes>
Changes:
[noreply] Bump github.com/tetratelabs/wazero from 1.0.0-pre.7 to 1.0.0-pre.9 in
------------------------------------------
[...truncated 1.26 MB...]
*** Job was unexpectedly updated ***
0012 -1.0 -1.0 -1
*** Job was unexpectedly updated ***
0013 *** not run ***
0014 -1.0 -1.0 -1
*** Job was unexpectedly updated ***
0015 *** not run ***
0016 *** not run ***
==========================================================================================
2023-02-20T09:31:29.777Z FAILED Query13
2023-02-20T09:31:29.785Z FAILED Query10
Feb 20, 2023 9:31:29 AM org.apache.beam.sdk.testutils.metrics.MetricsReader getCounterMetric
SEVERE: Failed to get metric event.elements, from namespace Query10.Events
Feb 20, 2023 9:31:29 AM org.apache.beam.sdk.testutils.metrics.MetricsReader getCounterMetric
SEVERE: Failed to get metric event.bytes, from namespace Query10.Events
Feb 20, 2023 9:31:29 AM org.apache.beam.sdk.testutils.metrics.MetricsReader getCounterMetric
SEVERE: Failed to get metric result.elements, from namespace Query10.Results
Feb 20, 2023 9:31:29 AM org.apache.beam.sdk.testutils.metrics.MetricsReader getCounterMetric
SEVERE: Failed to get metric result.bytes, from namespace Query10.Results
==========================================================================================
Run started 2023-02-20T09:25:40.524Z and ran for PT349.298S
Default configuration:
{"debug":true,"query":null,"sourceType":"DIRECT","generateEventFilePathPrefix":null,"sinkType":"DEVNULL","exportSummaryToBigQuery":false,"pubSubMode":"COMBINED","pubsubMessageSerializationMethod":"CODER","sideInputType":"DIRECT","sideInputRowCount":500,"sideInputNumShards":3,"sideInputUrl":null,"sessionGap":600000,"numEvents":100000,"numEventGenerators":100,"rateShape":"SINE","firstEventRate":10000,"nextEventRate":10000,"rateUnit":"PER_SECOND","ratePeriodSec":600,"preloadSeconds":0,"streamTimeout":240,"isRateLimited":false,"useWallclockEventTime":false,"avgPersonByteSize":200,"avgAuctionByteSize":500,"avgBidByteSize":100,"hotAuctionRatio":2,"hotSellersRatio":4,"hotBiddersRatio":4,"windowSizeSec":10,"windowPeriodSec":5,"watermarkHoldbackSec":0,"numInFlightAuctions":100,"numActivePeople":1000,"coderStrategy":"HAND","cpuDelayMs":0,"diskBusyBytes":0,"auctionSkip":123,"fanout":5,"maxAuctionsWaitingTime":600,"occasionalDelaySec":3,"probDelayedEvent":0.1,"maxLogEvents":100000,"usePubsubPublishTime":false,"outOfOrderGroupSize":1,"numKeyBuckets":20000,"pardoCPUFactor":1.0}
Configurations:
Conf Description
0000 query:PASSTHROUGH; numEvents:10000000
0001 query:CURRENCY_CONVERSION; numEvents:10000000
0002 query:SELECTION; numEvents:10000000
0003 query:LOCAL_ITEM_SUGGESTION; numEvents:10000000
0004 query:AVERAGE_PRICE_FOR_CATEGORY; numEvents:1000000
0005 query:HOT_ITEMS; numEvents:10000000
0006 query:AVERAGE_SELLING_PRICE_BY_SELLER; numEvents:1000000
0007 query:HIGHEST_BID; numEvents:10000000
0008 query:MONITOR_NEW_USERS; numEvents:10000000
0009 query:WINNING_BIDS; numEvents:1000000
0010 query:LOG_TO_SHARDED_FILES; numEvents:10000000
0011 query:USER_SESSIONS; numEvents:10000000
0012 query:PROCESSING_TIME_WINDOWS; numEvents:10000000
0013 query:PORTABILITY_BATCH; numEvents:10000000
0014 query:RESHUFFLE; numEvents:10000000
0015 query:BOUNDED_SIDE_INPUT_JOIN; numEvents:10000000
0016 query:SESSION_SIDE_INPUT_JOIN; numEvents:10000000
Performance:
Conf Runtime(sec) (Baseline) Events(/sec) (Baseline) Results (Baseline)
0000 -1.0 -1.0 -1
*** Job was unexpectedly updated ***
0001 -1.0 -1.0 -1
*** Job was unexpectedly updated ***
0002 -1.0 -1.0 -1
*** Job was unexpectedly updated ***
0003 *** not run ***
0004 *** not run ***
0005 -1.0 -1.0 -1
*** Job was unexpectedly updated ***
0006 *** not run ***
0007 *** not run ***
0008 -1.0 -1.0 -1
*** Job was unexpectedly updated ***
0009 *** not run ***
0010 -1.0 -1.0 -1
*** Job was unexpectedly updated ***
0011 -1.0 -1.0 -1
*** Job was unexpectedly updated ***
0012 -1.0 -1.0 -1
*** Job was unexpectedly updated ***
0013 *** not run ***
0014 -1.0 -1.0 -1
*** Job was unexpectedly updated ***
0015 *** not run ***
0016 *** not run ***
==========================================================================================
Feb 20, 2023 9:31:29 AM org.apache.beam.sdk.testutils.metrics.MetricsReader getCounterMetric
SEVERE: Failed to get metric event.elements, from namespace Query13.Events
Feb 20, 2023 9:31:29 AM org.apache.beam.sdk.testutils.metrics.MetricsReader getCounterMetric
SEVERE: Failed to get metric event.bytes, from namespace Query13.Events
Feb 20, 2023 9:31:29 AM org.apache.beam.sdk.testutils.metrics.MetricsReader getCounterMetric
SEVERE: Failed to get metric result.elements, from namespace Query13.Results
Feb 20, 2023 9:31:29 AM org.apache.beam.sdk.testutils.metrics.MetricsReader getCounterMetric
SEVERE: Failed to get metric result.bytes, from namespace Query13.Results
==========================================================================================
Run started 2023-02-20T09:25:40.524Z and ran for PT349.311S
Default configuration:
{"debug":true,"query":null,"sourceType":"DIRECT","generateEventFilePathPrefix":null,"sinkType":"DEVNULL","exportSummaryToBigQuery":false,"pubSubMode":"COMBINED","pubsubMessageSerializationMethod":"CODER","sideInputType":"DIRECT","sideInputRowCount":500,"sideInputNumShards":3,"sideInputUrl":null,"sessionGap":600000,"numEvents":100000,"numEventGenerators":100,"rateShape":"SINE","firstEventRate":10000,"nextEventRate":10000,"rateUnit":"PER_SECOND","ratePeriodSec":600,"preloadSeconds":0,"streamTimeout":240,"isRateLimited":false,"useWallclockEventTime":false,"avgPersonByteSize":200,"avgAuctionByteSize":500,"avgBidByteSize":100,"hotAuctionRatio":2,"hotSellersRatio":4,"hotBiddersRatio":4,"windowSizeSec":10,"windowPeriodSec":5,"watermarkHoldbackSec":0,"numInFlightAuctions":100,"numActivePeople":1000,"coderStrategy":"HAND","cpuDelayMs":0,"diskBusyBytes":0,"auctionSkip":123,"fanout":5,"maxAuctionsWaitingTime":600,"occasionalDelaySec":3,"probDelayedEvent":0.1,"maxLogEvents":100000,"usePubsubPublishTime":false,"outOfOrderGroupSize":1,"numKeyBuckets":20000,"pardoCPUFactor":1.0}
Configurations:
Conf Description
0000 query:PASSTHROUGH; numEvents:10000000
0001 query:CURRENCY_CONVERSION; numEvents:10000000
0002 query:SELECTION; numEvents:10000000
0003 query:LOCAL_ITEM_SUGGESTION; numEvents:10000000
0004 query:AVERAGE_PRICE_FOR_CATEGORY; numEvents:1000000
0005 query:HOT_ITEMS; numEvents:10000000
0006 query:AVERAGE_SELLING_PRICE_BY_SELLER; numEvents:1000000
0007 query:HIGHEST_BID; numEvents:10000000
0008 query:MONITOR_NEW_USERS; numEvents:10000000
0009 query:WINNING_BIDS; numEvents:1000000
0010 query:LOG_TO_SHARDED_FILES; numEvents:10000000
0011 query:USER_SESSIONS; numEvents:10000000
0012 query:PROCESSING_TIME_WINDOWS; numEvents:10000000
0013 query:PORTABILITY_BATCH; numEvents:10000000
0014 query:RESHUFFLE; numEvents:10000000
0015 query:BOUNDED_SIDE_INPUT_JOIN; numEvents:10000000
0016 query:SESSION_SIDE_INPUT_JOIN; numEvents:10000000
Performance:
Conf Runtime(sec) (Baseline) Events(/sec) (Baseline) Results (Baseline)
0000 -1.0 -1.0 -1
*** Job was unexpectedly updated ***
0001 -1.0 -1.0 -1
*** Job was unexpectedly updated ***
0002 -1.0 -1.0 -1
*** Job was unexpectedly updated ***
0003 *** not run ***
0004 *** not run ***
0005 -1.0 -1.0 -1
*** Job was unexpectedly updated ***
0006 *** not run ***
0007 *** not run ***
0008 -1.0 -1.0 -1
*** Job was unexpectedly updated ***
0009 *** not run ***
0010 -1.0 -1.0 -1
*** Job was unexpectedly updated ***
0011 -1.0 -1.0 -1
*** Job was unexpectedly updated ***
0012 -1.0 -1.0 -1
*** Job was unexpectedly updated ***
0013 -1.0 -1.0 -1
*** Job was unexpectedly updated ***
0014 -1.0 -1.0 -1
*** Job was unexpectedly updated ***
0015 *** not run ***
0016 *** not run ***
==========================================================================================
==========================================================================================
Run started 2023-02-20T09:25:40.524Z and ran for PT349.631S
Default configuration:
{"debug":true,"query":null,"sourceType":"DIRECT","generateEventFilePathPrefix":null,"sinkType":"DEVNULL","exportSummaryToBigQuery":false,"pubSubMode":"COMBINED","pubsubMessageSerializationMethod":"CODER","sideInputType":"DIRECT","sideInputRowCount":500,"sideInputNumShards":3,"sideInputUrl":null,"sessionGap":600000,"numEvents":100000,"numEventGenerators":100,"rateShape":"SINE","firstEventRate":10000,"nextEventRate":10000,"rateUnit":"PER_SECOND","ratePeriodSec":600,"preloadSeconds":0,"streamTimeout":240,"isRateLimited":false,"useWallclockEventTime":false,"avgPersonByteSize":200,"avgAuctionByteSize":500,"avgBidByteSize":100,"hotAuctionRatio":2,"hotSellersRatio":4,"hotBiddersRatio":4,"windowSizeSec":10,"windowPeriodSec":5,"watermarkHoldbackSec":0,"numInFlightAuctions":100,"numActivePeople":1000,"coderStrategy":"HAND","cpuDelayMs":0,"diskBusyBytes":0,"auctionSkip":123,"fanout":5,"maxAuctionsWaitingTime":600,"occasionalDelaySec":3,"probDelayedEvent":0.1,"maxLogEvents":100000,"usePubsubPublishTime":false,"outOfOrderGroupSize":1,"numKeyBuckets":20000,"pardoCPUFactor":1.0}
Configurations:
Conf Description
0000 query:PASSTHROUGH; numEvents:10000000
0001 query:CURRENCY_CONVERSION; numEvents:10000000
0002 query:SELECTION; numEvents:10000000
0003 query:LOCAL_ITEM_SUGGESTION; numEvents:10000000
0004 query:AVERAGE_PRICE_FOR_CATEGORY; numEvents:1000000
0005 query:HOT_ITEMS; numEvents:10000000
0006 query:AVERAGE_SELLING_PRICE_BY_SELLER; numEvents:1000000
0007 query:HIGHEST_BID; numEvents:10000000
0008 query:MONITOR_NEW_USERS; numEvents:10000000
0009 query:WINNING_BIDS; numEvents:1000000
0010 query:LOG_TO_SHARDED_FILES; numEvents:10000000
0011 query:USER_SESSIONS; numEvents:10000000
0012 query:PROCESSING_TIME_WINDOWS; numEvents:10000000
0013 query:PORTABILITY_BATCH; numEvents:10000000
0014 query:RESHUFFLE; numEvents:10000000
0015 query:BOUNDED_SIDE_INPUT_JOIN; numEvents:10000000
0016 query:SESSION_SIDE_INPUT_JOIN; numEvents:10000000
Performance:
Conf Runtime(sec) (Baseline) Events(/sec) (Baseline) Results (Baseline)
0000 -1.0 -1.0 -1
*** Job was unexpectedly updated ***
0001 -1.0 -1.0 -1
*** Job was unexpectedly updated ***
0002 -1.0 -1.0 -1
*** Job was unexpectedly updated ***
0003 *** not run ***
0004 *** not run ***
0005 -1.0 -1.0 -1
*** Job was unexpectedly updated ***
0006 *** not run ***
0007 *** not run ***
0008 -1.0 -1.0 -1
*** Job was unexpectedly updated ***
0009 *** not run ***
0010 -1.0 -1.0 -1
*** Job was unexpectedly updated ***
0011 -1.0 -1.0 -1
*** Job was unexpectedly updated ***
0012 -1.0 -1.0 -1
*** Job was unexpectedly updated ***
0013 -1.0 -1.0 -1
*** Job was unexpectedly updated ***
0014 -1.0 -1.0 -1
*** Job was unexpectedly updated ***
0015 *** not run ***
0016 *** not run ***
==========================================================================================
Exception in thread "main" java.lang.RuntimeException: Execution was not successful
at org.apache.beam.sdk.nexmark.Main.runAll(Main.java:169)
at org.apache.beam.sdk.nexmark.Main.main(Main.java:441)
> Task :sdks:java:testing:nexmark:run FAILED
> Task :runners:google-cloud-dataflow-java:cleanUpDockerJavaImages
Untagged: us.gcr.io/apache-beam-testing/java-postcommit-it/java:20230220092449
Untagged: us.gcr.io/apache-beam-testing/java-postcommit-it/java@sha256:7338aaa2567f6cc3d3a1f52fdda51577d06ae80e93db8b15c57dc5f34ca11288
WARNING: Successfully resolved tag to sha256, but it is recommended to use sha256 directly.
Tag: [us.gcr.io/apache-beam-testing/java-postcommit-it/java:20230220092449]
- referencing digest: [us.gcr.io/apache-beam-testing/java-postcommit-it/java@sha256:7338aaa2567f6cc3d3a1f52fdda51577d06ae80e93db8b15c57dc5f34ca11288]
Deleted [[us.gcr.io/apache-beam-testing/java-postcommit-it/java:20230220092449] (referencing [us.gcr.io/apache-beam-testing/java-postcommit-it/java@sha256:7338aaa2567f6cc3d3a1f52fdda51577d06ae80e93db8b15c57dc5f34ca11288])].
Removing untagged image us.gcr.io/apache-beam-testing/java-postcommit-it/java@sha256:7338aaa2567f6cc3d3a1f52fdda51577d06ae80e93db8b15c57dc5f34ca11288
Digests:
- us.gcr.io/apache-beam-testing/java-postcommit-it/java@sha256:7338aaa2567f6cc3d3a1f52fdda51577d06ae80e93db8b15c57dc5f34ca11288
Deleted [us.gcr.io/apache-beam-testing/java-postcommit-it/java@sha256:7338aaa2567f6cc3d3a1f52fdda51577d06ae80e93db8b15c57dc5f34ca11288].
FAILURE: Build failed with an exception.
* What went wrong:
Execution failed for task ':sdks:java:testing:nexmark:run'.
> Process 'command '/usr/lib/jvm/java-8-openjdk-amd64/bin/java'' finished with non-zero exit value 1
* Try:
> Run with --stacktrace option to get the stack trace.
> Run with --info or --debug option to get more log output.
* Get more help at https://help.gradle.org
Deprecated Gradle features were used in this build, making it incompatible with Gradle 8.0.
You can use '--warning-mode all' to show the individual deprecation warnings and determine if they come from your own scripts or plugins.
See https://docs.gradle.org/7.5.1/userguide/command_line_interface.html#sec:command_line_warnings
Execution optimizations have been disabled for 1 invalid unit(s) of work during this build to ensure correctness.
Please consult deprecation warnings for more details.
BUILD FAILED in 7m
140 actionable tasks: 94 executed, 42 from cache, 4 up-to-date
Publishing build scan...
https://gradle.com/s/2z2j6bquzzhj4
Build step 'Invoke Gradle script' changed build result to FAILURE
Build step 'Invoke Gradle script' marked build as failure
---------------------------------------------------------------------
To unsubscribe, e-mail: builds-unsubscribe@beam.apache.org
For additional commands, e-mail: builds-help@beam.apache.org
Build failed in Jenkins: beam_PostCommit_Java_Nexmark_Dataflow_V2_Java17 #1700
Posted by Apache Jenkins Server <je...@builds.apache.org>.
See <https://ci-beam.apache.org/job/beam_PostCommit_Java_Nexmark_Dataflow_V2_Java17/1700/display/redirect?page=changes>
Changes:
[noreply] [Go SDK]: Retrieve file size in CreateInitialRestriction in textio.Read
[noreply] [#24789][prism] internal/worker + tentative data (#25478)
[noreply] [#24789][prism] add preprocessor and test (#25520)
------------------------------------------
[...truncated 1.30 MB...]
0011 *** not run ***
0012 -1.0 -1.0 -1
*** Job was unexpectedly updated ***
0013 *** not run ***
0014 -1.0 -1.0 -1
*** Job was unexpectedly updated ***
0015 *** not run ***
0016 *** not run ***
==========================================================================================
2023-02-20T03:32:01.411Z FAILED Query13
Feb 20, 2023 3:32:01 AM org.apache.beam.sdk.testutils.metrics.MetricsReader getCounterMetric
SEVERE: Failed to get metric event.elements, from namespace Query13.Events
Feb 20, 2023 3:32:01 AM org.apache.beam.sdk.testutils.metrics.MetricsReader getCounterMetric
SEVERE: Failed to get metric event.bytes, from namespace Query13.Events
Feb 20, 2023 3:32:01 AM org.apache.beam.sdk.testutils.metrics.MetricsReader getCounterMetric
SEVERE: Failed to get metric result.elements, from namespace Query13.Results
Feb 20, 2023 3:32:01 AM org.apache.beam.sdk.testutils.metrics.MetricsReader getCounterMetric
SEVERE: Failed to get metric result.bytes, from namespace Query13.Results
==========================================================================================
Run started 2023-02-20T03:26:27.740Z and ran for PT333.694S
Default configuration:
{"debug":true,"query":null,"sourceType":"DIRECT","generateEventFilePathPrefix":null,"sinkType":"DEVNULL","exportSummaryToBigQuery":false,"pubSubMode":"COMBINED","pubsubMessageSerializationMethod":"CODER","sideInputType":"DIRECT","sideInputRowCount":500,"sideInputNumShards":3,"sideInputUrl":null,"sessionGap":600000,"numEvents":100000,"numEventGenerators":100,"rateShape":"SINE","firstEventRate":10000,"nextEventRate":10000,"rateUnit":"PER_SECOND","ratePeriodSec":600,"preloadSeconds":0,"streamTimeout":240,"isRateLimited":false,"useWallclockEventTime":false,"avgPersonByteSize":200,"avgAuctionByteSize":500,"avgBidByteSize":100,"hotAuctionRatio":2,"hotSellersRatio":4,"hotBiddersRatio":4,"windowSizeSec":10,"windowPeriodSec":5,"watermarkHoldbackSec":0,"numInFlightAuctions":100,"numActivePeople":1000,"coderStrategy":"HAND","cpuDelayMs":0,"diskBusyBytes":0,"auctionSkip":123,"fanout":5,"maxAuctionsWaitingTime":600,"occasionalDelaySec":3,"probDelayedEvent":0.1,"maxLogEvents":100000,"usePubsubPublishTime":false,"outOfOrderGroupSize":1,"numKeyBuckets":20000,"pardoCPUFactor":1.0}
Configurations:
Conf Description
0000 query:PASSTHROUGH; numEvents:10000000
0001 query:CURRENCY_CONVERSION; numEvents:10000000
0002 query:SELECTION; numEvents:10000000
0003 query:LOCAL_ITEM_SUGGESTION; numEvents:10000000
0004 query:AVERAGE_PRICE_FOR_CATEGORY; numEvents:1000000
0005 query:HOT_ITEMS; numEvents:10000000
0006 query:AVERAGE_SELLING_PRICE_BY_SELLER; numEvents:1000000
0007 query:HIGHEST_BID; numEvents:10000000
0008 query:MONITOR_NEW_USERS; numEvents:10000000
0009 query:WINNING_BIDS; numEvents:1000000
0010 query:LOG_TO_SHARDED_FILES; numEvents:10000000
0011 query:USER_SESSIONS; numEvents:10000000
0012 query:PROCESSING_TIME_WINDOWS; numEvents:10000000
0013 query:PORTABILITY_BATCH; numEvents:10000000
0014 query:RESHUFFLE; numEvents:10000000
0015 query:BOUNDED_SIDE_INPUT_JOIN; numEvents:10000000
0016 query:SESSION_SIDE_INPUT_JOIN; numEvents:10000000
Performance:
Conf Runtime(sec) (Baseline) Events(/sec) (Baseline) Results (Baseline)
0000 -1.0 -1.0 -1
*** Job was unexpectedly updated ***
0001 -1.0 -1.0 -1
*** Job was unexpectedly updated ***
0002 -1.0 -1.0 -1
*** Job was unexpectedly updated ***
0003 *** not run ***
0004 *** not run ***
0005 -1.0 -1.0 -1
*** Job was unexpectedly updated ***
0006 *** not run ***
0007 *** not run ***
0008 -1.0 -1.0 -1
*** Job was unexpectedly updated ***
0009 *** not run ***
0010 -1.0 -1.0 -1
*** Job was unexpectedly updated ***
0011 *** not run ***
0012 -1.0 -1.0 -1
*** Job was unexpectedly updated ***
0013 -1.0 -1.0 -1
*** Job was unexpectedly updated ***
0014 -1.0 -1.0 -1
*** Job was unexpectedly updated ***
0015 *** not run ***
0016 *** not run ***
==========================================================================================
2023-02-20T03:32:01.540Z FAILED Query11
Feb 20, 2023 3:32:01 AM org.apache.beam.sdk.testutils.metrics.MetricsReader getCounterMetric
SEVERE: Failed to get metric event.elements, from namespace Query11.Events
Feb 20, 2023 3:32:01 AM org.apache.beam.sdk.testutils.metrics.MetricsReader getCounterMetric
SEVERE: Failed to get metric event.bytes, from namespace Query11.Events
Feb 20, 2023 3:32:01 AM org.apache.beam.sdk.testutils.metrics.MetricsReader getCounterMetric
SEVERE: Failed to get metric result.elements, from namespace Query11.Results
Feb 20, 2023 3:32:01 AM org.apache.beam.sdk.testutils.metrics.MetricsReader getCounterMetric
SEVERE: Failed to get metric result.bytes, from namespace Query11.Results
==========================================================================================
Run started 2023-02-20T03:26:27.740Z and ran for PT333.817S
Default configuration:
{"debug":true,"query":null,"sourceType":"DIRECT","generateEventFilePathPrefix":null,"sinkType":"DEVNULL","exportSummaryToBigQuery":false,"pubSubMode":"COMBINED","pubsubMessageSerializationMethod":"CODER","sideInputType":"DIRECT","sideInputRowCount":500,"sideInputNumShards":3,"sideInputUrl":null,"sessionGap":600000,"numEvents":100000,"numEventGenerators":100,"rateShape":"SINE","firstEventRate":10000,"nextEventRate":10000,"rateUnit":"PER_SECOND","ratePeriodSec":600,"preloadSeconds":0,"streamTimeout":240,"isRateLimited":false,"useWallclockEventTime":false,"avgPersonByteSize":200,"avgAuctionByteSize":500,"avgBidByteSize":100,"hotAuctionRatio":2,"hotSellersRatio":4,"hotBiddersRatio":4,"windowSizeSec":10,"windowPeriodSec":5,"watermarkHoldbackSec":0,"numInFlightAuctions":100,"numActivePeople":1000,"coderStrategy":"HAND","cpuDelayMs":0,"diskBusyBytes":0,"auctionSkip":123,"fanout":5,"maxAuctionsWaitingTime":600,"occasionalDelaySec":3,"probDelayedEvent":0.1,"maxLogEvents":100000,"usePubsubPublishTime":false,"outOfOrderGroupSize":1,"numKeyBuckets":20000,"pardoCPUFactor":1.0}
Configurations:
Conf Description
0000 query:PASSTHROUGH; numEvents:10000000
0001 query:CURRENCY_CONVERSION; numEvents:10000000
0002 query:SELECTION; numEvents:10000000
0003 query:LOCAL_ITEM_SUGGESTION; numEvents:10000000
0004 query:AVERAGE_PRICE_FOR_CATEGORY; numEvents:1000000
0005 query:HOT_ITEMS; numEvents:10000000
0006 query:AVERAGE_SELLING_PRICE_BY_SELLER; numEvents:1000000
0007 query:HIGHEST_BID; numEvents:10000000
0008 query:MONITOR_NEW_USERS; numEvents:10000000
0009 query:WINNING_BIDS; numEvents:1000000
0010 query:LOG_TO_SHARDED_FILES; numEvents:10000000
0011 query:USER_SESSIONS; numEvents:10000000
0012 query:PROCESSING_TIME_WINDOWS; numEvents:10000000
0013 query:PORTABILITY_BATCH; numEvents:10000000
0014 query:RESHUFFLE; numEvents:10000000
0015 query:BOUNDED_SIDE_INPUT_JOIN; numEvents:10000000
0016 query:SESSION_SIDE_INPUT_JOIN; numEvents:10000000
Performance:
Conf Runtime(sec) (Baseline) Events(/sec) (Baseline) Results (Baseline)
0000 -1.0 -1.0 -1
*** Job was unexpectedly updated ***
0001 -1.0 -1.0 -1
*** Job was unexpectedly updated ***
0002 -1.0 -1.0 -1
*** Job was unexpectedly updated ***
0003 *** not run ***
0004 *** not run ***
0005 -1.0 -1.0 -1
*** Job was unexpectedly updated ***
0006 *** not run ***
0007 *** not run ***
0008 -1.0 -1.0 -1
*** Job was unexpectedly updated ***
0009 *** not run ***
0010 -1.0 -1.0 -1
*** Job was unexpectedly updated ***
0011 -1.0 -1.0 -1
*** Job was unexpectedly updated ***
0012 -1.0 -1.0 -1
*** Job was unexpectedly updated ***
0013 -1.0 -1.0 -1
*** Job was unexpectedly updated ***
0014 -1.0 -1.0 -1
*** Job was unexpectedly updated ***
0015 *** not run ***
0016 *** not run ***
==========================================================================================
==========================================================================================
Run started 2023-02-20T03:26:27.740Z and ran for PT334.050S
Default configuration:
{"debug":true,"query":null,"sourceType":"DIRECT","generateEventFilePathPrefix":null,"sinkType":"DEVNULL","exportSummaryToBigQuery":false,"pubSubMode":"COMBINED","pubsubMessageSerializationMethod":"CODER","sideInputType":"DIRECT","sideInputRowCount":500,"sideInputNumShards":3,"sideInputUrl":null,"sessionGap":600000,"numEvents":100000,"numEventGenerators":100,"rateShape":"SINE","firstEventRate":10000,"nextEventRate":10000,"rateUnit":"PER_SECOND","ratePeriodSec":600,"preloadSeconds":0,"streamTimeout":240,"isRateLimited":false,"useWallclockEventTime":false,"avgPersonByteSize":200,"avgAuctionByteSize":500,"avgBidByteSize":100,"hotAuctionRatio":2,"hotSellersRatio":4,"hotBiddersRatio":4,"windowSizeSec":10,"windowPeriodSec":5,"watermarkHoldbackSec":0,"numInFlightAuctions":100,"numActivePeople":1000,"coderStrategy":"HAND","cpuDelayMs":0,"diskBusyBytes":0,"auctionSkip":123,"fanout":5,"maxAuctionsWaitingTime":600,"occasionalDelaySec":3,"probDelayedEvent":0.1,"maxLogEvents":100000,"usePubsubPublishTime":false,"outOfOrderGroupSize":1,"numKeyBuckets":20000,"pardoCPUFactor":1.0}
Configurations:
Conf Description
0000 query:PASSTHROUGH; numEvents:10000000
0001 query:CURRENCY_CONVERSION; numEvents:10000000
0002 query:SELECTION; numEvents:10000000
0003 query:LOCAL_ITEM_SUGGESTION; numEvents:10000000
0004 query:AVERAGE_PRICE_FOR_CATEGORY; numEvents:1000000
0005 query:HOT_ITEMS; numEvents:10000000
0006 query:AVERAGE_SELLING_PRICE_BY_SELLER; numEvents:1000000
0007 query:HIGHEST_BID; numEvents:10000000
0008 query:MONITOR_NEW_USERS; numEvents:10000000
0009 query:WINNING_BIDS; numEvents:1000000
0010 query:LOG_TO_SHARDED_FILES; numEvents:10000000
0011 query:USER_SESSIONS; numEvents:10000000
0012 query:PROCESSING_TIME_WINDOWS; numEvents:10000000
0013 query:PORTABILITY_BATCH; numEvents:10000000
0014 query:RESHUFFLE; numEvents:10000000
0015 query:BOUNDED_SIDE_INPUT_JOIN; numEvents:10000000
0016 query:SESSION_SIDE_INPUT_JOIN; numEvents:10000000
Performance:
Conf Runtime(sec) (Baseline) Events(/sec) (Baseline) Results (Baseline)
0000 -1.0 -1.0 -1
*** Job was unexpectedly updated ***
0001 -1.0 -1.0 -1
*** Job was unexpectedly updated ***
0002 -1.0 -1.0 -1
*** Job was unexpectedly updated ***
0003 *** not run ***
0004 *** not run ***
0005 -1.0 -1.0 -1
*** Job was unexpectedly updated ***
0006 *** not run ***
0007 *** not run ***
0008 -1.0 -1.0 -1
*** Job was unexpectedly updated ***
0009 *** not run ***
0010 -1.0 -1.0 -1
*** Job was unexpectedly updated ***
0011 -1.0 -1.0 -1
*** Job was unexpectedly updated ***
0012 -1.0 -1.0 -1
*** Job was unexpectedly updated ***
0013 -1.0 -1.0 -1
*** Job was unexpectedly updated ***
0014 -1.0 -1.0 -1
*** Job was unexpectedly updated ***
0015 *** not run ***
0016 *** not run ***
==========================================================================================
Exception in thread "main" java.lang.RuntimeException: Execution was not successful
at org.apache.beam.sdk.nexmark.Main.runAll(Main.java:169)
at org.apache.beam.sdk.nexmark.Main.main(Main.java:441)
> Task :sdks:java:testing:nexmark:run FAILED
> Task :runners:google-cloud-dataflow-java:cleanUpDockerJavaImages
Untagged: us.gcr.io/apache-beam-testing/java-postcommit-it/java:20230220032449
Untagged: us.gcr.io/apache-beam-testing/java-postcommit-it/java@sha256:a69e7e688960fe58ffbb8655a10f8ca5e71002cc07d8652be1c292de08d693f7
WARNING: Successfully resolved tag to sha256, but it is recommended to use sha256 directly.
Tag: [us.gcr.io/apache-beam-testing/java-postcommit-it/java:20230220032449]
- referencing digest: [us.gcr.io/apache-beam-testing/java-postcommit-it/java@sha256:a69e7e688960fe58ffbb8655a10f8ca5e71002cc07d8652be1c292de08d693f7]
Deleted [[us.gcr.io/apache-beam-testing/java-postcommit-it/java:20230220032449] (referencing [us.gcr.io/apache-beam-testing/java-postcommit-it/java@sha256:a69e7e688960fe58ffbb8655a10f8ca5e71002cc07d8652be1c292de08d693f7])].
Removing untagged image us.gcr.io/apache-beam-testing/java-postcommit-it/java@sha256:a69e7e688960fe58ffbb8655a10f8ca5e71002cc07d8652be1c292de08d693f7
Digests:
- us.gcr.io/apache-beam-testing/java-postcommit-it/java@sha256:a69e7e688960fe58ffbb8655a10f8ca5e71002cc07d8652be1c292de08d693f7
Deleted [us.gcr.io/apache-beam-testing/java-postcommit-it/java@sha256:a69e7e688960fe58ffbb8655a10f8ca5e71002cc07d8652be1c292de08d693f7].
FAILURE: Build failed with an exception.
* What went wrong:
Execution failed for task ':sdks:java:testing:nexmark:run'.
> Process 'command '/usr/lib/jvm/java-8-openjdk-amd64/bin/java'' finished with non-zero exit value 1
* Try:
> Run with --stacktrace option to get the stack trace.
> Run with --info or --debug option to get more log output.
* Get more help at https://help.gradle.org
Deprecated Gradle features were used in this build, making it incompatible with Gradle 8.0.
You can use '--warning-mode all' to show the individual deprecation warnings and determine if they come from your own scripts or plugins.
See https://docs.gradle.org/7.5.1/userguide/command_line_interface.html#sec:command_line_warnings
Execution optimizations have been disabled for 1 invalid unit(s) of work during this build to ensure correctness.
Please consult deprecation warnings for more details.
BUILD FAILED in 7m 32s
140 actionable tasks: 94 executed, 42 from cache, 4 up-to-date
Publishing build scan...
https://gradle.com/s/pzaziyrz7iizq
Build step 'Invoke Gradle script' changed build result to FAILURE
Build step 'Invoke Gradle script' marked build as failure
---------------------------------------------------------------------
To unsubscribe, e-mail: builds-unsubscribe@beam.apache.org
For additional commands, e-mail: builds-help@beam.apache.org
Build failed in Jenkins: beam_PostCommit_Java_Nexmark_Dataflow_V2_Java17 #1699
Posted by Apache Jenkins Server <je...@builds.apache.org>.
See <https://ci-beam.apache.org/job/beam_PostCommit_Java_Nexmark_Dataflow_V2_Java17/1699/display/redirect?page=changes>
Changes:
[noreply] Fix Tensorflow intergration test model path (#25553)
------------------------------------------
[...truncated 1.23 MB...]
2023-02-19T21:31:02.517Z FAILED Query13
Feb 19, 2023 9:31:02 PM org.apache.beam.sdk.testutils.metrics.MetricsReader getCounterMetric
SEVERE: Failed to get metric event.elements, from namespace Query13.Events
Feb 19, 2023 9:31:02 PM org.apache.beam.sdk.testutils.metrics.MetricsReader getCounterMetric
SEVERE: Failed to get metric event.bytes, from namespace Query13.Events
Feb 19, 2023 9:31:02 PM org.apache.beam.sdk.testutils.metrics.MetricsReader getCounterMetric
SEVERE: Failed to get metric result.elements, from namespace Query13.Results
Feb 19, 2023 9:31:02 PM org.apache.beam.sdk.testutils.metrics.MetricsReader getCounterMetric
SEVERE: Failed to get metric result.bytes, from namespace Query13.Results
==========================================================================================
Run started 2023-02-19T21:25:30.670Z and ran for PT331.871S
Default configuration:
{"debug":true,"query":null,"sourceType":"DIRECT","generateEventFilePathPrefix":null,"sinkType":"DEVNULL","exportSummaryToBigQuery":false,"pubSubMode":"COMBINED","pubsubMessageSerializationMethod":"CODER","sideInputType":"DIRECT","sideInputRowCount":500,"sideInputNumShards":3,"sideInputUrl":null,"sessionGap":600000,"numEvents":100000,"numEventGenerators":100,"rateShape":"SINE","firstEventRate":10000,"nextEventRate":10000,"rateUnit":"PER_SECOND","ratePeriodSec":600,"preloadSeconds":0,"streamTimeout":240,"isRateLimited":false,"useWallclockEventTime":false,"avgPersonByteSize":200,"avgAuctionByteSize":500,"avgBidByteSize":100,"hotAuctionRatio":2,"hotSellersRatio":4,"hotBiddersRatio":4,"windowSizeSec":10,"windowPeriodSec":5,"watermarkHoldbackSec":0,"numInFlightAuctions":100,"numActivePeople":1000,"coderStrategy":"HAND","cpuDelayMs":0,"diskBusyBytes":0,"auctionSkip":123,"fanout":5,"maxAuctionsWaitingTime":600,"occasionalDelaySec":3,"probDelayedEvent":0.1,"maxLogEvents":100000,"usePubsubPublishTime":false,"outOfOrderGroupSize":1,"numKeyBuckets":20000,"pardoCPUFactor":1.0}
Configurations:
Conf Description
0000 query:PASSTHROUGH; numEvents:10000000
0001 query:CURRENCY_CONVERSION; numEvents:10000000
0002 query:SELECTION; numEvents:10000000
0003 query:LOCAL_ITEM_SUGGESTION; numEvents:10000000
0004 query:AVERAGE_PRICE_FOR_CATEGORY; numEvents:1000000
0005 query:HOT_ITEMS; numEvents:10000000
0006 query:AVERAGE_SELLING_PRICE_BY_SELLER; numEvents:1000000
0007 query:HIGHEST_BID; numEvents:10000000
0008 query:MONITOR_NEW_USERS; numEvents:10000000
0009 query:WINNING_BIDS; numEvents:1000000
0010 query:LOG_TO_SHARDED_FILES; numEvents:10000000
0011 query:USER_SESSIONS; numEvents:10000000
0012 query:PROCESSING_TIME_WINDOWS; numEvents:10000000
0013 query:PORTABILITY_BATCH; numEvents:10000000
0014 query:RESHUFFLE; numEvents:10000000
0015 query:BOUNDED_SIDE_INPUT_JOIN; numEvents:10000000
0016 query:SESSION_SIDE_INPUT_JOIN; numEvents:10000000
Performance:
Conf Runtime(sec) (Baseline) Events(/sec) (Baseline) Results (Baseline)
0000 -1.0 -1.0 -1
*** Job was unexpectedly updated ***
0001 -1.0 -1.0 -1
*** Job was unexpectedly updated ***
0002 -1.0 -1.0 -1
*** Job was unexpectedly updated ***
0003 *** not run ***
0004 *** not run ***
0005 *** not run ***
0006 *** not run ***
0007 *** not run ***
0008 -1.0 -1.0 -1
*** Job was unexpectedly updated ***
0009 *** not run ***
0010 -1.0 -1.0 -1
*** Job was unexpectedly updated ***
0011 -1.0 -1.0 -1
*** Job was unexpectedly updated ***
0012 -1.0 -1.0 -1
*** Job was unexpectedly updated ***
0013 -1.0 -1.0 -1
*** Job was unexpectedly updated ***
0014 -1.0 -1.0 -1
*** Job was unexpectedly updated ***
0015 *** not run ***
0016 *** not run ***
==========================================================================================
2023-02-19T21:31:02.701Z RUNNING Query5
Feb 19, 2023 9:31:02 PM org.apache.beam.sdk.testutils.metrics.MetricsReader getCounterMetric
SEVERE: Failed to get metric event.elements, from namespace Query5.Events
Feb 19, 2023 9:31:02 PM org.apache.beam.sdk.testutils.metrics.MetricsReader getCounterMetric
SEVERE: Failed to get metric event.bytes, from namespace Query5.Events
Feb 19, 2023 9:31:02 PM org.apache.beam.sdk.testutils.metrics.MetricsReader getCounterMetric
SEVERE: Failed to get metric result.elements, from namespace Query5.Results
Feb 19, 2023 9:31:02 PM org.apache.beam.sdk.testutils.metrics.MetricsReader getCounterMetric
SEVERE: Failed to get metric result.bytes, from namespace Query5.Results
2023-02-19T21:31:03.153Z no activity
2023-02-19T21:31:18.190Z FAILED Query5
Feb 19, 2023 9:31:18 PM org.apache.beam.sdk.testutils.metrics.MetricsReader getCounterMetric
SEVERE: Failed to get metric event.elements, from namespace Query5.Events
Feb 19, 2023 9:31:18 PM org.apache.beam.sdk.testutils.metrics.MetricsReader getCounterMetric
SEVERE: Failed to get metric event.bytes, from namespace Query5.Events
Feb 19, 2023 9:31:18 PM org.apache.beam.sdk.testutils.metrics.MetricsReader getCounterMetric
SEVERE: Failed to get metric result.elements, from namespace Query5.Results
Feb 19, 2023 9:31:18 PM org.apache.beam.sdk.testutils.metrics.MetricsReader getCounterMetric
SEVERE: Failed to get metric result.bytes, from namespace Query5.Results
==========================================================================================
Run started 2023-02-19T21:25:30.670Z and ran for PT347.553S
Default configuration:
{"debug":true,"query":null,"sourceType":"DIRECT","generateEventFilePathPrefix":null,"sinkType":"DEVNULL","exportSummaryToBigQuery":false,"pubSubMode":"COMBINED","pubsubMessageSerializationMethod":"CODER","sideInputType":"DIRECT","sideInputRowCount":500,"sideInputNumShards":3,"sideInputUrl":null,"sessionGap":600000,"numEvents":100000,"numEventGenerators":100,"rateShape":"SINE","firstEventRate":10000,"nextEventRate":10000,"rateUnit":"PER_SECOND","ratePeriodSec":600,"preloadSeconds":0,"streamTimeout":240,"isRateLimited":false,"useWallclockEventTime":false,"avgPersonByteSize":200,"avgAuctionByteSize":500,"avgBidByteSize":100,"hotAuctionRatio":2,"hotSellersRatio":4,"hotBiddersRatio":4,"windowSizeSec":10,"windowPeriodSec":5,"watermarkHoldbackSec":0,"numInFlightAuctions":100,"numActivePeople":1000,"coderStrategy":"HAND","cpuDelayMs":0,"diskBusyBytes":0,"auctionSkip":123,"fanout":5,"maxAuctionsWaitingTime":600,"occasionalDelaySec":3,"probDelayedEvent":0.1,"maxLogEvents":100000,"usePubsubPublishTime":false,"outOfOrderGroupSize":1,"numKeyBuckets":20000,"pardoCPUFactor":1.0}
Configurations:
Conf Description
0000 query:PASSTHROUGH; numEvents:10000000
0001 query:CURRENCY_CONVERSION; numEvents:10000000
0002 query:SELECTION; numEvents:10000000
0003 query:LOCAL_ITEM_SUGGESTION; numEvents:10000000
0004 query:AVERAGE_PRICE_FOR_CATEGORY; numEvents:1000000
0005 query:HOT_ITEMS; numEvents:10000000
0006 query:AVERAGE_SELLING_PRICE_BY_SELLER; numEvents:1000000
0007 query:HIGHEST_BID; numEvents:10000000
0008 query:MONITOR_NEW_USERS; numEvents:10000000
0009 query:WINNING_BIDS; numEvents:1000000
0010 query:LOG_TO_SHARDED_FILES; numEvents:10000000
0011 query:USER_SESSIONS; numEvents:10000000
0012 query:PROCESSING_TIME_WINDOWS; numEvents:10000000
0013 query:PORTABILITY_BATCH; numEvents:10000000
0014 query:RESHUFFLE; numEvents:10000000
0015 query:BOUNDED_SIDE_INPUT_JOIN; numEvents:10000000
0016 query:SESSION_SIDE_INPUT_JOIN; numEvents:10000000
Performance:
Conf Runtime(sec) (Baseline) Events(/sec) (Baseline) Results (Baseline)
0000 -1.0 -1.0 -1
*** Job was unexpectedly updated ***
0001 -1.0 -1.0 -1
*** Job was unexpectedly updated ***
0002 -1.0 -1.0 -1
*** Job was unexpectedly updated ***
0003 *** not run ***
0004 *** not run ***
0005 -1.0 -1.0 -1
*** Job was unexpectedly updated ***
0006 *** not run ***
0007 *** not run ***
0008 -1.0 -1.0 -1
*** Job was unexpectedly updated ***
0009 *** not run ***
0010 -1.0 -1.0 -1
*** Job was unexpectedly updated ***
0011 -1.0 -1.0 -1
*** Job was unexpectedly updated ***
0012 -1.0 -1.0 -1
*** Job was unexpectedly updated ***
0013 -1.0 -1.0 -1
*** Job was unexpectedly updated ***
0014 -1.0 -1.0 -1
*** Job was unexpectedly updated ***
0015 *** not run ***
0016 *** not run ***
==========================================================================================
==========================================================================================
Run started 2023-02-19T21:25:30.670Z and ran for PT347.791S
Default configuration:
{"debug":true,"query":null,"sourceType":"DIRECT","generateEventFilePathPrefix":null,"sinkType":"DEVNULL","exportSummaryToBigQuery":false,"pubSubMode":"COMBINED","pubsubMessageSerializationMethod":"CODER","sideInputType":"DIRECT","sideInputRowCount":500,"sideInputNumShards":3,"sideInputUrl":null,"sessionGap":600000,"numEvents":100000,"numEventGenerators":100,"rateShape":"SINE","firstEventRate":10000,"nextEventRate":10000,"rateUnit":"PER_SECOND","ratePeriodSec":600,"preloadSeconds":0,"streamTimeout":240,"isRateLimited":false,"useWallclockEventTime":false,"avgPersonByteSize":200,"avgAuctionByteSize":500,"avgBidByteSize":100,"hotAuctionRatio":2,"hotSellersRatio":4,"hotBiddersRatio":4,"windowSizeSec":10,"windowPeriodSec":5,"watermarkHoldbackSec":0,"numInFlightAuctions":100,"numActivePeople":1000,"coderStrategy":"HAND","cpuDelayMs":0,"diskBusyBytes":0,"auctionSkip":123,"fanout":5,"maxAuctionsWaitingTime":600,"occasionalDelaySec":3,"probDelayedEvent":0.1,"maxLogEvents":100000,"usePubsubPublishTime":false,"outOfOrderGroupSize":1,"numKeyBuckets":20000,"pardoCPUFactor":1.0}
Configurations:
Conf Description
0000 query:PASSTHROUGH; numEvents:10000000
0001 query:CURRENCY_CONVERSION; numEvents:10000000
0002 query:SELECTION; numEvents:10000000
0003 query:LOCAL_ITEM_SUGGESTION; numEvents:10000000
0004 query:AVERAGE_PRICE_FOR_CATEGORY; numEvents:1000000
0005 query:HOT_ITEMS; numEvents:10000000
0006 query:AVERAGE_SELLING_PRICE_BY_SELLER; numEvents:1000000
0007 query:HIGHEST_BID; numEvents:10000000
0008 query:MONITOR_NEW_USERS; numEvents:10000000
0009 query:WINNING_BIDS; numEvents:1000000
0010 query:LOG_TO_SHARDED_FILES; numEvents:10000000
0011 query:USER_SESSIONS; numEvents:10000000
0012 query:PROCESSING_TIME_WINDOWS; numEvents:10000000
0013 query:PORTABILITY_BATCH; numEvents:10000000
0014 query:RESHUFFLE; numEvents:10000000
0015 query:BOUNDED_SIDE_INPUT_JOIN; numEvents:10000000
0016 query:SESSION_SIDE_INPUT_JOIN; numEvents:10000000
Performance:
Conf Runtime(sec) (Baseline) Events(/sec) (Baseline) Results (Baseline)
0000 -1.0 -1.0 -1
*** Job was unexpectedly updated ***
0001 -1.0 -1.0 -1
*** Job was unexpectedly updated ***
0002 -1.0 -1.0 -1
*** Job was unexpectedly updated ***
0003 *** not run ***
0004 *** not run ***
0005 -1.0 -1.0 -1
*** Job was unexpectedly updated ***
0006 *** not run ***
0007 *** not run ***
0008 -1.0 -1.0 -1
*** Job was unexpectedly updated ***
0009 *** not run ***
0010 -1.0 -1.0 -1
*** Job was unexpectedly updated ***
0011 -1.0 -1.0 -1
*** Job was unexpectedly updated ***
0012 -1.0 -1.0 -1
*** Job was unexpectedly updated ***
0013 -1.0 -1.0 -1
*** Job was unexpectedly updated ***
0014 -1.0 -1.0 -1
*** Job was unexpectedly updated ***
0015 *** not run ***
0016 *** not run ***
==========================================================================================
Exception in thread "main" java.lang.RuntimeException: Execution was not successful
at org.apache.beam.sdk.nexmark.Main.runAll(Main.java:169)
at org.apache.beam.sdk.nexmark.Main.main(Main.java:441)
> Task :sdks:java:testing:nexmark:run FAILED
> Task :runners:google-cloud-dataflow-java:cleanUpDockerJavaImages
Untagged: us.gcr.io/apache-beam-testing/java-postcommit-it/java:20230219212444
Untagged: us.gcr.io/apache-beam-testing/java-postcommit-it/java@sha256:1ff48001468900394de6cfbde9802dc234cc70ff9eb90faef6668c9e0e9684be
WARNING: Successfully resolved tag to sha256, but it is recommended to use sha256 directly.
Tag: [us.gcr.io/apache-beam-testing/java-postcommit-it/java:20230219212444]
- referencing digest: [us.gcr.io/apache-beam-testing/java-postcommit-it/java@sha256:1ff48001468900394de6cfbde9802dc234cc70ff9eb90faef6668c9e0e9684be]
Deleted [[us.gcr.io/apache-beam-testing/java-postcommit-it/java:20230219212444] (referencing [us.gcr.io/apache-beam-testing/java-postcommit-it/java@sha256:1ff48001468900394de6cfbde9802dc234cc70ff9eb90faef6668c9e0e9684be])].
Removing untagged image us.gcr.io/apache-beam-testing/java-postcommit-it/java@sha256:1ff48001468900394de6cfbde9802dc234cc70ff9eb90faef6668c9e0e9684be
Digests:
- us.gcr.io/apache-beam-testing/java-postcommit-it/java@sha256:1ff48001468900394de6cfbde9802dc234cc70ff9eb90faef6668c9e0e9684be
Deleted [us.gcr.io/apache-beam-testing/java-postcommit-it/java@sha256:1ff48001468900394de6cfbde9802dc234cc70ff9eb90faef6668c9e0e9684be].
FAILURE: Build failed with an exception.
* What went wrong:
Execution failed for task ':sdks:java:testing:nexmark:run'.
> Process 'command '/usr/lib/jvm/java-8-openjdk-amd64/bin/java'' finished with non-zero exit value 1
* Try:
> Run with --stacktrace option to get the stack trace.
> Run with --info or --debug option to get more log output.
* Get more help at https://help.gradle.org
Deprecated Gradle features were used in this build, making it incompatible with Gradle 8.0.
You can use '--warning-mode all' to show the individual deprecation warnings and determine if they come from your own scripts or plugins.
See https://docs.gradle.org/7.5.1/userguide/command_line_interface.html#sec:command_line_warnings
Execution optimizations have been disabled for 1 invalid unit(s) of work during this build to ensure correctness.
Please consult deprecation warnings for more details.
BUILD FAILED in 6m 52s
140 actionable tasks: 94 executed, 42 from cache, 4 up-to-date
Publishing build scan...
https://gradle.com/s/jmol7ixkndstc
Build step 'Invoke Gradle script' changed build result to FAILURE
Build step 'Invoke Gradle script' marked build as failure
---------------------------------------------------------------------
To unsubscribe, e-mail: builds-unsubscribe@beam.apache.org
For additional commands, e-mail: builds-help@beam.apache.org
Build failed in Jenkins: beam_PostCommit_Java_Nexmark_Dataflow_V2_Java17 #1698
Posted by Apache Jenkins Server <je...@builds.apache.org>.
See <https://ci-beam.apache.org/job/beam_PostCommit_Java_Nexmark_Dataflow_V2_Java17/1698/display/redirect>
Changes:
------------------------------------------
[...truncated 1.22 MB...]
==========================================================================================
Run started 2023-02-19T15:25:29.848Z and ran for PT346.890S
Default configuration:
{"debug":true,"query":null,"sourceType":"DIRECT","generateEventFilePathPrefix":null,"sinkType":"DEVNULL","exportSummaryToBigQuery":false,"pubSubMode":"COMBINED","pubsubMessageSerializationMethod":"CODER","sideInputType":"DIRECT","sideInputRowCount":500,"sideInputNumShards":3,"sideInputUrl":null,"sessionGap":600000,"numEvents":100000,"numEventGenerators":100,"rateShape":"SINE","firstEventRate":10000,"nextEventRate":10000,"rateUnit":"PER_SECOND","ratePeriodSec":600,"preloadSeconds":0,"streamTimeout":240,"isRateLimited":false,"useWallclockEventTime":false,"avgPersonByteSize":200,"avgAuctionByteSize":500,"avgBidByteSize":100,"hotAuctionRatio":2,"hotSellersRatio":4,"hotBiddersRatio":4,"windowSizeSec":10,"windowPeriodSec":5,"watermarkHoldbackSec":0,"numInFlightAuctions":100,"numActivePeople":1000,"coderStrategy":"HAND","cpuDelayMs":0,"diskBusyBytes":0,"auctionSkip":123,"fanout":5,"maxAuctionsWaitingTime":600,"occasionalDelaySec":3,"probDelayedEvent":0.1,"maxLogEvents":100000,"usePubsubPublishTime":false,"outOfOrderGroupSize":1,"numKeyBuckets":20000,"pardoCPUFactor":1.0}
Configurations:
Conf Description
0000 query:PASSTHROUGH; numEvents:10000000
0001 query:CURRENCY_CONVERSION; numEvents:10000000
0002 query:SELECTION; numEvents:10000000
0003 query:LOCAL_ITEM_SUGGESTION; numEvents:10000000
0004 query:AVERAGE_PRICE_FOR_CATEGORY; numEvents:1000000
0005 query:HOT_ITEMS; numEvents:10000000
0006 query:AVERAGE_SELLING_PRICE_BY_SELLER; numEvents:1000000
0007 query:HIGHEST_BID; numEvents:10000000
0008 query:MONITOR_NEW_USERS; numEvents:10000000
0009 query:WINNING_BIDS; numEvents:1000000
0010 query:LOG_TO_SHARDED_FILES; numEvents:10000000
0011 query:USER_SESSIONS; numEvents:10000000
0012 query:PROCESSING_TIME_WINDOWS; numEvents:10000000
0013 query:PORTABILITY_BATCH; numEvents:10000000
0014 query:RESHUFFLE; numEvents:10000000
0015 query:BOUNDED_SIDE_INPUT_JOIN; numEvents:10000000
0016 query:SESSION_SIDE_INPUT_JOIN; numEvents:10000000
Performance:
Conf Runtime(sec) (Baseline) Events(/sec) (Baseline) Results (Baseline)
0000 -1.0 -1.0 -1
*** Job was unexpectedly updated ***
0001 -1.0 -1.0 -1
*** Job was unexpectedly updated ***
0002 -1.0 -1.0 -1
*** Job was unexpectedly updated ***
0003 *** not run ***
0004 *** not run ***
0005 -1.0 -1.0 -1
*** Job was unexpectedly updated ***
0006 *** not run ***
0007 *** not run ***
0008 -1.0 -1.0 -1
*** Job was unexpectedly updated ***
0009 *** not run ***
0010 -1.0 -1.0 -1
*** Job was unexpectedly updated ***
0011 *** not run ***
0012 -1.0 -1.0 -1
*** Job was unexpectedly updated ***
0013 -1.0 -1.0 -1
*** Job was unexpectedly updated ***
0014 -1.0 -1.0 -1
*** Job was unexpectedly updated ***
0015 *** not run ***
0016 *** not run ***
==========================================================================================
2023-02-19T15:31:17.002Z RUNNING Query11
Feb 19, 2023 3:31:17 PM org.apache.beam.sdk.testutils.metrics.MetricsReader getCounterMetric
SEVERE: Failed to get metric event.elements, from namespace Query11.Events
Feb 19, 2023 3:31:17 PM org.apache.beam.sdk.testutils.metrics.MetricsReader getCounterMetric
SEVERE: Failed to get metric event.bytes, from namespace Query11.Events
Feb 19, 2023 3:31:17 PM org.apache.beam.sdk.testutils.metrics.MetricsReader getCounterMetric
SEVERE: Failed to get metric result.elements, from namespace Query11.Results
Feb 19, 2023 3:31:17 PM org.apache.beam.sdk.testutils.metrics.MetricsReader getCounterMetric
SEVERE: Failed to get metric result.bytes, from namespace Query11.Results
2023-02-19T15:31:17.536Z no activity
2023-02-19T15:31:49.704Z RUNNING Query11
Feb 19, 2023 3:31:49 PM org.apache.beam.sdk.testutils.metrics.MetricsReader getCounterMetric
SEVERE: Failed to get metric event.elements, from namespace Query11.Events
Feb 19, 2023 3:31:49 PM org.apache.beam.sdk.testutils.metrics.MetricsReader getCounterMetric
SEVERE: Failed to get metric event.bytes, from namespace Query11.Events
Feb 19, 2023 3:31:49 PM org.apache.beam.sdk.testutils.metrics.MetricsReader getCounterMetric
SEVERE: Failed to get metric result.elements, from namespace Query11.Results
Feb 19, 2023 3:31:49 PM org.apache.beam.sdk.testutils.metrics.MetricsReader getCounterMetric
SEVERE: Failed to get metric result.bytes, from namespace Query11.Results
2023-02-19T15:31:49.772Z no activity
2023-02-19T15:32:04.772Z FAILED Query11
Feb 19, 2023 3:32:04 PM org.apache.beam.sdk.testutils.metrics.MetricsReader getCounterMetric
SEVERE: Failed to get metric event.elements, from namespace Query11.Events
Feb 19, 2023 3:32:04 PM org.apache.beam.sdk.testutils.metrics.MetricsReader getCounterMetric
SEVERE: Failed to get metric event.bytes, from namespace Query11.Events
Feb 19, 2023 3:32:04 PM org.apache.beam.sdk.testutils.metrics.MetricsReader getCounterMetric
SEVERE: Failed to get metric result.elements, from namespace Query11.Results
Feb 19, 2023 3:32:04 PM org.apache.beam.sdk.testutils.metrics.MetricsReader getCounterMetric
SEVERE: Failed to get metric result.bytes, from namespace Query11.Results
==========================================================================================
Run started 2023-02-19T15:25:29.848Z and ran for PT394.925S
Default configuration:
{"debug":true,"query":null,"sourceType":"DIRECT","generateEventFilePathPrefix":null,"sinkType":"DEVNULL","exportSummaryToBigQuery":false,"pubSubMode":"COMBINED","pubsubMessageSerializationMethod":"CODER","sideInputType":"DIRECT","sideInputRowCount":500,"sideInputNumShards":3,"sideInputUrl":null,"sessionGap":600000,"numEvents":100000,"numEventGenerators":100,"rateShape":"SINE","firstEventRate":10000,"nextEventRate":10000,"rateUnit":"PER_SECOND","ratePeriodSec":600,"preloadSeconds":0,"streamTimeout":240,"isRateLimited":false,"useWallclockEventTime":false,"avgPersonByteSize":200,"avgAuctionByteSize":500,"avgBidByteSize":100,"hotAuctionRatio":2,"hotSellersRatio":4,"hotBiddersRatio":4,"windowSizeSec":10,"windowPeriodSec":5,"watermarkHoldbackSec":0,"numInFlightAuctions":100,"numActivePeople":1000,"coderStrategy":"HAND","cpuDelayMs":0,"diskBusyBytes":0,"auctionSkip":123,"fanout":5,"maxAuctionsWaitingTime":600,"occasionalDelaySec":3,"probDelayedEvent":0.1,"maxLogEvents":100000,"usePubsubPublishTime":false,"outOfOrderGroupSize":1,"numKeyBuckets":20000,"pardoCPUFactor":1.0}
Configurations:
Conf Description
0000 query:PASSTHROUGH; numEvents:10000000
0001 query:CURRENCY_CONVERSION; numEvents:10000000
0002 query:SELECTION; numEvents:10000000
0003 query:LOCAL_ITEM_SUGGESTION; numEvents:10000000
0004 query:AVERAGE_PRICE_FOR_CATEGORY; numEvents:1000000
0005 query:HOT_ITEMS; numEvents:10000000
0006 query:AVERAGE_SELLING_PRICE_BY_SELLER; numEvents:1000000
0007 query:HIGHEST_BID; numEvents:10000000
0008 query:MONITOR_NEW_USERS; numEvents:10000000
0009 query:WINNING_BIDS; numEvents:1000000
0010 query:LOG_TO_SHARDED_FILES; numEvents:10000000
0011 query:USER_SESSIONS; numEvents:10000000
0012 query:PROCESSING_TIME_WINDOWS; numEvents:10000000
0013 query:PORTABILITY_BATCH; numEvents:10000000
0014 query:RESHUFFLE; numEvents:10000000
0015 query:BOUNDED_SIDE_INPUT_JOIN; numEvents:10000000
0016 query:SESSION_SIDE_INPUT_JOIN; numEvents:10000000
Performance:
Conf Runtime(sec) (Baseline) Events(/sec) (Baseline) Results (Baseline)
0000 -1.0 -1.0 -1
*** Job was unexpectedly updated ***
0001 -1.0 -1.0 -1
*** Job was unexpectedly updated ***
0002 -1.0 -1.0 -1
*** Job was unexpectedly updated ***
0003 *** not run ***
0004 *** not run ***
0005 -1.0 -1.0 -1
*** Job was unexpectedly updated ***
0006 *** not run ***
0007 *** not run ***
0008 -1.0 -1.0 -1
*** Job was unexpectedly updated ***
0009 *** not run ***
0010 -1.0 -1.0 -1
*** Job was unexpectedly updated ***
0011 -1.0 -1.0 -1
*** Job was unexpectedly updated ***
0012 -1.0 -1.0 -1
*** Job was unexpectedly updated ***
0013 -1.0 -1.0 -1
*** Job was unexpectedly updated ***
0014 -1.0 -1.0 -1
*** Job was unexpectedly updated ***
0015 *** not run ***
0016 *** not run ***
==========================================================================================
==========================================================================================
Run started 2023-02-19T15:25:29.848Z and ran for PT395.152S
Default configuration:
{"debug":true,"query":null,"sourceType":"DIRECT","generateEventFilePathPrefix":null,"sinkType":"DEVNULL","exportSummaryToBigQuery":false,"pubSubMode":"COMBINED","pubsubMessageSerializationMethod":"CODER","sideInputType":"DIRECT","sideInputRowCount":500,"sideInputNumShards":3,"sideInputUrl":null,"sessionGap":600000,"numEvents":100000,"numEventGenerators":100,"rateShape":"SINE","firstEventRate":10000,"nextEventRate":10000,"rateUnit":"PER_SECOND","ratePeriodSec":600,"preloadSeconds":0,"streamTimeout":240,"isRateLimited":false,"useWallclockEventTime":false,"avgPersonByteSize":200,"avgAuctionByteSize":500,"avgBidByteSize":100,"hotAuctionRatio":2,"hotSellersRatio":4,"hotBiddersRatio":4,"windowSizeSec":10,"windowPeriodSec":5,"watermarkHoldbackSec":0,"numInFlightAuctions":100,"numActivePeople":1000,"coderStrategy":"HAND","cpuDelayMs":0,"diskBusyBytes":0,"auctionSkip":123,"fanout":5,"maxAuctionsWaitingTime":600,"occasionalDelaySec":3,"probDelayedEvent":0.1,"maxLogEvents":100000,"usePubsubPublishTime":false,"outOfOrderGroupSize":1,"numKeyBuckets":20000,"pardoCPUFactor":1.0}
Configurations:
Conf Description
0000 query:PASSTHROUGH; numEvents:10000000
0001 query:CURRENCY_CONVERSION; numEvents:10000000
0002 query:SELECTION; numEvents:10000000
0003 query:LOCAL_ITEM_SUGGESTION; numEvents:10000000
0004 query:AVERAGE_PRICE_FOR_CATEGORY; numEvents:1000000
0005 query:HOT_ITEMS; numEvents:10000000
0006 query:AVERAGE_SELLING_PRICE_BY_SELLER; numEvents:1000000
0007 query:HIGHEST_BID; numEvents:10000000
0008 query:MONITOR_NEW_USERS; numEvents:10000000
0009 query:WINNING_BIDS; numEvents:1000000
0010 query:LOG_TO_SHARDED_FILES; numEvents:10000000
0011 query:USER_SESSIONS; numEvents:10000000
0012 query:PROCESSING_TIME_WINDOWS; numEvents:10000000
0013 query:PORTABILITY_BATCH; numEvents:10000000
0014 query:RESHUFFLE; numEvents:10000000
0015 query:BOUNDED_SIDE_INPUT_JOIN; numEvents:10000000
0016 query:SESSION_SIDE_INPUT_JOIN; numEvents:10000000
Performance:
Conf Runtime(sec) (Baseline) Events(/sec) (Baseline) Results (Baseline)
0000 -1.0 -1.0 -1
*** Job was unexpectedly updated ***
0001 -1.0 -1.0 -1
*** Job was unexpectedly updated ***
0002 -1.0 -1.0 -1
*** Job was unexpectedly updated ***
0003 *** not run ***
0004 *** not run ***
0005 -1.0 -1.0 -1
*** Job was unexpectedly updated ***
0006 *** not run ***
0007 *** not run ***
0008 -1.0 -1.0 -1
*** Job was unexpectedly updated ***
0009 *** not run ***
0010 -1.0 -1.0 -1
*** Job was unexpectedly updated ***
0011 -1.0 -1.0 -1
*** Job was unexpectedly updated ***
0012 -1.0 -1.0 -1
*** Job was unexpectedly updated ***
0013 -1.0 -1.0 -1
*** Job was unexpectedly updated ***
0014 -1.0 -1.0 -1
*** Job was unexpectedly updated ***
0015 *** not run ***
0016 *** not run ***
==========================================================================================
Exception in thread "main" java.lang.RuntimeException: Execution was not successful
at org.apache.beam.sdk.nexmark.Main.runAll(Main.java:169)
at org.apache.beam.sdk.nexmark.Main.main(Main.java:441)
> Task :sdks:java:testing:nexmark:run FAILED
> Task :runners:google-cloud-dataflow-java:cleanUpDockerJavaImages
Untagged: us.gcr.io/apache-beam-testing/java-postcommit-it/java:20230219152443
Untagged: us.gcr.io/apache-beam-testing/java-postcommit-it/java@sha256:39f083164182cfae1516042184d85e660a2aa5a13d9d0f98c2ad6422e797a38e
WARNING: Successfully resolved tag to sha256, but it is recommended to use sha256 directly.
Tag: [us.gcr.io/apache-beam-testing/java-postcommit-it/java:20230219152443]
- referencing digest: [us.gcr.io/apache-beam-testing/java-postcommit-it/java@sha256:39f083164182cfae1516042184d85e660a2aa5a13d9d0f98c2ad6422e797a38e]
Deleted [[us.gcr.io/apache-beam-testing/java-postcommit-it/java:20230219152443] (referencing [us.gcr.io/apache-beam-testing/java-postcommit-it/java@sha256:39f083164182cfae1516042184d85e660a2aa5a13d9d0f98c2ad6422e797a38e])].
Removing untagged image us.gcr.io/apache-beam-testing/java-postcommit-it/java@sha256:39f083164182cfae1516042184d85e660a2aa5a13d9d0f98c2ad6422e797a38e
Digests:
- us.gcr.io/apache-beam-testing/java-postcommit-it/java@sha256:39f083164182cfae1516042184d85e660a2aa5a13d9d0f98c2ad6422e797a38e
Deleted [us.gcr.io/apache-beam-testing/java-postcommit-it/java@sha256:39f083164182cfae1516042184d85e660a2aa5a13d9d0f98c2ad6422e797a38e].
FAILURE: Build failed with an exception.
* What went wrong:
Execution failed for task ':sdks:java:testing:nexmark:run'.
> Process 'command '/usr/lib/jvm/java-8-openjdk-amd64/bin/java'' finished with non-zero exit value 1
* Try:
> Run with --stacktrace option to get the stack trace.
> Run with --info or --debug option to get more log output.
* Get more help at https://help.gradle.org
Deprecated Gradle features were used in this build, making it incompatible with Gradle 8.0.
You can use '--warning-mode all' to show the individual deprecation warnings and determine if they come from your own scripts or plugins.
See https://docs.gradle.org/7.5.1/userguide/command_line_interface.html#sec:command_line_warnings
Execution optimizations have been disabled for 1 invalid unit(s) of work during this build to ensure correctness.
Please consult deprecation warnings for more details.
BUILD FAILED in 7m 40s
140 actionable tasks: 94 executed, 42 from cache, 4 up-to-date
Publishing build scan...
https://gradle.com/s/nnmlj4xzfcchi
Build step 'Invoke Gradle script' changed build result to FAILURE
Build step 'Invoke Gradle script' marked build as failure
---------------------------------------------------------------------
To unsubscribe, e-mail: builds-unsubscribe@beam.apache.org
For additional commands, e-mail: builds-help@beam.apache.org