You are viewing a plain text version of this content. The canonical link for it is here.
Posted to builds@mesos.apache.org by Apache Jenkins Server <je...@builds.apache.org> on 2017/01/16 22:57:08 UTC
Build failed in Jenkins: Mesos-Buildbot » cmake,clang,--verbose --enable-libevent --enable-ssl,GLOG_v=1 MESOS_VERBOSE=1,ubuntu:14.04,(docker||Hadoop)&&(!ubuntu-us1)&&(!ubuntu-6)&&(!ubuntu-eu2) #3116
See <https://builds.apache.org/job/Mesos-Buildbot/BUILDTOOL=cmake,COMPILER=clang,CONFIGURATION=--verbose%20--enable-libevent%20--enable-ssl,ENVIRONMENT=GLOG_v=1%20MESOS_VERBOSE=1,OS=ubuntu%3A14.04,label_exp=(docker%7C%7CHadoop)&&(!ubuntu-us1)&&(!ubuntu-6)&&(!ubuntu-eu2)/3116/>
------------------------------------------
[...truncated 170895 lines...]
[ OK ] Endpoint/SlaveEndpointTest.AuthorizedRequest/0 (21 ms)
[ RUN ] Endpoint/SlaveEndpointTest.AuthorizedRequest/1
I0116 22:56:21.472702 25279 containerizer.cpp:220] Using isolation: posix/cpu,posix/mem,filesystem/posix,network/cni
W0116 22:56:21.473315 25279 backend.cpp:76] Failed to create 'aufs' backend: AufsBackend requires root privileges, but is running as user mesos
W0116 22:56:21.473430 25279 backend.cpp:76] Failed to create 'bind' backend: BindBackend requires root privileges
I0116 22:56:21.474766 25291 slave.cpp:209] Mesos agent started on (675)@172.17.0.4:33919
I0116 22:56:21.474795 25291 slave.cpp:210] Flags at startup: --acls="" --appc_simple_discovery_uri_prefix="http://" --appc_store_dir="/tmp/mesos/store/appc" --authenticate_http_readonly="true" --authenticate_http_readwrite="true" --authenticatee="crammd5" --authentication_backoff_factor="1secs" --authorizer="local" --cgroups_cpu_enable_pids_and_tids_count="false" --cgroups_enable_cfs="false" --cgroups_hierarchy="/sys/fs/cgroup" --cgroups_limit_swap="false" --cgroups_root="mesos" --container_disk_watch_interval="15secs" --containerizers="mesos" --credential="/tmp/Endpoint_SlaveEndpointTest_AuthorizedRequest_1_r0LGAb/credential" --default_role="*" --disk_watch_interval="1mins" --docker="docker" --docker_kill_orphans="true" --docker_registry="https://registry-1.docker.io" --docker_remove_delay="6hrs" --docker_socket="/var/run/docker.sock" --docker_stop_timeout="0ns" --docker_store_dir="/tmp/mesos/store/docker" --docker_volume_checkpoint_dir="/var/run/mesos/isolators/docker/volume" --enforce_container_disk_quota="false" --executor_registration_timeout="1mins" --executor_shutdown_grace_period="5secs" --fetcher_cache_dir="/tmp/Endpoint_SlaveEndpointTest_AuthorizedRequest_1_r0LGAb/fetch" --fetcher_cache_size="2GB" --frameworks_home="" --gc_delay="1weeks" --gc_disk_headroom="0.1" --hadoop_home="" --help="false" --hostname_lookup="true" --http_authenticators="basic" --http_command_executor="false" --http_credentials="/tmp/Endpoint_SlaveEndpointTest_AuthorizedRequest_1_r0LGAb/http_credentials" --http_heartbeat_interval="30secs" --image_provisioner_backend="copy" --initialize_driver_logging="true" --isolation="posix/cpu,posix/mem" --launcher="posix" --launcher_dir="/mesos/build/src" --logbufsecs="0" --logging_level="INFO" --max_completed_executors_per_framework="150" --oversubscribed_resources_interval="15secs" --perf_duration="10secs" --perf_interval="1mins" --qos_correction_interval_min="0ns" --quiet="false" --recover="reconnect" --recovery_timeout="15mins" --registration_backoff_factor="10ms" --resources="cpus:2;gpus:0;mem:1024;disk:1024;ports:[31000-32000]" --revocable_cpu_low_priority="true" --runtime_dir="/tmp/Endpoint_SlaveEndpointTest_AuthorizedRequest_1_r0LGAb" --sandbox_directory="/mnt/mesos/sandbox" --strict="true" --switch_user="true" --systemd_enable_support="true" --systemd_runtime_directory="/run/systemd/system" --version="false" --work_dir="/tmp/Endpoint_SlaveEndpointTest_AuthorizedRequest_1_burvAy"
I0116 22:56:21.475188 25291 credentials.hpp:86] Loading credential for authentication from '/tmp/Endpoint_SlaveEndpointTest_AuthorizedRequest_1_r0LGAb/credential'
I0116 22:56:21.475394 25291 slave.cpp:352] Agent using credential for: test-principal
I0116 22:56:21.475412 25291 credentials.hpp:37] Loading credentials for authentication from '/tmp/Endpoint_SlaveEndpointTest_AuthorizedRequest_1_r0LGAb/http_credentials'
I0116 22:56:21.475551 25291 http.cpp:922] Using default 'basic' HTTP authenticator for realm 'mesos-agent-readonly'
I0116 22:56:21.475615 25291 http.cpp:922] Using default 'basic' HTTP authenticator for realm 'mesos-agent-readwrite'
I0116 22:56:21.475944 25291 slave.cpp:539] Agent resources: cpus(*):2; mem(*):1024; disk(*):1024; ports(*):[31000-32000]
I0116 22:56:21.475982 25291 slave.cpp:547] Agent attributes: [ ]
I0116 22:56:21.475987 25291 slave.cpp:552] Agent hostname: 3a1d07e4d5f6
I0116 22:56:21.476472 25291 state.cpp:60] Recovering state from '/tmp/Endpoint_SlaveEndpointTest_AuthorizedRequest_1_burvAy/meta'
I0116 22:56:21.476595 25291 status_update_manager.cpp:203] Recovering status update manager
I0116 22:56:21.476642 25291 containerizer.cpp:599] Recovering containerizer
I0116 22:56:21.477018 25291 provisioner.cpp:251] Provisioner recovery complete
I0116 22:56:21.477123 25291 slave.cpp:5417] Finished recovery
I0116 22:56:21.477494 25291 slave.cpp:5591] Querying resource estimator for oversubscribable resources
I0116 22:56:21.477617 25291 slave.cpp:5605] Received oversubscribable resources {} from the resource estimator
I0116 22:56:21.478399 25291 process.cpp:3676] Handling HTTP event for process 'slave(675)' with path: '/slave(675)/monitor/statistics.json'
I0116 22:56:21.478693 25291 http.cpp:874] Authorizing principal 'test-principal' to GET the '/monitor/statistics.json' endpoint
I0116 22:56:21.479972 25285 slave.cpp:796] Agent terminating
[ OK ] Endpoint/SlaveEndpointTest.AuthorizedRequest/1 (14 ms)
[ RUN ] Endpoint/SlaveEndpointTest.AuthorizedRequest/2
I0116 22:56:21.486659 25279 containerizer.cpp:220] Using isolation: posix/cpu,posix/mem,filesystem/posix,network/cni
W0116 22:56:21.487089 25279 backend.cpp:76] Failed to create 'aufs' backend: AufsBackend requires root privileges, but is running as user mesos
W0116 22:56:21.487177 25279 backend.cpp:76] Failed to create 'bind' backend: BindBackend requires root privileges
I0116 22:56:21.488459 25292 slave.cpp:209] Mesos agent started on (676)@172.17.0.4:33919
I0116 22:56:21.488489 25292 slave.cpp:210] Flags at startup: --acls="" --appc_simple_discovery_uri_prefix="http://" --appc_store_dir="/tmp/mesos/store/appc" --authenticate_http_readonly="true" --authenticate_http_readwrite="true" --authenticatee="crammd5" --authentication_backoff_factor="1secs" --authorizer="local" --cgroups_cpu_enable_pids_and_tids_count="false" --cgroups_enable_cfs="false" --cgroups_hierarchy="/sys/fs/cgroup" --cgroups_limit_swap="false" --cgroups_root="mesos" --container_disk_watch_interval="15secs" --containerizers="mesos" --credential="/tmp/Endpoint_SlaveEndpointTest_AuthorizedRequest_2_q7Z8IH/credential" --default_role="*" --disk_watch_interval="1mins" --docker="docker" --docker_kill_orphans="true" --docker_registry="https://registry-1.docker.io" --docker_remove_delay="6hrs" --docker_socket="/var/run/docker.sock" --docker_stop_timeout="0ns" --docker_store_dir="/tmp/mesos/store/docker" --docker_volume_checkpoint_dir="/var/run/mesos/isolators/docker/volume" --enforce_container_disk_quota="false" --executor_registration_timeout="1mins" --executor_shutdown_grace_period="5secs" --fetcher_cache_dir="/tmp/Endpoint_SlaveEndpointTest_AuthorizedRequest_2_q7Z8IH/fetch" --fetcher_cache_size="2GB" --frameworks_home="" --gc_delay="1weeks" --gc_disk_headroom="0.1" --hadoop_home="" --help="false" --hostname_lookup="true" --http_authenticators="basic" --http_command_executor="false" --http_credentials="/tmp/Endpoint_SlaveEndpointTest_AuthorizedRequest_2_q7Z8IH/http_credentials" --http_heartbeat_interval="30secs" --image_provisioner_backend="copy" --initialize_driver_logging="true" --isolation="posix/cpu,posix/mem" --launcher="posix" --launcher_dir="/mesos/build/src" --logbufsecs="0" --logging_level="INFO" --max_completed_executors_per_framework="150" --oversubscribed_resources_interval="15secs" --perf_duration="10secs" --perf_interval="1mins" --qos_correction_interval_min="0ns" --quiet="false" --recover="reconnect" --recovery_timeout="15mins" --registration_backoff_factor="10ms" --resources="cpus:2;gpus:0;mem:1024;disk:1024;ports:[31000-32000]" --revocable_cpu_low_priority="true" --runtime_dir="/tmp/Endpoint_SlaveEndpointTest_AuthorizedRequest_2_q7Z8IH" --sandbox_directory="/mnt/mesos/sandbox" --strict="true" --switch_user="true" --systemd_enable_support="true" --systemd_runtime_directory="/run/systemd/system" --version="false" --work_dir="/tmp/Endpoint_SlaveEndpointTest_AuthorizedRequest_2_wKUFG4"
I0116 22:56:21.488836 25292 credentials.hpp:86] Loading credential for authentication from '/tmp/Endpoint_SlaveEndpointTest_AuthorizedRequest_2_q7Z8IH/credential'
I0116 22:56:21.488960 25292 slave.cpp:352] Agent using credential for: test-principal
I0116 22:56:21.488978 25292 credentials.hpp:37] Loading credentials for authentication from '/tmp/Endpoint_SlaveEndpointTest_AuthorizedRequest_2_q7Z8IH/http_credentials'
I0116 22:56:21.489131 25292 http.cpp:922] Using default 'basic' HTTP authenticator for realm 'mesos-agent-readonly'
I0116 22:56:21.489192 25292 http.cpp:922] Using default 'basic' HTTP authenticator for realm 'mesos-agent-readwrite'
I0116 22:56:21.489610 25292 slave.cpp:539] Agent resources: cpus(*):2; mem(*):1024; disk(*):1024; ports(*):[31000-32000]
I0116 22:56:21.489657 25292 slave.cpp:547] Agent attributes: [ ]
I0116 22:56:21.489668 25292 slave.cpp:552] Agent hostname: 3a1d07e4d5f6
I0116 22:56:21.490241 25292 state.cpp:60] Recovering state from '/tmp/Endpoint_SlaveEndpointTest_AuthorizedRequest_2_wKUFG4/meta'
I0116 22:56:21.490376 25292 status_update_manager.cpp:203] Recovering status update manager
I0116 22:56:21.490425 25292 containerizer.cpp:599] Recovering containerizer
I0116 22:56:21.490818 25292 provisioner.cpp:251] Provisioner recovery complete
I0116 22:56:21.490931 25292 slave.cpp:5417] Finished recovery
I0116 22:56:21.491366 25292 slave.cpp:5591] Querying resource estimator for oversubscribable resources
I0116 22:56:21.491542 25292 slave.cpp:5605] Received oversubscribable resources {} from the resource estimator
I0116 22:56:21.492395 25292 process.cpp:3676] Handling HTTP event for process 'slave(676)' with path: '/slave(676)/containers'
I0116 22:56:21.492748 25292 http.cpp:874] Authorizing principal 'test-principal' to GET the '/containers' endpoint
I0116 22:56:21.493794 25285 slave.cpp:796] Agent terminating
[ OK ] Endpoint/SlaveEndpointTest.AuthorizedRequest/2 (13 ms)
[ RUN ] Endpoint/SlaveEndpointTest.UnauthorizedRequest/0
I0116 22:56:21.500207 25279 containerizer.cpp:220] Using isolation: posix/cpu,posix/mem,filesystem/posix,network/cni
W0116 22:56:21.500638 25279 backend.cpp:76] Failed to create 'aufs' backend: AufsBackend requires root privileges, but is running as user mesos
W0116 22:56:21.500730 25279 backend.cpp:76] Failed to create 'bind' backend: BindBackend requires root privileges
I0116 22:56:21.502324 25295 slave.cpp:209] Mesos agent started on (677)@172.17.0.4:33919
I0116 22:56:21.502612 25295 slave.cpp:210] Flags at startup: --acls="" --appc_simple_discovery_uri_prefix="http://" --appc_store_dir="/tmp/mesos/store/appc" --authenticate_http_readonly="true" --authenticate_http_readwrite="true" --authenticatee="crammd5" --authentication_backoff_factor="1secs" --authorizer="local" --cgroups_cpu_enable_pids_and_tids_count="false" --cgroups_enable_cfs="false" --cgroups_hierarchy="/sys/fs/cgroup" --cgroups_limit_swap="false" --cgroups_root="mesos" --container_disk_watch_interval="15secs" --containerizers="mesos" --credential="/tmp/Endpoint_SlaveEndpointTest_UnauthorizedRequest_0_QYEy0d/credential" --default_role="*" --disk_watch_interval="1mins" --docker="docker" --docker_kill_orphans="true" --docker_registry="https://registry-1.docker.io" --docker_remove_delay="6hrs" --docker_socket="/var/run/docker.sock" --docker_stop_timeout="0ns" --docker_store_dir="/tmp/mesos/store/docker" --docker_volume_checkpoint_dir="/var/run/mesos/isolators/docker/volume" --enforce_container_disk_quota="false" --executor_registration_timeout="1mins" --executor_shutdown_grace_period="5secs" --fetcher_cache_dir="/tmp/Endpoint_SlaveEndpointTest_UnauthorizedRequest_0_QYEy0d/fetch" --fetcher_cache_size="2GB" --frameworks_home="" --gc_delay="1weeks" --gc_disk_headroom="0.1" --hadoop_home="" --help="false" --hostname_lookup="true" --http_authenticators="basic" --http_command_executor="false" --http_credentials="/tmp/Endpoint_SlaveEndpointTest_UnauthorizedRequest_0_QYEy0d/http_credentials" --http_heartbeat_interval="30secs" --image_provisioner_backend="copy" --initialize_driver_logging="true" --isolation="posix/cpu,posix/mem" --launcher="posix" --launcher_dir="/mesos/build/src" --logbufsecs="0" --logging_level="INFO" --max_completed_executors_per_framework="150" --oversubscribed_resources_interval="15secs" --perf_duration="10secs" --perf_interval="1mins" --qos_correction_interval_min="0ns" --quiet="false" --recover="reconnect" --recovery_timeout="15mins" --registration_backoff_factor="10ms" --resources="cpus:2;gpus:0;mem:1024;disk:1024;ports:[31000-32000]" --revocable_cpu_low_priority="true" --runtime_dir="/tmp/Endpoint_SlaveEndpointTest_UnauthorizedRequest_0_QYEy0d" --sandbox_directory="/mnt/mesos/sandbox" --strict="true" --switch_user="true" --systemd_enable_support="true" --systemd_runtime_directory="/run/systemd/system" --version="false" --work_dir="/tmp/Endpoint_SlaveEndpointTest_UnauthorizedRequest_0_qjIQVA"
I0116 22:56:21.502907 25295 credentials.hpp:86] Loading credential for authentication from '/tmp/Endpoint_SlaveEndpointTest_UnauthorizedRequest_0_QYEy0d/credential'
I0116 22:56:21.503031 25295 slave.cpp:352] Agent using credential for: test-principal
I0116 22:56:21.503044 25295 credentials.hpp:37] Loading credentials for authentication from '/tmp/Endpoint_SlaveEndpointTest_UnauthorizedRequest_0_QYEy0d/http_credentials'
I0116 22:56:21.503238 25295 http.cpp:922] Using default 'basic' HTTP authenticator for realm 'mesos-agent-readonly'
I0116 22:56:21.503301 25295 http.cpp:922] Using default 'basic' HTTP authenticator for realm 'mesos-agent-readwrite'
I0116 22:56:21.503679 25295 slave.cpp:539] Agent resources: cpus(*):2; mem(*):1024; disk(*):1024; ports(*):[31000-32000]
I0116 22:56:21.503712 25295 slave.cpp:547] Agent attributes: [ ]
I0116 22:56:21.503722 25295 slave.cpp:552] Agent hostname: 3a1d07e4d5f6
I0116 22:56:21.504317 25293 state.cpp:60] Recovering state from '/tmp/Endpoint_SlaveEndpointTest_UnauthorizedRequest_0_qjIQVA/meta'
I0116 22:56:21.504474 25293 status_update_manager.cpp:203] Recovering status update manager
I0116 22:56:21.504565 25293 containerizer.cpp:599] Recovering containerizer
I0116 22:56:21.505054 25293 provisioner.cpp:251] Provisioner recovery complete
I0116 22:56:21.505223 25293 slave.cpp:5417] Finished recovery
I0116 22:56:21.505645 25293 slave.cpp:5591] Querying resource estimator for oversubscribable resources
I0116 22:56:21.505823 25293 slave.cpp:5605] Received oversubscribable resources {} from the resource estimator
I0116 22:56:21.506577 25293 process.cpp:3676] Handling HTTP event for process 'slave(677)' with path: '/slave(677)/monitor/statistics'
I0116 22:56:21.506865 25293 http.cpp:874] Authorizing principal 'test-principal' to GET the '/monitor/statistics' endpoint
I0116 22:56:21.507817 25290 slave.cpp:796] Agent terminating
[ OK ] Endpoint/SlaveEndpointTest.UnauthorizedRequest/0 (13 ms)
[ RUN ] Endpoint/SlaveEndpointTest.UnauthorizedRequest/1
I0116 22:56:21.513659 25279 containerizer.cpp:220] Using isolation: posix/cpu,posix/mem,filesystem/posix,network/cni
W0116 22:56:21.514065 25279 backend.cpp:76] Failed to create 'aufs' backend: AufsBackend requires root privileges, but is running as user mesos
W0116 22:56:21.514150 25279 backend.cpp:76] Failed to create 'bind' backend: BindBackend requires root privileges
I0116 22:56:21.515319 25285 slave.cpp:209] Mesos agent started on (678)@172.17.0.4:33919
I0116 22:56:21.515347 25285 slave.cpp:210] Flags at startup: --acls="" --appc_simple_discovery_uri_prefix="http://" --appc_store_dir="/tmp/mesos/store/appc" --authenticate_http_readonly="true" --authenticate_http_readwrite="true" --authenticatee="crammd5" --authentication_backoff_factor="1secs" --authorizer="local" --cgroups_cpu_enable_pids_and_tids_count="false" --cgroups_enable_cfs="false" --cgroups_hierarchy="/sys/fs/cgroup" --cgroups_limit_swap="false" --cgroups_root="mesos" --container_disk_watch_interval="15secs" --containerizers="mesos" --credential="/tmp/Endpoint_SlaveEndpointTest_UnauthorizedRequest_1_y1oVqK/credential" --default_role="*" --disk_watch_interval="1mins" --docker="docker" --docker_kill_orphans="true" --docker_registry="https://registry-1.docker.io" --docker_remove_delay="6hrs" --docker_socket="/var/run/docker.sock" --docker_stop_timeout="0ns" --docker_store_dir="/tmp/mesos/store/docker" --docker_volume_checkpoint_dir="/var/run/mesos/isolators/docker/volume" --enforce_container_disk_quota="false" --executor_registration_timeout="1mins" --executor_shutdown_grace_period="5secs" --fetcher_cache_dir="/tmp/Endpoint_SlaveEndpointTest_UnauthorizedRequest_1_y1oVqK/fetch" --fetcher_cache_size="2GB" --frameworks_home="" --gc_delay="1weeks" --gc_disk_headroom="0.1" --hadoop_home="" --help="false" --hostname_lookup="true" --http_authenticators="basic" --http_command_executor="false" --http_credentials="/tmp/Endpoint_SlaveEndpointTest_UnauthorizedRequest_1_y1oVqK/http_credentials" --http_heartbeat_interval="30secs" --image_provisioner_backend="copy" --initialize_driver_logging="true" --isolation="posix/cpu,posix/mem" --launcher="posix" --launcher_dir="/mesos/build/src" --logbufsecs="0" --logging_level="INFO" --max_completed_executors_per_framework="150" --oversubscribed_resources_interval="15secs" --perf_duration="10secs" --perf_interval="1mins" --qos_correction_interval_min="0ns" --quiet="false" --recover="reconnect" --recovery_timeout="15mins" --registration_backoff_factor="10ms" --resources="cpus:2;gpus:0;mem:1024;disk:1024;ports:[31000-32000]" --revocable_cpu_low_priority="true" --runtime_dir="/tmp/Endpoint_SlaveEndpointTest_UnauthorizedRequest_1_y1oVqK" --sandbox_directory="/mnt/mesos/sandbox" --strict="true" --switch_user="true" --systemd_enable_support="true" --systemd_runtime_directory="/run/systemd/system" --version="false" --work_dir="/tmp/Endpoint_SlaveEndpointTest_UnauthorizedRequest_1_zyy0j7"
I0116 22:56:21.515822 25285 credentials.hpp:86] Loading credential for authentication from '/tmp/Endpoint_SlaveEndpointTest_UnauthorizedRequest_1_y1oVqK/credential'
I0116 22:56:21.515938 25285 slave.cpp:352] Agent using credential for: test-principal
I0116 22:56:21.515951 25285 credentials.hpp:37] Loading credentials for authentication from '/tmp/Endpoint_SlaveEndpointTest_UnauthorizedRequest_1_y1oVqK/http_credentials'
I0116 22:56:21.516103 25285 http.cpp:922] Using default 'basic' HTTP authenticator for realm 'mesos-agent-readonly'
I0116 22:56:21.516160 25285 http.cpp:922] Using default 'basic' HTTP authenticator for realm 'mesos-agent-readwrite'
I0116 22:56:21.516500 25285 slave.cpp:539] Agent resources: cpus(*):2; mem(*):1024; disk(*):1024; ports(*):[31000-32000]
I0116 22:56:21.516533 25285 slave.cpp:547] Agent attributes: [ ]
I0116 22:56:21.516542 25285 slave.cpp:552] Agent hostname: 3a1d07e4d5f6
I0116 22:56:21.517124 25284 state.cpp:60] Recovering state from '/tmp/Endpoint_SlaveEndpointTest_UnauthorizedRequest_1_zyy0j7/meta'
I0116 22:56:21.517382 25284 status_update_manager.cpp:203] Recovering status update manager
I0116 22:56:21.517628 25294 containerizer.cpp:599] Recovering containerizer
I0116 22:56:21.518127 25294 provisioner.cpp:251] Provisioner recovery complete
I0116 22:56:21.518271 25284 slave.cpp:5417] Finished recovery
I0116 22:56:21.518735 25284 slave.cpp:5591] Querying resource estimator for oversubscribable resources
I0116 22:56:21.518879 25284 slave.cpp:5605] Received oversubscribable resources {} from the resource estimator
I0116 22:56:21.519809 25280 process.cpp:3676] Handling HTTP event for process 'slave(678)' with path: '/slave(678)/monitor/statistics.json'
I0116 22:56:21.520352 25280 http.cpp:874] Authorizing principal 'test-principal' to GET the '/monitor/statistics.json' endpoint
I0116 22:56:21.521363 25279 slave.cpp:796] Agent terminating
[ OK ] Endpoint/SlaveEndpointTest.UnauthorizedRequest/1 (13 ms)
[ RUN ] Endpoint/SlaveEndpointTest.UnauthorizedRequest/2
I0116 22:56:21.527043 25279 containerizer.cpp:220] Using isolation: posix/cpu,posix/mem,filesystem/posix,network/cni
W0116 22:56:21.527428 25279 backend.cpp:76] Failed to create 'aufs' backend: AufsBackend requires root privileges, but is running as user mesos
W0116 22:56:21.527643 25279 backend.cpp:76] Failed to create 'bind' backend: BindBackend requires root privileges
I0116 22:56:21.529171 25290 slave.cpp:209] Mesos agent started on (679)@172.17.0.4:33919
I0116 22:56:21.529345 25290 slave.cpp:210] Flags at startup: --acls="" --appc_simple_discovery_uri_prefix="http://" --appc_store_dir="/tmp/mesos/store/appc" --authenticate_http_readonly="true" --authenticate_http_readwrite="true" --authenticatee="crammd5" --authentication_backoff_factor="1secs" --authorizer="local" --cgroups_cpu_enable_pids_and_tids_count="false" --cgroups_enable_cfs="false" --cgroups_hierarchy="/sys/fs/cgroup" --cgroups_limit_swap="false" --cgroups_root="mesos" --container_disk_watch_interval="15secs" --containerizers="mesos" --credential="/tmp/Endpoint_SlaveEndpointTest_UnauthorizedRequest_2_hmfZZg/credential" --default_role="*" --disk_watch_interval="1mins" --docker="docker" --docker_kill_orphans="true" --docker_registry="https://registry-1.docker.io" --docker_remove_delay="6hrs" --docker_socket="/var/run/docker.sock" --docker_stop_timeout="0ns" --docker_store_dir="/tmp/mesos/store/docker" --docker_volume_checkpoint_dir="/var/run/mesos/isolators/docker/volume" --enforce_container_disk_quota="false" --executor_registration_timeout="1mins" --executor_shutdown_grace_period="5secs" --fetcher_cache_dir="/tmp/Endpoint_SlaveEndpointTest_UnauthorizedRequest_2_hmfZZg/fetch" --fetcher_cache_size="2GB" --frameworks_home="" --gc_delay="1weeks" --gc_disk_headroom="0.1" --hadoop_home="" --help="false" --hostname_lookup="true" --http_authenticators="basic" --http_command_executor="false" --http_credentials="/tmp/Endpoint_SlaveEndpointTest_UnauthorizedRequest_2_hmfZZg/http_credentials" --http_heartbeat_interval="30secs" --image_provisioner_backend="copy" --initialize_driver_logging="true" --isolation="posix/cpu,posix/mem" --launcher="posix" --launcher_dir="/mesos/build/src" --logbufsecs="0" --logging_level="INFO" --max_completed_executors_per_framework="150" --oversubscribed_resources_interval="15secs" --perf_duration="10secs" --perf_interval="1mins" --qos_correction_interval_min="0ns" --quiet="false" --recover="reconnect" --recovery_timeout="15mins" --registration_backoff_factor="10ms" --resources="cpus:2;gpus:0;mem:1024;disk:1024;ports:[31000-32000]" --revocable_cpu_low_priority="true" --runtime_dir="/tmp/Endpoint_SlaveEndpointTest_UnauthorizedRequest_2_hmfZZg" --sandbox_directory="/mnt/mesos/sandbox" --strict="true" --switch_user="true" --systemd_enable_support="true" --systemd_runtime_directory="/run/systemd/system" --version="false" --work_dir="/tmp/Endpoint_SlaveEndpointTest_UnauthorizedRequest_2_ZAESQD"
I0116 22:56:21.529841 25290 credentials.hpp:86] Loading credential for authentication from '/tmp/Endpoint_SlaveEndpointTest_UnauthorizedRequest_2_hmfZZg/credential'
I0116 22:56:21.530079 25290 slave.cpp:352] Agent using credential for: test-principal
I0116 22:56:21.530094 25290 credentials.hpp:37] Loading credentials for authentication from '/tmp/Endpoint_SlaveEndpointTest_UnauthorizedRequest_2_hmfZZg/http_credentials'
I0116 22:56:21.530267 25290 http.cpp:922] Using default 'basic' HTTP authenticator for realm 'mesos-agent-readonly'
I0116 22:56:21.530359 25290 http.cpp:922] Using default 'basic' HTTP authenticator for realm 'mesos-agent-readwrite'
I0116 22:56:21.530809 25290 slave.cpp:539] Agent resources: cpus(*):2; mem(*):1024; disk(*):1024; ports(*):[31000-32000]
I0116 22:56:21.530843 25290 slave.cpp:547] Agent attributes: [ ]
I0116 22:56:21.530850 25290 slave.cpp:552] Agent hostname: 3a1d07e4d5f6
I0116 22:56:21.531440 25290 state.cpp:60] Recovering state from '/tmp/Endpoint_SlaveEndpointTest_UnauthorizedRequest_2_ZAESQD/meta'
I0116 22:56:21.531755 25288 status_update_manager.cpp:203] Recovering status update manager
I0116 22:56:21.531841 25288 containerizer.cpp:599] Recovering containerizer
I0116 22:56:21.532428 25285 provisioner.cpp:251] Provisioner recovery complete
I0116 22:56:21.532670 25291 slave.cpp:5417] Finished recovery
I0116 22:56:21.533411 25291 slave.cpp:5591] Querying resource estimator for oversubscribable resources
I0116 22:56:21.533534 25291 slave.cpp:5605] Received oversubscribable resources {} from the resource estimator
I0116 22:56:21.534381 25291 process.cpp:3676] Handling HTTP event for process 'slave(679)' with path: '/slave(679)/containers'
I0116 22:56:21.534746 25291 http.cpp:874] Authorizing principal 'test-principal' to GET the '/containers' endpoint
I0116 22:56:21.535692 25279 slave.cpp:796] Agent terminating
[ OK ] Endpoint/SlaveEndpointTest.UnauthorizedRequest/2 (14 ms)
[ RUN ] Endpoint/SlaveEndpointTest.NoAuthorizer/0
I0116 22:56:21.542310 25279 containerizer.cpp:220] Using isolation: posix/cpu,posix/mem,filesystem/posix,network/cni
W0116 22:56:21.542739 25279 backend.cpp:76] Failed to create 'aufs' backend: AufsBackend requires root privileges, but is running as user mesos
W0116 22:56:21.542839 25279 backend.cpp:76] Failed to create 'bind' backend: BindBackend requires root privileges
I0116 22:56:21.543650 25279 cluster.cpp:446] Creating default 'local' authorizer
I0116 22:56:21.544312 25287 slave.cpp:209] Mesos agent started on (680)@172.17.0.4:33919
I0116 22:56:21.544347 25287 slave.cpp:210] Flags at startup: --acls="" --appc_simple_discovery_uri_prefix="http://" --appc_store_dir="/tmp/mesos/store/appc" --authenticate_http_readonly="true" --authenticate_http_readwrite="true" --authenticatee="crammd5" --authentication_backoff_factor="1secs" --authorizer="local" --cgroups_cpu_enable_pids_and_tids_count="false" --cgroups_enable_cfs="false" --cgroups_hierarchy="/sys/fs/cgroup" --cgroups_limit_swap="false" --cgroups_root="mesos" --container_disk_watch_interval="15secs" --containerizers="mesos" --credential="/tmp/Endpoint_SlaveEndpointTest_NoAuthorizer_0_VsTGIN/credential" --default_role="*" --disk_watch_interval="1mins" --docker="docker" --docker_kill_orphans="true" --docker_registry="https://registry-1.docker.io" --docker_remove_delay="6hrs" --docker_socket="/var/run/docker.sock" --docker_stop_timeout="0ns" --docker_store_dir="/tmp/mesos/store/docker" --docker_volume_checkpoint_dir="/var/run/mesos/isolators/docker/volume" --enforce_container_disk_quota="false" --executor_registration_timeout="1mins" --executor_shutdown_grace_period="5secs" --fetcher_cache_dir="/tmp/Endpoint_SlaveEndpointTest_NoAuthorizer_0_VsTGIN/fetch" --fetcher_cache_size="2GB" --frameworks_home="" --gc_delay="1weeks" --gc_disk_headroom="0.1" --hadoop_home="" --help="false" --hostname_lookup="true" --http_authenticators="basic" --http_command_executor="false" --http_credentials="/tmp/Endpoint_SlaveEndpointTest_NoAuthorizer_0_VsTGIN/http_credentials" --http_heartbeat_interval="30secs" --image_provisioner_backend="copy" --initialize_driver_logging="true" --isolation="posix/cpu,posix/mem" --launcher="posix" --launcher_dir="/mesos/build/src" --logbufsecs="0" --logging_level="INFO" --max_completed_executors_per_framework="150" --oversubscribed_resources_interval="15secs" --perf_duration="10secs" --perf_interval="1mins" --qos_correction_interval_min="0ns" --quiet="false" --recover="reconnect" --recovery_timeout="15mins" --registration_backoff_factor="10ms" --resources="cpus:2;gpus:0;mem:1024;disk:1024;ports:[31000-32000]" --revocable_cpu_low_priority="true" --runtime_dir="/tmp/Endpoint_SlaveEndpointTest_NoAuthorizer_0_VsTGIN" --sandbox_directory="/mnt/mesos/sandbox" --strict="true" --switch_user="true" --systemd_enable_support="true" --systemd_runtime_directory="/run/systemd/system" --version="false" --work_dir="/tmp/Endpoint_SlaveEndpointTest_NoAuthorizer_0_Ojo9wa"
I0116 22:56:21.544802 25287 credentials.hpp:86] Loading credential for authentication from '/tmp/Endpoint_SlaveEndpointTest_NoAuthorizer_0_VsTGIN/credential'
I0116 22:56:21.544920 25287 slave.cpp:352] Agent using credential for: test-principal
I0116 22:56:21.545023 25287 credentials.hpp:37] Loading credentials for authentication from '/tmp/Endpoint_SlaveEndpointTest_NoAuthorizer_0_VsTGIN/http_credentials'
I0116 22:56:21.545167 25287 http.cpp:922] Using default 'basic' HTTP authenticator for realm 'mesos-agent-readonly'
I0116 22:56:21.545296 25287 http.cpp:922] Using default 'basic' HTTP authenticator for realm 'mesos-agent-readwrite'
I0116 22:56:21.545763 25287 slave.cpp:539] Agent resources: cpus(*):2; mem(*):1024; disk(*):1024; ports(*):[31000-32000]
I0116 22:56:21.545805 25287 slave.cpp:547] Agent attributes: [ ]
I0116 22:56:21.545814 25287 slave.cpp:552] Agent hostname: 3a1d07e4d5f6
I0116 22:56:21.546344 25281 state.cpp:60] Recovering state from '/tmp/Endpoint_SlaveEndpointTest_NoAuthorizer_0_Ojo9wa/meta'
I0116 22:56:21.546597 25294 status_update_manager.cpp:203] Recovering status update manager
I0116 22:56:21.546871 25280 containerizer.cpp:599] Recovering containerizer
I0116 22:56:21.548084 25287 provisioner.cpp:251] Provisioner recovery complete
I0116 22:56:21.548193 25287 slave.cpp:5417] Finished recovery
I0116 22:56:21.548642 25287 slave.cpp:5591] Querying resource estimator for oversubscribable resources
I0116 22:56:21.553338 25283 slave.cpp:5605] Received oversubscribable resources {} from the resource estimator
I0116 22:56:21.554309 25283 process.cpp:3676] Handling HTTP event for process 'slave(680)' with path: '/slave(680)/monitor/statistics'
I0116 22:56:21.554738 25291 http.cpp:874] Authorizing principal 'test-principal' to GET the '/monitor/statistics' endpoint
I0116 22:56:21.556201 25280 slave.cpp:796] Agent terminating
[ OK ] Endpoint/SlaveEndpointTest.NoAuthorizer/0 (20 ms)
[ RUN ] Endpoint/SlaveEndpointTest.NoAuthorizer/1
I0116 22:56:21.562186 25279 containerizer.cpp:220] Using isolation: posix/cpu,posix/mem,filesystem/posix,network/cni
W0116 22:56:21.562511 25279 backend.cpp:76] Failed to create 'aufs' backend: AufsBackend requires root privileges, but is running as user mesos
W0116 22:56:21.562600 25279 backend.cpp:76] Failed to create 'bind' backend: BindBackend requires root privileges
I0116 22:56:21.563249 25279 cluster.cpp:446] Creating default 'local' authorizer
I0116 22:56:21.563733 25288 slave.cpp:209] Mesos agent started on (681)@172.17.0.4:33919
I0116 22:56:21.563913 25288 slave.cpp:210] Flags at startup: --acls="" --appc_simple_discovery_uri_prefix="http://" --appc_store_dir="/tmp/mesos/store/appc" --authenticate_http_readonly="true" --authenticate_http_readwrite="true" --authenticatee="crammd5" --authentication_backoff_factor="1secs" --authorizer="local" --cgroups_cpu_enable_pids_and_tids_count="false" --cgroups_enable_cfs="false" --cgroups_hierarchy="/sys/fs/cgroup" --cgroups_limit_swap="false" --cgroups_root="mesos" --container_disk_watch_interval="15secs" --containerizers="mesos" --credential="/tmp/Endpoint_SlaveEndpointTest_NoAuthorizer_1_6zVLDk/credential" --default_role="*" --disk_watch_interval="1mins" --docker="docker" --docker_kill_orphans="true" --docker_registry="https://registry-1.docker.io" --docker_remove_delay="6hrs" --docker_socket="/var/run/docker.sock" --docker_stop_timeout="0ns" --docker_store_dir="/tmp/mesos/store/docker" --docker_volume_checkpoint_dir="/var/run/mesos/isolators/docker/volume" --enforce_container_disk_quota="false" --executor_registration_timeout="1mins" --executor_shutdown_grace_period="5secs" --fetcher_cache_dir="/tmp/Endpoint_SlaveEndpointTest_NoAuthorizer_1_6zVLDk/fetch" --fetcher_cache_size="2GB" --frameworks_home="" --gc_delay="1weeks" --gc_disk_headroom="0.1" --hadoop_home="" --help="false" --hostname_lookup="true" --http_authenticators="basic" --http_command_executor="false" --http_credentials="/tmp/Endpoint_SlaveEndpointTest_NoAuthorizer_1_6zVLDk/http_credentials" --http_heartbeat_interval="30secs" --image_provisioner_backend="copy" --initialize_driver_logging="true" --isolation="posix/cpu,posix/mem" --launcher="posix" --launcher_dir="/mesos/build/src" --logbufsecs="0" --logging_level="INFO" --max_completed_executors_per_framework="150" --oversubscribed_resources_interval="15secs" --perf_duration="10secs" --perf_interval="1mins" --qos_correction_interval_min="0ns" --quiet="false" --recover="reconnect" --recovery_timeout="15mins" --registration_backoff_factor="10ms" --resources="cpus:2;gpus:0;mem:1024;disk:1024;ports:[31000-32000]" --revocable_cpu_low_priority="true" --runtime_dir="/tmp/Endpoint_SlaveEndpointTest_NoAuthorizer_1_6zVLDk" --sandbox_directory="/mnt/mesos/sandbox" --strict="true" --switch_user="true" --systemd_enable_support="true" --systemd_runtime_directory="/run/systemd/system" --version="false" --work_dir="/tmp/Endpoint_SlaveEndpointTest_NoAuthorizer_1_LZFXoH"
I0116 22:56:21.564283 25288 credentials.hpp:86] Loading credential for authentication from '/tmp/Endpoint_SlaveEndpointTest_NoAuthorizer_1_6zVLDk/credential'
I0116 22:56:21.564448 25288 slave.cpp:352] Agent using credential for: test-principal
I0116 22:56:21.564465 25288 credentials.hpp:37] Loading credentials for authentication from '/tmp/Endpoint_SlaveEndpointTest_NoAuthorizer_1_6zVLDk/http_credentials'
I0116 22:56:21.564615 25288 http.cpp:922] Using default 'basic' HTTP authenticator for realm 'mesos-agent-readonly'
I0116 22:56:21.564672 25288 http.cpp:922] Using default 'basic' HTTP authenticator for realm 'mesos-agent-readwrite'
I0116 22:56:21.565095 25288 slave.cpp:539] Agent resources: cpus(*):2; mem(*):1024; disk(*):1024; ports(*):[31000-32000]
I0116 22:56:21.565129 25288 slave.cpp:547] Agent attributes: [ ]
I0116 22:56:21.565137 25288 slave.cpp:552] Agent hostname: 3a1d07e4d5f6
I0116 22:56:21.565559 25288 state.cpp:60] Recovering state from '/tmp/Endpoint_SlaveEndpointTest_NoAuthorizer_1_LZFXoH/meta'
I0116 22:56:21.565747 25288 status_update_manager.cpp:203] Recovering status update manager
I0116 22:56:21.565841 25289 containerizer.cpp:599] Recovering containerizer
I0116 22:56:21.566490 25281 provisioner.cpp:251] Provisioner recovery complete
I0116 22:56:21.566743 25286 slave.cpp:5417] Finished recovery
I0116 22:56:21.567226 25286 slave.cpp:5591] Querying resource estimator for oversubscribable resources
I0116 22:56:21.567438 25289 slave.cpp:5605] Received oversubscribable resources {} from the resource estimator
I0116 22:56:21.568151 25288 process.cpp:3676] Handling HTTP event for process 'slave(681)' with path: '/slave(681)/monitor/statistics.json'
I0116 22:56:21.568665 25280 http.cpp:874] Authorizing principal 'test-principal' to GET the '/monitor/statistics.json' endpoint
I0116 22:56:21.570036 25291 slave.cpp:796] Agent terminating
[ OK ] Endpoint/SlaveEndpointTest.NoAuthorizer/1 (26 ms)
[ RUN ] Endpoint/SlaveEndpointTest.NoAuthorizer/2
I0116 22:56:21.588699 25279 containerizer.cpp:220] Using isolation: posix/cpu,posix/mem,filesystem/posix,network/cni
W0116 22:56:21.589056 25279 backend.cpp:76] Failed to create 'aufs' backend: AufsBackend requires root privileges, but is running as user mesos
W0116 22:56:21.589216 25279 backend.cpp:76] Failed to create 'bind' backend: BindBackend requires root privileges
I0116 22:56:21.589926 25279 cluster.cpp:446] Creating default 'local' authorizer
I0116 22:56:21.590433 25294 slave.cpp:209] Mesos agent started on (682)@172.17.0.4:33919
I0116 22:56:21.590463 25294 slave.cpp:210] Flags at startup: --acls="" --appc_simple_discovery_uri_prefix="http://" --appc_store_dir="/tmp/mesos/store/appc" --authenticate_http_readonly="true" --authenticate_http_readwrite="true" --authenticatee="crammd5" --authentication_backoff_factor="1secs" --authorizer="local" --cgroups_cpu_enable_pids_and_tids_count="false" --cgroups_enable_cfs="false" --cgroups_hierarchy="/sys/fs/cgroup" --cgroups_limit_swap="false" --cgroups_root="mesos" --container_disk_watch_interval="15secs" --containerizers="mesos" --credential="/tmp/Endpoint_SlaveEndpointTest_NoAuthorizer_2_wvLNOR/credential" --default_role="*" --disk_watch_interval="1mins" --docker="docker" --docker_kill_orphans="true" --docker_registry="https://registry-1.docker.io" --docker_remove_delay="6hrs" --docker_socket="/var/run/docker.sock" --docker_stop_timeout="0ns" --docker_store_dir="/tmp/mesos/store/docker" --docker_volume_checkpoint_dir="/var/run/mesos/isolators/docker/volume" --enforce_container_disk_quota="false" --executor_registration_timeout="1mins" --executor_shutdown_grace_period="5secs" --fetcher_cache_dir="/tmp/Endpoint_SlaveEndpointTest_NoAuthorizer_2_wvLNOR/fetch" --fetcher_cache_size="2GB" --frameworks_home="" --gc_delay="1weeks" --gc_disk_headroom="0.1" --hadoop_home="" --help="false" --hostname_lookup="true" --http_authenticators="basic" --http_command_executor="false" --http_credentials="/tmp/Endpoint_SlaveEndpointTest_NoAuthorizer_2_wvLNOR/http_credentials" --http_heartbeat_interval="30secs" --image_provisioner_backend="copy" --initialize_driver_logging="true" --isolation="posix/cpu,posix/mem" --launcher="posix" --launcher_dir="/mesos/build/src" --logbufsecs="0" --logging_level="INFO" --max_completed_executors_per_framework="150" --oversubscribed_resources_interval="15secs" --perf_duration="10secs" --perf_interval="1mins" --qos_correction_interval_min="0ns" --quiet="false" --recover="reconnect" --recovery_timeout="15mins" --registration_backoff_factor="10ms" --resources="cpus:2;gpus:0;mem:1024;disk:1024;ports:[31000-32000]" --revocable_cpu_low_priority="true" --runtime_dir="/tmp/Endpoint_SlaveEndpointTest_NoAuthorizer_2_wvLNOR" --sandbox_directory="/mnt/mesos/sandbox" --strict="true" --switch_user="true" --systemd_enable_support="true" --systemd_runtime_directory="/run/systemd/system" --version="false" --work_dir="/tmp/Endpoint_SlaveEndpointTest_NoAuthorizer_2_BoOFve"
I0116 22:56:21.590870 25294 credentials.hpp:86] Loading credential for authentication from '/tmp/Endpoint_SlaveEndpointTest_NoAuthorizer_2_wvLNOR/credential'
I0116 22:56:21.590996 25294 slave.cpp:352] Agent using credential for: test-principal
I0116 22:56:21.591013 25294 credentials.hpp:37] Loading credentials for authentication from '/tmp/Endpoint_SlaveEndpointTest_NoAuthorizer_2_wvLNOR/http_credentials'
I0116 22:56:21.591158 25294 http.cpp:922] Using default 'basic' HTTP authenticator for realm 'mesos-agent-readonly'
I0116 22:56:21.591228 25294 http.cpp:922] Using default 'basic' HTTP authenticator for realm 'mesos-agent-readwrite'
I0116 22:56:21.591657 25294 slave.cpp:539] Agent resources: cpus(*):2; mem(*):1024; disk(*):1024; ports(*):[31000-32000]
I0116 22:56:21.591703 25294 slave.cpp:547] Agent attributes: [ ]
I0116 22:56:21.591714 25294 slave.cpp:552] Agent hostname: 3a1d07e4d5f6
I0116 22:56:21.592466 25294 state.cpp:60] Recovering state from '/tmp/Endpoint_SlaveEndpointTest_NoAuthorizer_2_BoOFve/meta'
I0116 22:56:21.592627 25294 status_update_manager.cpp:203] Recovering status update manager
I0116 22:56:21.592703 25294 containerizer.cpp:599] Recovering containerizer
I0116 22:56:21.593422 25294 provisioner.cpp:251] Provisioner recovery complete
I0116 22:56:21.593621 25289 slave.cpp:5417] Finished recovery
I0116 22:56:21.594104 25289 slave.cpp:5591] Querying resource estimator for oversubscribable resources
I0116 22:56:21.594298 25289 slave.cpp:5605] Received oversubscribable resources {} from the resource estimator
I0116 22:56:21.595685 25282 process.cpp:3676] Handling HTTP event for process 'slave(682)' with path: '/slave(682)/containers'
I0116 22:56:21.596088 25283 http.cpp:874] Authorizing principal 'test-principal' to GET the '/containers' endpoint
I0116 22:56:21.597349 25281 slave.cpp:796] Agent terminating
[ OK ] Endpoint/SlaveEndpointTest.NoAuthorizer/2 (16 ms)
[----------] 9 tests from Endpoint/SlaveEndpointTest (156 ms total)
[----------] Global test environment tear-down
[==========] 1401 tests from 157 test cases ran. (211180 ms total)
[ PASSED ] 1400 tests.
[ FAILED ] 1 test, listed below:
[ FAILED ] MasterTest.AgentRestartNoReregisterRateLimit
1 FAILED TEST
YOU HAVE 14 DISABLED TESTS
make[3]: Leaving directory `/mesos/build'
make[3]: *** [CMakeFiles/check] Error 1
make[2]: *** [CMakeFiles/check.dir/all] Error 2
make[2]: Leaving directory `/mesos/build'
make[1]: *** [CMakeFiles/check.dir/rule] Error 2
make[1]: Leaving directory `/mesos/build'
make: *** [check] Error 2
+ docker rmi mesos-1484604825-7173
Untagged: mesos-1484604825-7173:latest
Deleted: sha256:4b04e700a3c8570e602228a14e567e081471bca28754475666441458694acf78
Deleted: sha256:39928b38e21a6b1b41d2d44f7467dd10eef63c2a8d831f4a081a2d07525e10d7
Deleted: sha256:b93388c002f9bb1c3a97fcf39d38e60bdb2292e36598c400cc287de852d3dc40
Deleted: sha256:787b44c27d7f572fa31aa6435462d4027d8c734133d5cfecea71b0e26b783be7
Deleted: sha256:c67b8176396ec47872881618afbb15f02f794a33dfed960bb9d01b67318eded8
Deleted: sha256:abdc6d554c26918f5e699174eda9fbf5add12140fcad03dbd08705fff7ae7ed8
Deleted: sha256:a3020cc3464fcbd7b577fe5ad9188d5591361c28c102deb6020f2653c9c6e948
Deleted: sha256:175c7e5120d083cf8b5c9aa8d3b36890e758f9a2c47093b3a2a82544fbec1bcb
Deleted: sha256:211d5044deb0db983f111ede30b0f1e5f347b722342953743a56e6a75573fb09
Deleted: sha256:d0e4fc188fa55eb7945f572e122494417ba25c96554a8afb5700ee4ac6ebcb86
Deleted: sha256:0b7ad0d2ecca39dd22056febff57f5d4d864f9180b64897ae564baa7761f98e4
Deleted: sha256:3d674b3fafbf9f64767a2b6c4a00b70ea391a53e9b83c0804855a4b9d256a530
Deleted: sha256:6feeafb41c9651f9d954bb8added217559b63dabdcd2bfbe5069d2cfc8ee7fa7
Deleted: sha256:b66bdc44bf5386c529a87e225edd6a61b59f5e9504bee4ca45d51ab096b5d671
Deleted: sha256:5d4e24f19cdfb4d7b4706e18867c758c50f4b702f3ffa7e172e3ea7756ff1d76
Deleted: sha256:2840f2a6a6662f9bf180bd78d13b7e1bff2e13d6fa81e3759d35e4944ab94d6d
Deleted: sha256:ccd7fa4f094a17048f5e2886be06e44ecc4f836379e9f2171a9d6d36f876e2fd
Deleted: sha256:266e813ce72eadbca5a3d8bd12f36bb1f38ad24dc67445590c200f7fbe3bc6ff
Deleted: sha256:7402994522d874df97caa618245a81096c3a6160b27840e8c89ba39d28dee59b
Deleted: sha256:25f3a2098695a04e7a523501e5ad885d85cc9b49149c9807ffdbdce39b5d1838
Deleted: sha256:044046af0b1e47dbc9e5ac5e8dda3be835a7f80103d4b4ba21433f3e19305e9c
Deleted: sha256:72d4f0a27038732442005ef8df639fb87b7f176f6b38477e95657b6912bdcdb4
Deleted: sha256:02ac93e7dfe4c8932c369717ac6c213bf38c0f48e9b9b40dc6c7d36a61d4e043
Deleted: sha256:54700c33e5f9228fc828c9e987ea07fd11dc91af9d08a8248a311b57ee4bf079
Build step 'Execute shell' marked build as failure
Re: Build failed in Jenkins: Mesos-Buildbot » cmake,clang,--verbose --enable-libevent --enable-ssl,GLOG_v=1 MESOS_VERBOSE=1,ubuntu:14.04,(docker||Hadoop)&&(!ubuntu-us1)&&(!ubuntu-6)&&(!ubuntu-eu2) #3116
Posted by Alex Rukletsov <al...@mesosphere.com>.
This might be a VM lag again:
I0116 22:54:53.761340 25294 slave.cpp:5605] Received oversubscribable
resources {} from the resource estimator
/mesos/src/tests/master_tests.cpp:6273: Failure
Failed to wait 15secs for reregisterSlave
I0116 22:55:08.759781 25291 master.cpp:1378] Framework
6ed2a40b-aca5-4925-95ba-1eeff4c26b80-0000 (default) at
scheduler-7f8b4dda-f533-43d7-a0a6-a17b62c154d2@172.17.0.4:33919 disconnected
This is not new, we had this fixed some time ago:
https://issues.apache.org/jira/browse/INFRA-12852
On Tue, Jan 17, 2017 at 9:38 AM, Vinod Kone <vi...@apache.org> wrote:
> @neil?
>
> On Mon, Jan 16, 2017 at 11:57 PM, Apache Jenkins Server <
> jenkins@builds.apache.org> wrote:
>
> > See <https://builds.apache.org/job/Mesos-Buildbot/BUILDTOOL=
> > cmake,COMPILER=clang,CONFIGURATION=--verbose%20--
> > enable-libevent%20--enable-ssl,ENVIRONMENT=GLOG_v=1%
> > 20MESOS_VERBOSE=1,OS=ubuntu%3A14.04,label_exp=(docker%7C%
> > 7CHadoop)&&(!ubuntu-us1)&&(!ubuntu-6)&&(!ubuntu-eu2)/3116/>
> >
> > ------------------------------------------
> > [...truncated 170895 lines...]
> > [ OK ] Endpoint/SlaveEndpointTest.AuthorizedRequest/0 (21 ms)
> > [ RUN ] Endpoint/SlaveEndpointTest.AuthorizedRequest/1
> > I0116 22:56:21.472702 25279 containerizer.cpp:220] Using isolation:
> > posix/cpu,posix/mem,filesystem/posix,network/cni
> > W0116 22:56:21.473315 25279 backend.cpp:76] Failed to create 'aufs'
> > backend: AufsBackend requires root privileges, but is running as user
> mesos
> > W0116 22:56:21.473430 25279 backend.cpp:76] Failed to create 'bind'
> > backend: BindBackend requires root privileges
> > I0116 22:56:21.474766 25291 slave.cpp:209] Mesos agent started on (675)@
> > 172.17.0.4:33919
> > I0116 22:56:21.474795 25291 slave.cpp:210] Flags at startup: --acls=""
> > --appc_simple_discovery_uri_prefix="http://"
> --appc_store_dir="/tmp/mesos/store/appc"
> > --authenticate_http_readonly="true" --authenticate_http_readwrite="true"
> > --authenticatee="crammd5" --authentication_backoff_factor="1secs"
> > --authorizer="local" --cgroups_cpu_enable_pids_and_tids_count="false"
> > --cgroups_enable_cfs="false" --cgroups_hierarchy="/sys/fs/cgroup"
> > --cgroups_limit_swap="false" --cgroups_root="mesos"
> --container_disk_watch_interval="15secs"
> > --containerizers="mesos" --credential="/tmp/Endpoint_SlaveEndpointTest_
> > AuthorizedRequest_1_r0LGAb/credential" --default_role="*"
> > --disk_watch_interval="1mins" --docker="docker"
> > --docker_kill_orphans="true" --docker_registry="https://
> > registry-1.docker.io" --docker_remove_delay="6hrs"
> > --docker_socket="/var/run/docker.sock" --docker_stop_timeout="0ns"
> > --docker_store_dir="/tmp/mesos/store/docker" --docker_volume_checkpoint_
> > dir="/var/run/mesos/isolators/docker/volume" --enforce_container_disk_
> quota="false"
> > --executor_registration_timeout="1mins" --executor_shutdown_grace_
> period="5secs"
> > --fetcher_cache_dir="/tmp/Endpoint_SlaveEndpointTest_
> > AuthorizedRequest_1_r0LGAb/fetch" --fetcher_cache_size="2GB"
> > --frameworks_home="" --gc_delay="1weeks" --gc_disk_headroom="0.1"
> > --hadoop_home="" --help="false" --hostname_lookup="true"
> > --http_authenticators="basic" --http_command_executor="false"
> > --http_credentials="/tmp/Endpoint_SlaveEndpointTest_
> > AuthorizedRequest_1_r0LGAb/http_credentials" --http_heartbeat_interval="
> 30secs"
> > --image_provisioner_backend="copy" --initialize_driver_logging="true"
> > --isolation="posix/cpu,posix/mem" --launcher="posix"
> > --launcher_dir="/mesos/build/src" --logbufsecs="0"
> --logging_level="INFO"
> > --max_completed_executors_per_framework="150"
> --oversubscribed_resources_interval="15secs"
> > --perf_duration="10secs" --perf_interval="1mins"
> > --qos_correction_interval_min="0ns" --quiet="false"
> --recover="reconnect"
> > --recovery_timeout="15mins" --registration_backoff_factor="10ms"
> > --resources="cpus:2;gpus:0;mem:1024;disk:1024;ports:[31000-32000]"
> > --revocable_cpu_low_priority="true" --runtime_dir="/tmp/Endpoint_
> > SlaveEndpointTest_AuthorizedRequest_1_r0LGAb" --sandbox_directory="/mnt/
> mesos/sandbox"
> > --strict="true" --switch_user="true" --systemd_enable_support="true"
> > --systemd_runtime_directory="/run/systemd/system" --version="false"
> > --work_dir="/tmp/Endpoint_SlaveEndpointTest_AuthorizedRequest_1_burvAy"
> > I0116 22:56:21.475188 25291 credentials.hpp:86] Loading credential for
> > authentication from '/tmp/Endpoint_SlaveEndpointTest_
> > AuthorizedRequest_1_r0LGAb/credential'
> > I0116 22:56:21.475394 25291 slave.cpp:352] Agent using credential for:
> > test-principal
> > I0116 22:56:21.475412 25291 credentials.hpp:37] Loading credentials for
> > authentication from '/tmp/Endpoint_SlaveEndpointTest_
> > AuthorizedRequest_1_r0LGAb/http_credentials'
> > I0116 22:56:21.475551 25291 http.cpp:922] Using default 'basic' HTTP
> > authenticator for realm 'mesos-agent-readonly'
> > I0116 22:56:21.475615 25291 http.cpp:922] Using default 'basic' HTTP
> > authenticator for realm 'mesos-agent-readwrite'
> > I0116 22:56:21.475944 25291 slave.cpp:539] Agent resources: cpus(*):2;
> > mem(*):1024; disk(*):1024; ports(*):[31000-32000]
> > I0116 22:56:21.475982 25291 slave.cpp:547] Agent attributes: [ ]
> > I0116 22:56:21.475987 25291 slave.cpp:552] Agent hostname: 3a1d07e4d5f6
> > I0116 22:56:21.476472 25291 state.cpp:60] Recovering state from
> > '/tmp/Endpoint_SlaveEndpointTest_AuthorizedRequest_1_burvAy/meta'
> > I0116 22:56:21.476595 25291 status_update_manager.cpp:203] Recovering
> > status update manager
> > I0116 22:56:21.476642 25291 containerizer.cpp:599] Recovering
> containerizer
> > I0116 22:56:21.477018 25291 provisioner.cpp:251] Provisioner recovery
> > complete
> > I0116 22:56:21.477123 25291 slave.cpp:5417] Finished recovery
> > I0116 22:56:21.477494 25291 slave.cpp:5591] Querying resource estimator
> > for oversubscribable resources
> > I0116 22:56:21.477617 25291 slave.cpp:5605] Received oversubscribable
> > resources {} from the resource estimator
> > I0116 22:56:21.478399 25291 process.cpp:3676] Handling HTTP event for
> > process 'slave(675)' with path: '/slave(675)/monitor/statistics.json'
> > I0116 22:56:21.478693 25291 http.cpp:874] Authorizing principal
> > 'test-principal' to GET the '/monitor/statistics.json' endpoint
> > I0116 22:56:21.479972 25285 slave.cpp:796] Agent terminating
> > [ OK ] Endpoint/SlaveEndpointTest.AuthorizedRequest/1 (14 ms)
> > [ RUN ] Endpoint/SlaveEndpointTest.AuthorizedRequest/2
> > I0116 22:56:21.486659 25279 containerizer.cpp:220] Using isolation:
> > posix/cpu,posix/mem,filesystem/posix,network/cni
> > W0116 22:56:21.487089 25279 backend.cpp:76] Failed to create 'aufs'
> > backend: AufsBackend requires root privileges, but is running as user
> mesos
> > W0116 22:56:21.487177 25279 backend.cpp:76] Failed to create 'bind'
> > backend: BindBackend requires root privileges
> > I0116 22:56:21.488459 25292 slave.cpp:209] Mesos agent started on (676)@
> > 172.17.0.4:33919
> > I0116 22:56:21.488489 25292 slave.cpp:210] Flags at startup: --acls=""
> > --appc_simple_discovery_uri_prefix="http://"
> --appc_store_dir="/tmp/mesos/store/appc"
> > --authenticate_http_readonly="true" --authenticate_http_readwrite="true"
> > --authenticatee="crammd5" --authentication_backoff_factor="1secs"
> > --authorizer="local" --cgroups_cpu_enable_pids_and_tids_count="false"
> > --cgroups_enable_cfs="false" --cgroups_hierarchy="/sys/fs/cgroup"
> > --cgroups_limit_swap="false" --cgroups_root="mesos"
> --container_disk_watch_interval="15secs"
> > --containerizers="mesos" --credential="/tmp/Endpoint_SlaveEndpointTest_
> > AuthorizedRequest_2_q7Z8IH/credential" --default_role="*"
> > --disk_watch_interval="1mins" --docker="docker"
> > --docker_kill_orphans="true" --docker_registry="https://
> > registry-1.docker.io" --docker_remove_delay="6hrs"
> > --docker_socket="/var/run/docker.sock" --docker_stop_timeout="0ns"
> > --docker_store_dir="/tmp/mesos/store/docker" --docker_volume_checkpoint_
> > dir="/var/run/mesos/isolators/docker/volume" --enforce_container_disk_
> quota="false"
> > --executor_registration_timeout="1mins" --executor_shutdown_grace_
> period="5secs"
> > --fetcher_cache_dir="/tmp/Endpoint_SlaveEndpointTest_
> > AuthorizedRequest_2_q7Z8IH/fetch" --fetcher_cache_size="2GB"
> > --frameworks_home="" --gc_delay="1weeks" --gc_disk_headroom="0.1"
> > --hadoop_home="" --help="false" --hostname_lookup="true"
> > --http_authenticators="basic" --http_command_executor="false"
> > --http_credentials="/tmp/Endpoint_SlaveEndpointTest_
> > AuthorizedRequest_2_q7Z8IH/http_credentials" --http_heartbeat_interval="
> 30secs"
> > --image_provisioner_backend="copy" --initialize_driver_logging="true"
> > --isolation="posix/cpu,posix/mem" --launcher="posix"
> > --launcher_dir="/mesos/build/src" --logbufsecs="0"
> --logging_level="INFO"
> > --max_completed_executors_per_framework="150"
> --oversubscribed_resources_interval="15secs"
> > --perf_duration="10secs" --perf_interval="1mins"
> > --qos_correction_interval_min="0ns" --quiet="false"
> --recover="reconnect"
> > --recovery_timeout="15mins" --registration_backoff_factor="10ms"
> > --resources="cpus:2;gpus:0;mem:1024;disk:1024;ports:[31000-32000]"
> > --revocable_cpu_low_priority="true" --runtime_dir="/tmp/Endpoint_
> > SlaveEndpointTest_AuthorizedRequest_2_q7Z8IH" --sandbox_directory="/mnt/
> mesos/sandbox"
> > --strict="true" --switch_user="true" --systemd_enable_support="true"
> > --systemd_runtime_directory="/run/systemd/system" --version="false"
> > --work_dir="/tmp/Endpoint_SlaveEndpointTest_AuthorizedRequest_2_wKUFG4"
> > I0116 22:56:21.488836 25292 credentials.hpp:86] Loading credential for
> > authentication from '/tmp/Endpoint_SlaveEndpointTest_
> > AuthorizedRequest_2_q7Z8IH/credential'
> > I0116 22:56:21.488960 25292 slave.cpp:352] Agent using credential for:
> > test-principal
> > I0116 22:56:21.488978 25292 credentials.hpp:37] Loading credentials for
> > authentication from '/tmp/Endpoint_SlaveEndpointTest_
> > AuthorizedRequest_2_q7Z8IH/http_credentials'
> > I0116 22:56:21.489131 25292 http.cpp:922] Using default 'basic' HTTP
> > authenticator for realm 'mesos-agent-readonly'
> > I0116 22:56:21.489192 25292 http.cpp:922] Using default 'basic' HTTP
> > authenticator for realm 'mesos-agent-readwrite'
> > I0116 22:56:21.489610 25292 slave.cpp:539] Agent resources: cpus(*):2;
> > mem(*):1024; disk(*):1024; ports(*):[31000-32000]
> > I0116 22:56:21.489657 25292 slave.cpp:547] Agent attributes: [ ]
> > I0116 22:56:21.489668 25292 slave.cpp:552] Agent hostname: 3a1d07e4d5f6
> > I0116 22:56:21.490241 25292 state.cpp:60] Recovering state from
> > '/tmp/Endpoint_SlaveEndpointTest_AuthorizedRequest_2_wKUFG4/meta'
> > I0116 22:56:21.490376 25292 status_update_manager.cpp:203] Recovering
> > status update manager
> > I0116 22:56:21.490425 25292 containerizer.cpp:599] Recovering
> containerizer
> > I0116 22:56:21.490818 25292 provisioner.cpp:251] Provisioner recovery
> > complete
> > I0116 22:56:21.490931 25292 slave.cpp:5417] Finished recovery
> > I0116 22:56:21.491366 25292 slave.cpp:5591] Querying resource estimator
> > for oversubscribable resources
> > I0116 22:56:21.491542 25292 slave.cpp:5605] Received oversubscribable
> > resources {} from the resource estimator
> > I0116 22:56:21.492395 25292 process.cpp:3676] Handling HTTP event for
> > process 'slave(676)' with path: '/slave(676)/containers'
> > I0116 22:56:21.492748 25292 http.cpp:874] Authorizing principal
> > 'test-principal' to GET the '/containers' endpoint
> > I0116 22:56:21.493794 25285 slave.cpp:796] Agent terminating
> > [ OK ] Endpoint/SlaveEndpointTest.AuthorizedRequest/2 (13 ms)
> > [ RUN ] Endpoint/SlaveEndpointTest.UnauthorizedRequest/0
> > I0116 22:56:21.500207 25279 containerizer.cpp:220] Using isolation:
> > posix/cpu,posix/mem,filesystem/posix,network/cni
> > W0116 22:56:21.500638 25279 backend.cpp:76] Failed to create 'aufs'
> > backend: AufsBackend requires root privileges, but is running as user
> mesos
> > W0116 22:56:21.500730 25279 backend.cpp:76] Failed to create 'bind'
> > backend: BindBackend requires root privileges
> > I0116 22:56:21.502324 25295 slave.cpp:209] Mesos agent started on (677)@
> > 172.17.0.4:33919
> > I0116 22:56:21.502612 25295 slave.cpp:210] Flags at startup: --acls=""
> > --appc_simple_discovery_uri_prefix="http://"
> --appc_store_dir="/tmp/mesos/store/appc"
> > --authenticate_http_readonly="true" --authenticate_http_readwrite="true"
> > --authenticatee="crammd5" --authentication_backoff_factor="1secs"
> > --authorizer="local" --cgroups_cpu_enable_pids_and_tids_count="false"
> > --cgroups_enable_cfs="false" --cgroups_hierarchy="/sys/fs/cgroup"
> > --cgroups_limit_swap="false" --cgroups_root="mesos"
> --container_disk_watch_interval="15secs"
> > --containerizers="mesos" --credential="/tmp/Endpoint_SlaveEndpointTest_
> > UnauthorizedRequest_0_QYEy0d/credential" --default_role="*"
> > --disk_watch_interval="1mins" --docker="docker"
> > --docker_kill_orphans="true" --docker_registry="https://
> > registry-1.docker.io" --docker_remove_delay="6hrs"
> > --docker_socket="/var/run/docker.sock" --docker_stop_timeout="0ns"
> > --docker_store_dir="/tmp/mesos/store/docker" --docker_volume_checkpoint_
> > dir="/var/run/mesos/isolators/docker/volume" --enforce_container_disk_
> quota="false"
> > --executor_registration_timeout="1mins" --executor_shutdown_grace_
> period="5secs"
> > --fetcher_cache_dir="/tmp/Endpoint_SlaveEndpointTest_
> > UnauthorizedRequest_0_QYEy0d/fetch" --fetcher_cache_size="2GB"
> > --frameworks_home="" --gc_delay="1weeks" --gc_disk_headroom="0.1"
> > --hadoop_home="" --help="false" --hostname_lookup="true"
> > --http_authenticators="basic" --http_command_executor="false"
> > --http_credentials="/tmp/Endpoint_SlaveEndpointTest_
> > UnauthorizedRequest_0_QYEy0d/http_credentials"
> --http_heartbeat_interval="30secs"
> > --image_provisioner_backend="copy" --initialize_driver_logging="true"
> > --isolation="posix/cpu,posix/mem" --launcher="posix"
> > --launcher_dir="/mesos/build/src" --logbufsecs="0"
> --logging_level="INFO"
> > --max_completed_executors_per_framework="150"
> --oversubscribed_resources_interval="15secs"
> > --perf_duration="10secs" --perf_interval="1mins"
> > --qos_correction_interval_min="0ns" --quiet="false"
> --recover="reconnect"
> > --recovery_timeout="15mins" --registration_backoff_factor="10ms"
> > --resources="cpus:2;gpus:0;mem:1024;disk:1024;ports:[31000-32000]"
> > --revocable_cpu_low_priority="true" --runtime_dir="/tmp/Endpoint_
> > SlaveEndpointTest_UnauthorizedRequest_0_QYEy0d"
> --sandbox_directory="/mnt/mesos/sandbox"
> > --strict="true" --switch_user="true" --systemd_enable_support="true"
> > --systemd_runtime_directory="/run/systemd/system" --version="false"
> > --work_dir="/tmp/Endpoint_SlaveEndpointTest_
> UnauthorizedRequest_0_qjIQVA"
> > I0116 22:56:21.502907 25295 credentials.hpp:86] Loading credential for
> > authentication from '/tmp/Endpoint_SlaveEndpointTest_
> > UnauthorizedRequest_0_QYEy0d/credential'
> > I0116 22:56:21.503031 25295 slave.cpp:352] Agent using credential for:
> > test-principal
> > I0116 22:56:21.503044 25295 credentials.hpp:37] Loading credentials for
> > authentication from '/tmp/Endpoint_SlaveEndpointTest_
> > UnauthorizedRequest_0_QYEy0d/http_credentials'
> > I0116 22:56:21.503238 25295 http.cpp:922] Using default 'basic' HTTP
> > authenticator for realm 'mesos-agent-readonly'
> > I0116 22:56:21.503301 25295 http.cpp:922] Using default 'basic' HTTP
> > authenticator for realm 'mesos-agent-readwrite'
> > I0116 22:56:21.503679 25295 slave.cpp:539] Agent resources: cpus(*):2;
> > mem(*):1024; disk(*):1024; ports(*):[31000-32000]
> > I0116 22:56:21.503712 25295 slave.cpp:547] Agent attributes: [ ]
> > I0116 22:56:21.503722 25295 slave.cpp:552] Agent hostname: 3a1d07e4d5f6
> > I0116 22:56:21.504317 25293 state.cpp:60] Recovering state from
> > '/tmp/Endpoint_SlaveEndpointTest_UnauthorizedRequest_0_qjIQVA/meta'
> > I0116 22:56:21.504474 25293 status_update_manager.cpp:203] Recovering
> > status update manager
> > I0116 22:56:21.504565 25293 containerizer.cpp:599] Recovering
> containerizer
> > I0116 22:56:21.505054 25293 provisioner.cpp:251] Provisioner recovery
> > complete
> > I0116 22:56:21.505223 25293 slave.cpp:5417] Finished recovery
> > I0116 22:56:21.505645 25293 slave.cpp:5591] Querying resource estimator
> > for oversubscribable resources
> > I0116 22:56:21.505823 25293 slave.cpp:5605] Received oversubscribable
> > resources {} from the resource estimator
> > I0116 22:56:21.506577 25293 process.cpp:3676] Handling HTTP event for
> > process 'slave(677)' with path: '/slave(677)/monitor/statistics'
> > I0116 22:56:21.506865 25293 http.cpp:874] Authorizing principal
> > 'test-principal' to GET the '/monitor/statistics' endpoint
> > I0116 22:56:21.507817 25290 slave.cpp:796] Agent terminating
> > [ OK ] Endpoint/SlaveEndpointTest.UnauthorizedRequest/0 (13 ms)
> > [ RUN ] Endpoint/SlaveEndpointTest.UnauthorizedRequest/1
> > I0116 22:56:21.513659 25279 containerizer.cpp:220] Using isolation:
> > posix/cpu,posix/mem,filesystem/posix,network/cni
> > W0116 22:56:21.514065 25279 backend.cpp:76] Failed to create 'aufs'
> > backend: AufsBackend requires root privileges, but is running as user
> mesos
> > W0116 22:56:21.514150 25279 backend.cpp:76] Failed to create 'bind'
> > backend: BindBackend requires root privileges
> > I0116 22:56:21.515319 25285 slave.cpp:209] Mesos agent started on (678)@
> > 172.17.0.4:33919
> > I0116 22:56:21.515347 25285 slave.cpp:210] Flags at startup: --acls=""
> > --appc_simple_discovery_uri_prefix="http://"
> --appc_store_dir="/tmp/mesos/store/appc"
> > --authenticate_http_readonly="true" --authenticate_http_readwrite="true"
> > --authenticatee="crammd5" --authentication_backoff_factor="1secs"
> > --authorizer="local" --cgroups_cpu_enable_pids_and_tids_count="false"
> > --cgroups_enable_cfs="false" --cgroups_hierarchy="/sys/fs/cgroup"
> > --cgroups_limit_swap="false" --cgroups_root="mesos"
> --container_disk_watch_interval="15secs"
> > --containerizers="mesos" --credential="/tmp/Endpoint_SlaveEndpointTest_
> > UnauthorizedRequest_1_y1oVqK/credential" --default_role="*"
> > --disk_watch_interval="1mins" --docker="docker"
> > --docker_kill_orphans="true" --docker_registry="https://
> > registry-1.docker.io" --docker_remove_delay="6hrs"
> > --docker_socket="/var/run/docker.sock" --docker_stop_timeout="0ns"
> > --docker_store_dir="/tmp/mesos/store/docker" --docker_volume_checkpoint_
> > dir="/var/run/mesos/isolators/docker/volume" --enforce_container_disk_
> quota="false"
> > --executor_registration_timeout="1mins" --executor_shutdown_grace_
> period="5secs"
> > --fetcher_cache_dir="/tmp/Endpoint_SlaveEndpointTest_
> > UnauthorizedRequest_1_y1oVqK/fetch" --fetcher_cache_size="2GB"
> > --frameworks_home="" --gc_delay="1weeks" --gc_disk_headroom="0.1"
> > --hadoop_home="" --help="false" --hostname_lookup="true"
> > --http_authenticators="basic" --http_command_executor="false"
> > --http_credentials="/tmp/Endpoint_SlaveEndpointTest_
> > UnauthorizedRequest_1_y1oVqK/http_credentials"
> --http_heartbeat_interval="30secs"
> > --image_provisioner_backend="copy" --initialize_driver_logging="true"
> > --isolation="posix/cpu,posix/mem" --launcher="posix"
> > --launcher_dir="/mesos/build/src" --logbufsecs="0"
> --logging_level="INFO"
> > --max_completed_executors_per_framework="150"
> --oversubscribed_resources_interval="15secs"
> > --perf_duration="10secs" --perf_interval="1mins"
> > --qos_correction_interval_min="0ns" --quiet="false"
> --recover="reconnect"
> > --recovery_timeout="15mins" --registration_backoff_factor="10ms"
> > --resources="cpus:2;gpus:0;mem:1024;disk:1024;ports:[31000-32000]"
> > --revocable_cpu_low_priority="true" --runtime_dir="/tmp/Endpoint_
> > SlaveEndpointTest_UnauthorizedRequest_1_y1oVqK"
> --sandbox_directory="/mnt/mesos/sandbox"
> > --strict="true" --switch_user="true" --systemd_enable_support="true"
> > --systemd_runtime_directory="/run/systemd/system" --version="false"
> > --work_dir="/tmp/Endpoint_SlaveEndpointTest_
> UnauthorizedRequest_1_zyy0j7"
> > I0116 22:56:21.515822 25285 credentials.hpp:86] Loading credential for
> > authentication from '/tmp/Endpoint_SlaveEndpointTest_
> > UnauthorizedRequest_1_y1oVqK/credential'
> > I0116 22:56:21.515938 25285 slave.cpp:352] Agent using credential for:
> > test-principal
> > I0116 22:56:21.515951 25285 credentials.hpp:37] Loading credentials for
> > authentication from '/tmp/Endpoint_SlaveEndpointTest_
> > UnauthorizedRequest_1_y1oVqK/http_credentials'
> > I0116 22:56:21.516103 25285 http.cpp:922] Using default 'basic' HTTP
> > authenticator for realm 'mesos-agent-readonly'
> > I0116 22:56:21.516160 25285 http.cpp:922] Using default 'basic' HTTP
> > authenticator for realm 'mesos-agent-readwrite'
> > I0116 22:56:21.516500 25285 slave.cpp:539] Agent resources: cpus(*):2;
> > mem(*):1024; disk(*):1024; ports(*):[31000-32000]
> > I0116 22:56:21.516533 25285 slave.cpp:547] Agent attributes: [ ]
> > I0116 22:56:21.516542 25285 slave.cpp:552] Agent hostname: 3a1d07e4d5f6
> > I0116 22:56:21.517124 25284 state.cpp:60] Recovering state from
> > '/tmp/Endpoint_SlaveEndpointTest_UnauthorizedRequest_1_zyy0j7/meta'
> > I0116 22:56:21.517382 25284 status_update_manager.cpp:203] Recovering
> > status update manager
> > I0116 22:56:21.517628 25294 containerizer.cpp:599] Recovering
> containerizer
> > I0116 22:56:21.518127 25294 provisioner.cpp:251] Provisioner recovery
> > complete
> > I0116 22:56:21.518271 25284 slave.cpp:5417] Finished recovery
> > I0116 22:56:21.518735 25284 slave.cpp:5591] Querying resource estimator
> > for oversubscribable resources
> > I0116 22:56:21.518879 25284 slave.cpp:5605] Received oversubscribable
> > resources {} from the resource estimator
> > I0116 22:56:21.519809 25280 process.cpp:3676] Handling HTTP event for
> > process 'slave(678)' with path: '/slave(678)/monitor/statistics.json'
> > I0116 22:56:21.520352 25280 http.cpp:874] Authorizing principal
> > 'test-principal' to GET the '/monitor/statistics.json' endpoint
> > I0116 22:56:21.521363 25279 slave.cpp:796] Agent terminating
> > [ OK ] Endpoint/SlaveEndpointTest.UnauthorizedRequest/1 (13 ms)
> > [ RUN ] Endpoint/SlaveEndpointTest.UnauthorizedRequest/2
> > I0116 22:56:21.527043 25279 containerizer.cpp:220] Using isolation:
> > posix/cpu,posix/mem,filesystem/posix,network/cni
> > W0116 22:56:21.527428 25279 backend.cpp:76] Failed to create 'aufs'
> > backend: AufsBackend requires root privileges, but is running as user
> mesos
> > W0116 22:56:21.527643 25279 backend.cpp:76] Failed to create 'bind'
> > backend: BindBackend requires root privileges
> > I0116 22:56:21.529171 25290 slave.cpp:209] Mesos agent started on (679)@
> > 172.17.0.4:33919
> > I0116 22:56:21.529345 25290 slave.cpp:210] Flags at startup: --acls=""
> > --appc_simple_discovery_uri_prefix="http://"
> --appc_store_dir="/tmp/mesos/store/appc"
> > --authenticate_http_readonly="true" --authenticate_http_readwrite="true"
> > --authenticatee="crammd5" --authentication_backoff_factor="1secs"
> > --authorizer="local" --cgroups_cpu_enable_pids_and_tids_count="false"
> > --cgroups_enable_cfs="false" --cgroups_hierarchy="/sys/fs/cgroup"
> > --cgroups_limit_swap="false" --cgroups_root="mesos"
> --container_disk_watch_interval="15secs"
> > --containerizers="mesos" --credential="/tmp/Endpoint_SlaveEndpointTest_
> > UnauthorizedRequest_2_hmfZZg/credential" --default_role="*"
> > --disk_watch_interval="1mins" --docker="docker"
> > --docker_kill_orphans="true" --docker_registry="https://
> > registry-1.docker.io" --docker_remove_delay="6hrs"
> > --docker_socket="/var/run/docker.sock" --docker_stop_timeout="0ns"
> > --docker_store_dir="/tmp/mesos/store/docker" --docker_volume_checkpoint_
> > dir="/var/run/mesos/isolators/docker/volume" --enforce_container_disk_
> quota="false"
> > --executor_registration_timeout="1mins" --executor_shutdown_grace_
> period="5secs"
> > --fetcher_cache_dir="/tmp/Endpoint_SlaveEndpointTest_
> > UnauthorizedRequest_2_hmfZZg/fetch" --fetcher_cache_size="2GB"
> > --frameworks_home="" --gc_delay="1weeks" --gc_disk_headroom="0.1"
> > --hadoop_home="" --help="false" --hostname_lookup="true"
> > --http_authenticators="basic" --http_command_executor="false"
> > --http_credentials="/tmp/Endpoint_SlaveEndpointTest_
> > UnauthorizedRequest_2_hmfZZg/http_credentials"
> --http_heartbeat_interval="30secs"
> > --image_provisioner_backend="copy" --initialize_driver_logging="true"
> > --isolation="posix/cpu,posix/mem" --launcher="posix"
> > --launcher_dir="/mesos/build/src" --logbufsecs="0"
> --logging_level="INFO"
> > --max_completed_executors_per_framework="150"
> --oversubscribed_resources_interval="15secs"
> > --perf_duration="10secs" --perf_interval="1mins"
> > --qos_correction_interval_min="0ns" --quiet="false"
> --recover="reconnect"
> > --recovery_timeout="15mins" --registration_backoff_factor="10ms"
> > --resources="cpus:2;gpus:0;mem:1024;disk:1024;ports:[31000-32000]"
> > --revocable_cpu_low_priority="true" --runtime_dir="/tmp/Endpoint_
> > SlaveEndpointTest_UnauthorizedRequest_2_hmfZZg"
> --sandbox_directory="/mnt/mesos/sandbox"
> > --strict="true" --switch_user="true" --systemd_enable_support="true"
> > --systemd_runtime_directory="/run/systemd/system" --version="false"
> > --work_dir="/tmp/Endpoint_SlaveEndpointTest_
> UnauthorizedRequest_2_ZAESQD"
> > I0116 22:56:21.529841 25290 credentials.hpp:86] Loading credential for
> > authentication from '/tmp/Endpoint_SlaveEndpointTest_
> > UnauthorizedRequest_2_hmfZZg/credential'
> > I0116 22:56:21.530079 25290 slave.cpp:352] Agent using credential for:
> > test-principal
> > I0116 22:56:21.530094 25290 credentials.hpp:37] Loading credentials for
> > authentication from '/tmp/Endpoint_SlaveEndpointTest_
> > UnauthorizedRequest_2_hmfZZg/http_credentials'
> > I0116 22:56:21.530267 25290 http.cpp:922] Using default 'basic' HTTP
> > authenticator for realm 'mesos-agent-readonly'
> > I0116 22:56:21.530359 25290 http.cpp:922] Using default 'basic' HTTP
> > authenticator for realm 'mesos-agent-readwrite'
> > I0116 22:56:21.530809 25290 slave.cpp:539] Agent resources: cpus(*):2;
> > mem(*):1024; disk(*):1024; ports(*):[31000-32000]
> > I0116 22:56:21.530843 25290 slave.cpp:547] Agent attributes: [ ]
> > I0116 22:56:21.530850 25290 slave.cpp:552] Agent hostname: 3a1d07e4d5f6
> > I0116 22:56:21.531440 25290 state.cpp:60] Recovering state from
> > '/tmp/Endpoint_SlaveEndpointTest_UnauthorizedRequest_2_ZAESQD/meta'
> > I0116 22:56:21.531755 25288 status_update_manager.cpp:203] Recovering
> > status update manager
> > I0116 22:56:21.531841 25288 containerizer.cpp:599] Recovering
> containerizer
> > I0116 22:56:21.532428 25285 provisioner.cpp:251] Provisioner recovery
> > complete
> > I0116 22:56:21.532670 25291 slave.cpp:5417] Finished recovery
> > I0116 22:56:21.533411 25291 slave.cpp:5591] Querying resource estimator
> > for oversubscribable resources
> > I0116 22:56:21.533534 25291 slave.cpp:5605] Received oversubscribable
> > resources {} from the resource estimator
> > I0116 22:56:21.534381 25291 process.cpp:3676] Handling HTTP event for
> > process 'slave(679)' with path: '/slave(679)/containers'
> > I0116 22:56:21.534746 25291 http.cpp:874] Authorizing principal
> > 'test-principal' to GET the '/containers' endpoint
> > I0116 22:56:21.535692 25279 slave.cpp:796] Agent terminating
> > [ OK ] Endpoint/SlaveEndpointTest.UnauthorizedRequest/2 (14 ms)
> > [ RUN ] Endpoint/SlaveEndpointTest.NoAuthorizer/0
> > I0116 22:56:21.542310 25279 containerizer.cpp:220] Using isolation:
> > posix/cpu,posix/mem,filesystem/posix,network/cni
> > W0116 22:56:21.542739 25279 backend.cpp:76] Failed to create 'aufs'
> > backend: AufsBackend requires root privileges, but is running as user
> mesos
> > W0116 22:56:21.542839 25279 backend.cpp:76] Failed to create 'bind'
> > backend: BindBackend requires root privileges
> > I0116 22:56:21.543650 25279 cluster.cpp:446] Creating default 'local'
> > authorizer
> > I0116 22:56:21.544312 25287 slave.cpp:209] Mesos agent started on (680)@
> > 172.17.0.4:33919
> > I0116 22:56:21.544347 25287 slave.cpp:210] Flags at startup: --acls=""
> > --appc_simple_discovery_uri_prefix="http://"
> --appc_store_dir="/tmp/mesos/store/appc"
> > --authenticate_http_readonly="true" --authenticate_http_readwrite="true"
> > --authenticatee="crammd5" --authentication_backoff_factor="1secs"
> > --authorizer="local" --cgroups_cpu_enable_pids_and_tids_count="false"
> > --cgroups_enable_cfs="false" --cgroups_hierarchy="/sys/fs/cgroup"
> > --cgroups_limit_swap="false" --cgroups_root="mesos"
> --container_disk_watch_interval="15secs"
> > --containerizers="mesos" --credential="/tmp/Endpoint_SlaveEndpointTest_
> > NoAuthorizer_0_VsTGIN/credential" --default_role="*"
> > --disk_watch_interval="1mins" --docker="docker"
> > --docker_kill_orphans="true" --docker_registry="https://
> > registry-1.docker.io" --docker_remove_delay="6hrs"
> > --docker_socket="/var/run/docker.sock" --docker_stop_timeout="0ns"
> > --docker_store_dir="/tmp/mesos/store/docker" --docker_volume_checkpoint_
> > dir="/var/run/mesos/isolators/docker/volume" --enforce_container_disk_
> quota="false"
> > --executor_registration_timeout="1mins" --executor_shutdown_grace_
> period="5secs"
> > --fetcher_cache_dir="/tmp/Endpoint_SlaveEndpointTest_
> NoAuthorizer_0_VsTGIN/fetch"
> > --fetcher_cache_size="2GB" --frameworks_home="" --gc_delay="1weeks"
> > --gc_disk_headroom="0.1" --hadoop_home="" --help="false"
> > --hostname_lookup="true" --http_authenticators="basic"
> > --http_command_executor="false" --http_credentials="/tmp/
> > Endpoint_SlaveEndpointTest_NoAuthorizer_0_VsTGIN/http_credentials"
> > --http_heartbeat_interval="30secs" --image_provisioner_backend="copy"
> > --initialize_driver_logging="true" --isolation="posix/cpu,posix/mem"
> > --launcher="posix" --launcher_dir="/mesos/build/src" --logbufsecs="0"
> > --logging_level="INFO" --max_completed_executors_per_framework="150"
> > --oversubscribed_resources_interval="15secs" --perf_duration="10secs"
> > --perf_interval="1mins" --qos_correction_interval_min="0ns"
> > --quiet="false" --recover="reconnect" --recovery_timeout="15mins"
> > --registration_backoff_factor="10ms" --resources="cpus:2;gpus:0;
> > mem:1024;disk:1024;ports:[31000-32000]" --revocable_cpu_low_priority="
> true"
> > --runtime_dir="/tmp/Endpoint_SlaveEndpointTest_NoAuthorizer_0_VsTGIN"
> > --sandbox_directory="/mnt/mesos/sandbox" --strict="true"
> > --switch_user="true" --systemd_enable_support="true"
> > --systemd_runtime_directory="/run/systemd/system" --version="false"
> > --work_dir="/tmp/Endpoint_SlaveEndpointTest_NoAuthorizer_0_Ojo9wa"
> > I0116 22:56:21.544802 25287 credentials.hpp:86] Loading credential for
> > authentication from '/tmp/Endpoint_SlaveEndpointTest_
> > NoAuthorizer_0_VsTGIN/credential'
> > I0116 22:56:21.544920 25287 slave.cpp:352] Agent using credential for:
> > test-principal
> > I0116 22:56:21.545023 25287 credentials.hpp:37] Loading credentials for
> > authentication from '/tmp/Endpoint_SlaveEndpointTest_
> > NoAuthorizer_0_VsTGIN/http_credentials'
> > I0116 22:56:21.545167 25287 http.cpp:922] Using default 'basic' HTTP
> > authenticator for realm 'mesos-agent-readonly'
> > I0116 22:56:21.545296 25287 http.cpp:922] Using default 'basic' HTTP
> > authenticator for realm 'mesos-agent-readwrite'
> > I0116 22:56:21.545763 25287 slave.cpp:539] Agent resources: cpus(*):2;
> > mem(*):1024; disk(*):1024; ports(*):[31000-32000]
> > I0116 22:56:21.545805 25287 slave.cpp:547] Agent attributes: [ ]
> > I0116 22:56:21.545814 25287 slave.cpp:552] Agent hostname: 3a1d07e4d5f6
> > I0116 22:56:21.546344 25281 state.cpp:60] Recovering state from
> > '/tmp/Endpoint_SlaveEndpointTest_NoAuthorizer_0_Ojo9wa/meta'
> > I0116 22:56:21.546597 25294 status_update_manager.cpp:203] Recovering
> > status update manager
> > I0116 22:56:21.546871 25280 containerizer.cpp:599] Recovering
> containerizer
> > I0116 22:56:21.548084 25287 provisioner.cpp:251] Provisioner recovery
> > complete
> > I0116 22:56:21.548193 25287 slave.cpp:5417] Finished recovery
> > I0116 22:56:21.548642 25287 slave.cpp:5591] Querying resource estimator
> > for oversubscribable resources
> > I0116 22:56:21.553338 25283 slave.cpp:5605] Received oversubscribable
> > resources {} from the resource estimator
> > I0116 22:56:21.554309 25283 process.cpp:3676] Handling HTTP event for
> > process 'slave(680)' with path: '/slave(680)/monitor/statistics'
> > I0116 22:56:21.554738 25291 http.cpp:874] Authorizing principal
> > 'test-principal' to GET the '/monitor/statistics' endpoint
> > I0116 22:56:21.556201 25280 slave.cpp:796] Agent terminating
> > [ OK ] Endpoint/SlaveEndpointTest.NoAuthorizer/0 (20 ms)
> > [ RUN ] Endpoint/SlaveEndpointTest.NoAuthorizer/1
> > I0116 22:56:21.562186 25279 containerizer.cpp:220] Using isolation:
> > posix/cpu,posix/mem,filesystem/posix,network/cni
> > W0116 22:56:21.562511 25279 backend.cpp:76] Failed to create 'aufs'
> > backend: AufsBackend requires root privileges, but is running as user
> mesos
> > W0116 22:56:21.562600 25279 backend.cpp:76] Failed to create 'bind'
> > backend: BindBackend requires root privileges
> > I0116 22:56:21.563249 25279 cluster.cpp:446] Creating default 'local'
> > authorizer
> > I0116 22:56:21.563733 25288 slave.cpp:209] Mesos agent started on (681)@
> > 172.17.0.4:33919
> > I0116 22:56:21.563913 25288 slave.cpp:210] Flags at startup: --acls=""
> > --appc_simple_discovery_uri_prefix="http://"
> --appc_store_dir="/tmp/mesos/store/appc"
> > --authenticate_http_readonly="true" --authenticate_http_readwrite="true"
> > --authenticatee="crammd5" --authentication_backoff_factor="1secs"
> > --authorizer="local" --cgroups_cpu_enable_pids_and_tids_count="false"
> > --cgroups_enable_cfs="false" --cgroups_hierarchy="/sys/fs/cgroup"
> > --cgroups_limit_swap="false" --cgroups_root="mesos"
> --container_disk_watch_interval="15secs"
> > --containerizers="mesos" --credential="/tmp/Endpoint_SlaveEndpointTest_
> > NoAuthorizer_1_6zVLDk/credential" --default_role="*"
> > --disk_watch_interval="1mins" --docker="docker"
> > --docker_kill_orphans="true" --docker_registry="https://
> > registry-1.docker.io" --docker_remove_delay="6hrs"
> > --docker_socket="/var/run/docker.sock" --docker_stop_timeout="0ns"
> > --docker_store_dir="/tmp/mesos/store/docker" --docker_volume_checkpoint_
> > dir="/var/run/mesos/isolators/docker/volume" --enforce_container_disk_
> quota="false"
> > --executor_registration_timeout="1mins" --executor_shutdown_grace_
> period="5secs"
> > --fetcher_cache_dir="/tmp/Endpoint_SlaveEndpointTest_
> NoAuthorizer_1_6zVLDk/fetch"
> > --fetcher_cache_size="2GB" --frameworks_home="" --gc_delay="1weeks"
> > --gc_disk_headroom="0.1" --hadoop_home="" --help="false"
> > --hostname_lookup="true" --http_authenticators="basic"
> > --http_command_executor="false" --http_credentials="/tmp/
> > Endpoint_SlaveEndpointTest_NoAuthorizer_1_6zVLDk/http_credentials"
> > --http_heartbeat_interval="30secs" --image_provisioner_backend="copy"
> > --initialize_driver_logging="true" --isolation="posix/cpu,posix/mem"
> > --launcher="posix" --launcher_dir="/mesos/build/src" --logbufsecs="0"
> > --logging_level="INFO" --max_completed_executors_per_framework="150"
> > --oversubscribed_resources_interval="15secs" --perf_duration="10secs"
> > --perf_interval="1mins" --qos_correction_interval_min="0ns"
> > --quiet="false" --recover="reconnect" --recovery_timeout="15mins"
> > --registration_backoff_factor="10ms" --resources="cpus:2;gpus:0;
> > mem:1024;disk:1024;ports:[31000-32000]" --revocable_cpu_low_priority="
> true"
> > --runtime_dir="/tmp/Endpoint_SlaveEndpointTest_NoAuthorizer_1_6zVLDk"
> > --sandbox_directory="/mnt/mesos/sandbox" --strict="true"
> > --switch_user="true" --systemd_enable_support="true"
> > --systemd_runtime_directory="/run/systemd/system" --version="false"
> > --work_dir="/tmp/Endpoint_SlaveEndpointTest_NoAuthorizer_1_LZFXoH"
> > I0116 22:56:21.564283 25288 credentials.hpp:86] Loading credential for
> > authentication from '/tmp/Endpoint_SlaveEndpointTest_
> > NoAuthorizer_1_6zVLDk/credential'
> > I0116 22:56:21.564448 25288 slave.cpp:352] Agent using credential for:
> > test-principal
> > I0116 22:56:21.564465 25288 credentials.hpp:37] Loading credentials for
> > authentication from '/tmp/Endpoint_SlaveEndpointTest_
> > NoAuthorizer_1_6zVLDk/http_credentials'
> > I0116 22:56:21.564615 25288 http.cpp:922] Using default 'basic' HTTP
> > authenticator for realm 'mesos-agent-readonly'
> > I0116 22:56:21.564672 25288 http.cpp:922] Using default 'basic' HTTP
> > authenticator for realm 'mesos-agent-readwrite'
> > I0116 22:56:21.565095 25288 slave.cpp:539] Agent resources: cpus(*):2;
> > mem(*):1024; disk(*):1024; ports(*):[31000-32000]
> > I0116 22:56:21.565129 25288 slave.cpp:547] Agent attributes: [ ]
> > I0116 22:56:21.565137 25288 slave.cpp:552] Agent hostname: 3a1d07e4d5f6
> > I0116 22:56:21.565559 25288 state.cpp:60] Recovering state from
> > '/tmp/Endpoint_SlaveEndpointTest_NoAuthorizer_1_LZFXoH/meta'
> > I0116 22:56:21.565747 25288 status_update_manager.cpp:203] Recovering
> > status update manager
> > I0116 22:56:21.565841 25289 containerizer.cpp:599] Recovering
> containerizer
> > I0116 22:56:21.566490 25281 provisioner.cpp:251] Provisioner recovery
> > complete
> > I0116 22:56:21.566743 25286 slave.cpp:5417] Finished recovery
> > I0116 22:56:21.567226 25286 slave.cpp:5591] Querying resource estimator
> > for oversubscribable resources
> > I0116 22:56:21.567438 25289 slave.cpp:5605] Received oversubscribable
> > resources {} from the resource estimator
> > I0116 22:56:21.568151 25288 process.cpp:3676] Handling HTTP event for
> > process 'slave(681)' with path: '/slave(681)/monitor/statistics.json'
> > I0116 22:56:21.568665 25280 http.cpp:874] Authorizing principal
> > 'test-principal' to GET the '/monitor/statistics.json' endpoint
> > I0116 22:56:21.570036 25291 slave.cpp:796] Agent terminating
> > [ OK ] Endpoint/SlaveEndpointTest.NoAuthorizer/1 (26 ms)
> > [ RUN ] Endpoint/SlaveEndpointTest.NoAuthorizer/2
> > I0116 22:56:21.588699 25279 containerizer.cpp:220] Using isolation:
> > posix/cpu,posix/mem,filesystem/posix,network/cni
> > W0116 22:56:21.589056 25279 backend.cpp:76] Failed to create 'aufs'
> > backend: AufsBackend requires root privileges, but is running as user
> mesos
> > W0116 22:56:21.589216 25279 backend.cpp:76] Failed to create 'bind'
> > backend: BindBackend requires root privileges
> > I0116 22:56:21.589926 25279 cluster.cpp:446] Creating default 'local'
> > authorizer
> > I0116 22:56:21.590433 25294 slave.cpp:209] Mesos agent started on (682)@
> > 172.17.0.4:33919
> > I0116 22:56:21.590463 25294 slave.cpp:210] Flags at startup: --acls=""
> > --appc_simple_discovery_uri_prefix="http://"
> --appc_store_dir="/tmp/mesos/store/appc"
> > --authenticate_http_readonly="true" --authenticate_http_readwrite="true"
> > --authenticatee="crammd5" --authentication_backoff_factor="1secs"
> > --authorizer="local" --cgroups_cpu_enable_pids_and_tids_count="false"
> > --cgroups_enable_cfs="false" --cgroups_hierarchy="/sys/fs/cgroup"
> > --cgroups_limit_swap="false" --cgroups_root="mesos"
> --container_disk_watch_interval="15secs"
> > --containerizers="mesos" --credential="/tmp/Endpoint_SlaveEndpointTest_
> > NoAuthorizer_2_wvLNOR/credential" --default_role="*"
> > --disk_watch_interval="1mins" --docker="docker"
> > --docker_kill_orphans="true" --docker_registry="https://
> > registry-1.docker.io" --docker_remove_delay="6hrs"
> > --docker_socket="/var/run/docker.sock" --docker_stop_timeout="0ns"
> > --docker_store_dir="/tmp/mesos/store/docker" --docker_volume_checkpoint_
> > dir="/var/run/mesos/isolators/docker/volume" --enforce_container_disk_
> quota="false"
> > --executor_registration_timeout="1mins" --executor_shutdown_grace_
> period="5secs"
> > --fetcher_cache_dir="/tmp/Endpoint_SlaveEndpointTest_
> NoAuthorizer_2_wvLNOR/fetch"
> > --fetcher_cache_size="2GB" --frameworks_home="" --gc_delay="1weeks"
> > --gc_disk_headroom="0.1" --hadoop_home="" --help="false"
> > --hostname_lookup="true" --http_authenticators="basic"
> > --http_command_executor="false" --http_credentials="/tmp/
> > Endpoint_SlaveEndpointTest_NoAuthorizer_2_wvLNOR/http_credentials"
> > --http_heartbeat_interval="30secs" --image_provisioner_backend="copy"
> > --initialize_driver_logging="true" --isolation="posix/cpu,posix/mem"
> > --launcher="posix" --launcher_dir="/mesos/build/src" --logbufsecs="0"
> > --logging_level="INFO" --max_completed_executors_per_framework="150"
> > --oversubscribed_resources_interval="15secs" --perf_duration="10secs"
> > --perf_interval="1mins" --qos_correction_interval_min="0ns"
> > --quiet="false" --recover="reconnect" --recovery_timeout="15mins"
> > --registration_backoff_factor="10ms" --resources="cpus:2;gpus:0;
> > mem:1024;disk:1024;ports:[31000-32000]" --revocable_cpu_low_priority="
> true"
> > --runtime_dir="/tmp/Endpoint_SlaveEndpointTest_NoAuthorizer_2_wvLNOR"
> > --sandbox_directory="/mnt/mesos/sandbox" --strict="true"
> > --switch_user="true" --systemd_enable_support="true"
> > --systemd_runtime_directory="/run/systemd/system" --version="false"
> > --work_dir="/tmp/Endpoint_SlaveEndpointTest_NoAuthorizer_2_BoOFve"
> > I0116 22:56:21.590870 25294 credentials.hpp:86] Loading credential for
> > authentication from '/tmp/Endpoint_SlaveEndpointTest_
> > NoAuthorizer_2_wvLNOR/credential'
> > I0116 22:56:21.590996 25294 slave.cpp:352] Agent using credential for:
> > test-principal
> > I0116 22:56:21.591013 25294 credentials.hpp:37] Loading credentials for
> > authentication from '/tmp/Endpoint_SlaveEndpointTest_
> > NoAuthorizer_2_wvLNOR/http_credentials'
> > I0116 22:56:21.591158 25294 http.cpp:922] Using default 'basic' HTTP
> > authenticator for realm 'mesos-agent-readonly'
> > I0116 22:56:21.591228 25294 http.cpp:922] Using default 'basic' HTTP
> > authenticator for realm 'mesos-agent-readwrite'
> > I0116 22:56:21.591657 25294 slave.cpp:539] Agent resources: cpus(*):2;
> > mem(*):1024; disk(*):1024; ports(*):[31000-32000]
> > I0116 22:56:21.591703 25294 slave.cpp:547] Agent attributes: [ ]
> > I0116 22:56:21.591714 25294 slave.cpp:552] Agent hostname: 3a1d07e4d5f6
> > I0116 22:56:21.592466 25294 state.cpp:60] Recovering state from
> > '/tmp/Endpoint_SlaveEndpointTest_NoAuthorizer_2_BoOFve/meta'
> > I0116 22:56:21.592627 25294 status_update_manager.cpp:203] Recovering
> > status update manager
> > I0116 22:56:21.592703 25294 containerizer.cpp:599] Recovering
> containerizer
> > I0116 22:56:21.593422 25294 provisioner.cpp:251] Provisioner recovery
> > complete
> > I0116 22:56:21.593621 25289 slave.cpp:5417] Finished recovery
> > I0116 22:56:21.594104 25289 slave.cpp:5591] Querying resource estimator
> > for oversubscribable resources
> > I0116 22:56:21.594298 25289 slave.cpp:5605] Received oversubscribable
> > resources {} from the resource estimator
> > I0116 22:56:21.595685 25282 process.cpp:3676] Handling HTTP event for
> > process 'slave(682)' with path: '/slave(682)/containers'
> > I0116 22:56:21.596088 25283 http.cpp:874] Authorizing principal
> > 'test-principal' to GET the '/containers' endpoint
> > I0116 22:56:21.597349 25281 slave.cpp:796] Agent terminating
> > [ OK ] Endpoint/SlaveEndpointTest.NoAuthorizer/2 (16 ms)
> > [----------] 9 tests from Endpoint/SlaveEndpointTest (156 ms total)
> >
> > [----------] Global test environment tear-down
> > [==========] 1401 tests from 157 test cases ran. (211180 ms total)
> > [ PASSED ] 1400 tests.
> > [ FAILED ] 1 test, listed below:
> > [ FAILED ] MasterTest.AgentRestartNoReregisterRateLimit
> >
> > 1 FAILED TEST
> > YOU HAVE 14 DISABLED TESTS
> >
> > make[3]: Leaving directory `/mesos/build'
> > make[3]: *** [CMakeFiles/check] Error 1
> > make[2]: *** [CMakeFiles/check.dir/all] Error 2
> > make[2]: Leaving directory `/mesos/build'
> > make[1]: *** [CMakeFiles/check.dir/rule] Error 2
> > make[1]: Leaving directory `/mesos/build'
> > make: *** [check] Error 2
> > + docker rmi mesos-1484604825-7173
> > Untagged: mesos-1484604825-7173:latest
> > Deleted: sha256:4b04e700a3c8570e602228a14e567e
> > 081471bca28754475666441458694acf78
> > Deleted: sha256:39928b38e21a6b1b41d2d44f7467dd
> > 10eef63c2a8d831f4a081a2d07525e10d7
> > Deleted: sha256:b93388c002f9bb1c3a97fcf39d38e6
> > 0bdb2292e36598c400cc287de852d3dc40
> > Deleted: sha256:787b44c27d7f572fa31aa6435462d4
> > 027d8c734133d5cfecea71b0e26b783be7
> > Deleted: sha256:c67b8176396ec47872881618afbb15
> > f02f794a33dfed960bb9d01b67318eded8
> > Deleted: sha256:abdc6d554c26918f5e699174eda9fb
> > f5add12140fcad03dbd08705fff7ae7ed8
> > Deleted: sha256:a3020cc3464fcbd7b577fe5ad9188d
> > 5591361c28c102deb6020f2653c9c6e948
> > Deleted: sha256:175c7e5120d083cf8b5c9aa8d3b368
> > 90e758f9a2c47093b3a2a82544fbec1bcb
> > Deleted: sha256:211d5044deb0db983f111ede30b0f1
> > e5f347b722342953743a56e6a75573fb09
> > Deleted: sha256:d0e4fc188fa55eb7945f572e122494
> > 417ba25c96554a8afb5700ee4ac6ebcb86
> > Deleted: sha256:0b7ad0d2ecca39dd22056febff57f5
> > d4d864f9180b64897ae564baa7761f98e4
> > Deleted: sha256:3d674b3fafbf9f64767a2b6c4a00b7
> > 0ea391a53e9b83c0804855a4b9d256a530
> > Deleted: sha256:6feeafb41c9651f9d954bb8added21
> > 7559b63dabdcd2bfbe5069d2cfc8ee7fa7
> > Deleted: sha256:b66bdc44bf5386c529a87e225edd6a
> > 61b59f5e9504bee4ca45d51ab096b5d671
> > Deleted: sha256:5d4e24f19cdfb4d7b4706e18867c75
> > 8c50f4b702f3ffa7e172e3ea7756ff1d76
> > Deleted: sha256:2840f2a6a6662f9bf180bd78d13b7e
> > 1bff2e13d6fa81e3759d35e4944ab94d6d
> > Deleted: sha256:ccd7fa4f094a17048f5e2886be06e4
> > 4ecc4f836379e9f2171a9d6d36f876e2fd
> > Deleted: sha256:266e813ce72eadbca5a3d8bd12f36b
> > b1f38ad24dc67445590c200f7fbe3bc6ff
> > Deleted: sha256:7402994522d874df97caa618245a81
> > 096c3a6160b27840e8c89ba39d28dee59b
> > Deleted: sha256:25f3a2098695a04e7a523501e5ad88
> > 5d85cc9b49149c9807ffdbdce39b5d1838
> > Deleted: sha256:044046af0b1e47dbc9e5ac5e8dda3b
> > e835a7f80103d4b4ba21433f3e19305e9c
> > Deleted: sha256:72d4f0a27038732442005ef8df639f
> > b87b7f176f6b38477e95657b6912bdcdb4
> > Deleted: sha256:02ac93e7dfe4c8932c369717ac6c21
> > 3bf38c0f48e9b9b40dc6c7d36a61d4e043
> > Deleted: sha256:54700c33e5f9228fc828c9e987ea07
> > fd11dc91af9d08a8248a311b57ee4bf079
> > Build step 'Execute shell' marked build as failure
> >
>
Re: Build failed in Jenkins: Mesos-Buildbot » cmake,clang,--verbose --enable-libevent --enable-ssl,GLOG_v=1 MESOS_VERBOSE=1,ubuntu:14.04,(docker||Hadoop)&&(!ubuntu-us1)&&(!ubuntu-6)&&(!ubuntu-eu2) #3116
Posted by Vinod Kone <vi...@apache.org>.
@neil?
On Mon, Jan 16, 2017 at 11:57 PM, Apache Jenkins Server <
jenkins@builds.apache.org> wrote:
> See <https://builds.apache.org/job/Mesos-Buildbot/BUILDTOOL=
> cmake,COMPILER=clang,CONFIGURATION=--verbose%20--
> enable-libevent%20--enable-ssl,ENVIRONMENT=GLOG_v=1%
> 20MESOS_VERBOSE=1,OS=ubuntu%3A14.04,label_exp=(docker%7C%
> 7CHadoop)&&(!ubuntu-us1)&&(!ubuntu-6)&&(!ubuntu-eu2)/3116/>
>
> ------------------------------------------
> [...truncated 170895 lines...]
> [ OK ] Endpoint/SlaveEndpointTest.AuthorizedRequest/0 (21 ms)
> [ RUN ] Endpoint/SlaveEndpointTest.AuthorizedRequest/1
> I0116 22:56:21.472702 25279 containerizer.cpp:220] Using isolation:
> posix/cpu,posix/mem,filesystem/posix,network/cni
> W0116 22:56:21.473315 25279 backend.cpp:76] Failed to create 'aufs'
> backend: AufsBackend requires root privileges, but is running as user mesos
> W0116 22:56:21.473430 25279 backend.cpp:76] Failed to create 'bind'
> backend: BindBackend requires root privileges
> I0116 22:56:21.474766 25291 slave.cpp:209] Mesos agent started on (675)@
> 172.17.0.4:33919
> I0116 22:56:21.474795 25291 slave.cpp:210] Flags at startup: --acls=""
> --appc_simple_discovery_uri_prefix="http://" --appc_store_dir="/tmp/mesos/store/appc"
> --authenticate_http_readonly="true" --authenticate_http_readwrite="true"
> --authenticatee="crammd5" --authentication_backoff_factor="1secs"
> --authorizer="local" --cgroups_cpu_enable_pids_and_tids_count="false"
> --cgroups_enable_cfs="false" --cgroups_hierarchy="/sys/fs/cgroup"
> --cgroups_limit_swap="false" --cgroups_root="mesos" --container_disk_watch_interval="15secs"
> --containerizers="mesos" --credential="/tmp/Endpoint_SlaveEndpointTest_
> AuthorizedRequest_1_r0LGAb/credential" --default_role="*"
> --disk_watch_interval="1mins" --docker="docker"
> --docker_kill_orphans="true" --docker_registry="https://
> registry-1.docker.io" --docker_remove_delay="6hrs"
> --docker_socket="/var/run/docker.sock" --docker_stop_timeout="0ns"
> --docker_store_dir="/tmp/mesos/store/docker" --docker_volume_checkpoint_
> dir="/var/run/mesos/isolators/docker/volume" --enforce_container_disk_quota="false"
> --executor_registration_timeout="1mins" --executor_shutdown_grace_period="5secs"
> --fetcher_cache_dir="/tmp/Endpoint_SlaveEndpointTest_
> AuthorizedRequest_1_r0LGAb/fetch" --fetcher_cache_size="2GB"
> --frameworks_home="" --gc_delay="1weeks" --gc_disk_headroom="0.1"
> --hadoop_home="" --help="false" --hostname_lookup="true"
> --http_authenticators="basic" --http_command_executor="false"
> --http_credentials="/tmp/Endpoint_SlaveEndpointTest_
> AuthorizedRequest_1_r0LGAb/http_credentials" --http_heartbeat_interval="30secs"
> --image_provisioner_backend="copy" --initialize_driver_logging="true"
> --isolation="posix/cpu,posix/mem" --launcher="posix"
> --launcher_dir="/mesos/build/src" --logbufsecs="0" --logging_level="INFO"
> --max_completed_executors_per_framework="150" --oversubscribed_resources_interval="15secs"
> --perf_duration="10secs" --perf_interval="1mins"
> --qos_correction_interval_min="0ns" --quiet="false" --recover="reconnect"
> --recovery_timeout="15mins" --registration_backoff_factor="10ms"
> --resources="cpus:2;gpus:0;mem:1024;disk:1024;ports:[31000-32000]"
> --revocable_cpu_low_priority="true" --runtime_dir="/tmp/Endpoint_
> SlaveEndpointTest_AuthorizedRequest_1_r0LGAb" --sandbox_directory="/mnt/mesos/sandbox"
> --strict="true" --switch_user="true" --systemd_enable_support="true"
> --systemd_runtime_directory="/run/systemd/system" --version="false"
> --work_dir="/tmp/Endpoint_SlaveEndpointTest_AuthorizedRequest_1_burvAy"
> I0116 22:56:21.475188 25291 credentials.hpp:86] Loading credential for
> authentication from '/tmp/Endpoint_SlaveEndpointTest_
> AuthorizedRequest_1_r0LGAb/credential'
> I0116 22:56:21.475394 25291 slave.cpp:352] Agent using credential for:
> test-principal
> I0116 22:56:21.475412 25291 credentials.hpp:37] Loading credentials for
> authentication from '/tmp/Endpoint_SlaveEndpointTest_
> AuthorizedRequest_1_r0LGAb/http_credentials'
> I0116 22:56:21.475551 25291 http.cpp:922] Using default 'basic' HTTP
> authenticator for realm 'mesos-agent-readonly'
> I0116 22:56:21.475615 25291 http.cpp:922] Using default 'basic' HTTP
> authenticator for realm 'mesos-agent-readwrite'
> I0116 22:56:21.475944 25291 slave.cpp:539] Agent resources: cpus(*):2;
> mem(*):1024; disk(*):1024; ports(*):[31000-32000]
> I0116 22:56:21.475982 25291 slave.cpp:547] Agent attributes: [ ]
> I0116 22:56:21.475987 25291 slave.cpp:552] Agent hostname: 3a1d07e4d5f6
> I0116 22:56:21.476472 25291 state.cpp:60] Recovering state from
> '/tmp/Endpoint_SlaveEndpointTest_AuthorizedRequest_1_burvAy/meta'
> I0116 22:56:21.476595 25291 status_update_manager.cpp:203] Recovering
> status update manager
> I0116 22:56:21.476642 25291 containerizer.cpp:599] Recovering containerizer
> I0116 22:56:21.477018 25291 provisioner.cpp:251] Provisioner recovery
> complete
> I0116 22:56:21.477123 25291 slave.cpp:5417] Finished recovery
> I0116 22:56:21.477494 25291 slave.cpp:5591] Querying resource estimator
> for oversubscribable resources
> I0116 22:56:21.477617 25291 slave.cpp:5605] Received oversubscribable
> resources {} from the resource estimator
> I0116 22:56:21.478399 25291 process.cpp:3676] Handling HTTP event for
> process 'slave(675)' with path: '/slave(675)/monitor/statistics.json'
> I0116 22:56:21.478693 25291 http.cpp:874] Authorizing principal
> 'test-principal' to GET the '/monitor/statistics.json' endpoint
> I0116 22:56:21.479972 25285 slave.cpp:796] Agent terminating
> [ OK ] Endpoint/SlaveEndpointTest.AuthorizedRequest/1 (14 ms)
> [ RUN ] Endpoint/SlaveEndpointTest.AuthorizedRequest/2
> I0116 22:56:21.486659 25279 containerizer.cpp:220] Using isolation:
> posix/cpu,posix/mem,filesystem/posix,network/cni
> W0116 22:56:21.487089 25279 backend.cpp:76] Failed to create 'aufs'
> backend: AufsBackend requires root privileges, but is running as user mesos
> W0116 22:56:21.487177 25279 backend.cpp:76] Failed to create 'bind'
> backend: BindBackend requires root privileges
> I0116 22:56:21.488459 25292 slave.cpp:209] Mesos agent started on (676)@
> 172.17.0.4:33919
> I0116 22:56:21.488489 25292 slave.cpp:210] Flags at startup: --acls=""
> --appc_simple_discovery_uri_prefix="http://" --appc_store_dir="/tmp/mesos/store/appc"
> --authenticate_http_readonly="true" --authenticate_http_readwrite="true"
> --authenticatee="crammd5" --authentication_backoff_factor="1secs"
> --authorizer="local" --cgroups_cpu_enable_pids_and_tids_count="false"
> --cgroups_enable_cfs="false" --cgroups_hierarchy="/sys/fs/cgroup"
> --cgroups_limit_swap="false" --cgroups_root="mesos" --container_disk_watch_interval="15secs"
> --containerizers="mesos" --credential="/tmp/Endpoint_SlaveEndpointTest_
> AuthorizedRequest_2_q7Z8IH/credential" --default_role="*"
> --disk_watch_interval="1mins" --docker="docker"
> --docker_kill_orphans="true" --docker_registry="https://
> registry-1.docker.io" --docker_remove_delay="6hrs"
> --docker_socket="/var/run/docker.sock" --docker_stop_timeout="0ns"
> --docker_store_dir="/tmp/mesos/store/docker" --docker_volume_checkpoint_
> dir="/var/run/mesos/isolators/docker/volume" --enforce_container_disk_quota="false"
> --executor_registration_timeout="1mins" --executor_shutdown_grace_period="5secs"
> --fetcher_cache_dir="/tmp/Endpoint_SlaveEndpointTest_
> AuthorizedRequest_2_q7Z8IH/fetch" --fetcher_cache_size="2GB"
> --frameworks_home="" --gc_delay="1weeks" --gc_disk_headroom="0.1"
> --hadoop_home="" --help="false" --hostname_lookup="true"
> --http_authenticators="basic" --http_command_executor="false"
> --http_credentials="/tmp/Endpoint_SlaveEndpointTest_
> AuthorizedRequest_2_q7Z8IH/http_credentials" --http_heartbeat_interval="30secs"
> --image_provisioner_backend="copy" --initialize_driver_logging="true"
> --isolation="posix/cpu,posix/mem" --launcher="posix"
> --launcher_dir="/mesos/build/src" --logbufsecs="0" --logging_level="INFO"
> --max_completed_executors_per_framework="150" --oversubscribed_resources_interval="15secs"
> --perf_duration="10secs" --perf_interval="1mins"
> --qos_correction_interval_min="0ns" --quiet="false" --recover="reconnect"
> --recovery_timeout="15mins" --registration_backoff_factor="10ms"
> --resources="cpus:2;gpus:0;mem:1024;disk:1024;ports:[31000-32000]"
> --revocable_cpu_low_priority="true" --runtime_dir="/tmp/Endpoint_
> SlaveEndpointTest_AuthorizedRequest_2_q7Z8IH" --sandbox_directory="/mnt/mesos/sandbox"
> --strict="true" --switch_user="true" --systemd_enable_support="true"
> --systemd_runtime_directory="/run/systemd/system" --version="false"
> --work_dir="/tmp/Endpoint_SlaveEndpointTest_AuthorizedRequest_2_wKUFG4"
> I0116 22:56:21.488836 25292 credentials.hpp:86] Loading credential for
> authentication from '/tmp/Endpoint_SlaveEndpointTest_
> AuthorizedRequest_2_q7Z8IH/credential'
> I0116 22:56:21.488960 25292 slave.cpp:352] Agent using credential for:
> test-principal
> I0116 22:56:21.488978 25292 credentials.hpp:37] Loading credentials for
> authentication from '/tmp/Endpoint_SlaveEndpointTest_
> AuthorizedRequest_2_q7Z8IH/http_credentials'
> I0116 22:56:21.489131 25292 http.cpp:922] Using default 'basic' HTTP
> authenticator for realm 'mesos-agent-readonly'
> I0116 22:56:21.489192 25292 http.cpp:922] Using default 'basic' HTTP
> authenticator for realm 'mesos-agent-readwrite'
> I0116 22:56:21.489610 25292 slave.cpp:539] Agent resources: cpus(*):2;
> mem(*):1024; disk(*):1024; ports(*):[31000-32000]
> I0116 22:56:21.489657 25292 slave.cpp:547] Agent attributes: [ ]
> I0116 22:56:21.489668 25292 slave.cpp:552] Agent hostname: 3a1d07e4d5f6
> I0116 22:56:21.490241 25292 state.cpp:60] Recovering state from
> '/tmp/Endpoint_SlaveEndpointTest_AuthorizedRequest_2_wKUFG4/meta'
> I0116 22:56:21.490376 25292 status_update_manager.cpp:203] Recovering
> status update manager
> I0116 22:56:21.490425 25292 containerizer.cpp:599] Recovering containerizer
> I0116 22:56:21.490818 25292 provisioner.cpp:251] Provisioner recovery
> complete
> I0116 22:56:21.490931 25292 slave.cpp:5417] Finished recovery
> I0116 22:56:21.491366 25292 slave.cpp:5591] Querying resource estimator
> for oversubscribable resources
> I0116 22:56:21.491542 25292 slave.cpp:5605] Received oversubscribable
> resources {} from the resource estimator
> I0116 22:56:21.492395 25292 process.cpp:3676] Handling HTTP event for
> process 'slave(676)' with path: '/slave(676)/containers'
> I0116 22:56:21.492748 25292 http.cpp:874] Authorizing principal
> 'test-principal' to GET the '/containers' endpoint
> I0116 22:56:21.493794 25285 slave.cpp:796] Agent terminating
> [ OK ] Endpoint/SlaveEndpointTest.AuthorizedRequest/2 (13 ms)
> [ RUN ] Endpoint/SlaveEndpointTest.UnauthorizedRequest/0
> I0116 22:56:21.500207 25279 containerizer.cpp:220] Using isolation:
> posix/cpu,posix/mem,filesystem/posix,network/cni
> W0116 22:56:21.500638 25279 backend.cpp:76] Failed to create 'aufs'
> backend: AufsBackend requires root privileges, but is running as user mesos
> W0116 22:56:21.500730 25279 backend.cpp:76] Failed to create 'bind'
> backend: BindBackend requires root privileges
> I0116 22:56:21.502324 25295 slave.cpp:209] Mesos agent started on (677)@
> 172.17.0.4:33919
> I0116 22:56:21.502612 25295 slave.cpp:210] Flags at startup: --acls=""
> --appc_simple_discovery_uri_prefix="http://" --appc_store_dir="/tmp/mesos/store/appc"
> --authenticate_http_readonly="true" --authenticate_http_readwrite="true"
> --authenticatee="crammd5" --authentication_backoff_factor="1secs"
> --authorizer="local" --cgroups_cpu_enable_pids_and_tids_count="false"
> --cgroups_enable_cfs="false" --cgroups_hierarchy="/sys/fs/cgroup"
> --cgroups_limit_swap="false" --cgroups_root="mesos" --container_disk_watch_interval="15secs"
> --containerizers="mesos" --credential="/tmp/Endpoint_SlaveEndpointTest_
> UnauthorizedRequest_0_QYEy0d/credential" --default_role="*"
> --disk_watch_interval="1mins" --docker="docker"
> --docker_kill_orphans="true" --docker_registry="https://
> registry-1.docker.io" --docker_remove_delay="6hrs"
> --docker_socket="/var/run/docker.sock" --docker_stop_timeout="0ns"
> --docker_store_dir="/tmp/mesos/store/docker" --docker_volume_checkpoint_
> dir="/var/run/mesos/isolators/docker/volume" --enforce_container_disk_quota="false"
> --executor_registration_timeout="1mins" --executor_shutdown_grace_period="5secs"
> --fetcher_cache_dir="/tmp/Endpoint_SlaveEndpointTest_
> UnauthorizedRequest_0_QYEy0d/fetch" --fetcher_cache_size="2GB"
> --frameworks_home="" --gc_delay="1weeks" --gc_disk_headroom="0.1"
> --hadoop_home="" --help="false" --hostname_lookup="true"
> --http_authenticators="basic" --http_command_executor="false"
> --http_credentials="/tmp/Endpoint_SlaveEndpointTest_
> UnauthorizedRequest_0_QYEy0d/http_credentials" --http_heartbeat_interval="30secs"
> --image_provisioner_backend="copy" --initialize_driver_logging="true"
> --isolation="posix/cpu,posix/mem" --launcher="posix"
> --launcher_dir="/mesos/build/src" --logbufsecs="0" --logging_level="INFO"
> --max_completed_executors_per_framework="150" --oversubscribed_resources_interval="15secs"
> --perf_duration="10secs" --perf_interval="1mins"
> --qos_correction_interval_min="0ns" --quiet="false" --recover="reconnect"
> --recovery_timeout="15mins" --registration_backoff_factor="10ms"
> --resources="cpus:2;gpus:0;mem:1024;disk:1024;ports:[31000-32000]"
> --revocable_cpu_low_priority="true" --runtime_dir="/tmp/Endpoint_
> SlaveEndpointTest_UnauthorizedRequest_0_QYEy0d" --sandbox_directory="/mnt/mesos/sandbox"
> --strict="true" --switch_user="true" --systemd_enable_support="true"
> --systemd_runtime_directory="/run/systemd/system" --version="false"
> --work_dir="/tmp/Endpoint_SlaveEndpointTest_UnauthorizedRequest_0_qjIQVA"
> I0116 22:56:21.502907 25295 credentials.hpp:86] Loading credential for
> authentication from '/tmp/Endpoint_SlaveEndpointTest_
> UnauthorizedRequest_0_QYEy0d/credential'
> I0116 22:56:21.503031 25295 slave.cpp:352] Agent using credential for:
> test-principal
> I0116 22:56:21.503044 25295 credentials.hpp:37] Loading credentials for
> authentication from '/tmp/Endpoint_SlaveEndpointTest_
> UnauthorizedRequest_0_QYEy0d/http_credentials'
> I0116 22:56:21.503238 25295 http.cpp:922] Using default 'basic' HTTP
> authenticator for realm 'mesos-agent-readonly'
> I0116 22:56:21.503301 25295 http.cpp:922] Using default 'basic' HTTP
> authenticator for realm 'mesos-agent-readwrite'
> I0116 22:56:21.503679 25295 slave.cpp:539] Agent resources: cpus(*):2;
> mem(*):1024; disk(*):1024; ports(*):[31000-32000]
> I0116 22:56:21.503712 25295 slave.cpp:547] Agent attributes: [ ]
> I0116 22:56:21.503722 25295 slave.cpp:552] Agent hostname: 3a1d07e4d5f6
> I0116 22:56:21.504317 25293 state.cpp:60] Recovering state from
> '/tmp/Endpoint_SlaveEndpointTest_UnauthorizedRequest_0_qjIQVA/meta'
> I0116 22:56:21.504474 25293 status_update_manager.cpp:203] Recovering
> status update manager
> I0116 22:56:21.504565 25293 containerizer.cpp:599] Recovering containerizer
> I0116 22:56:21.505054 25293 provisioner.cpp:251] Provisioner recovery
> complete
> I0116 22:56:21.505223 25293 slave.cpp:5417] Finished recovery
> I0116 22:56:21.505645 25293 slave.cpp:5591] Querying resource estimator
> for oversubscribable resources
> I0116 22:56:21.505823 25293 slave.cpp:5605] Received oversubscribable
> resources {} from the resource estimator
> I0116 22:56:21.506577 25293 process.cpp:3676] Handling HTTP event for
> process 'slave(677)' with path: '/slave(677)/monitor/statistics'
> I0116 22:56:21.506865 25293 http.cpp:874] Authorizing principal
> 'test-principal' to GET the '/monitor/statistics' endpoint
> I0116 22:56:21.507817 25290 slave.cpp:796] Agent terminating
> [ OK ] Endpoint/SlaveEndpointTest.UnauthorizedRequest/0 (13 ms)
> [ RUN ] Endpoint/SlaveEndpointTest.UnauthorizedRequest/1
> I0116 22:56:21.513659 25279 containerizer.cpp:220] Using isolation:
> posix/cpu,posix/mem,filesystem/posix,network/cni
> W0116 22:56:21.514065 25279 backend.cpp:76] Failed to create 'aufs'
> backend: AufsBackend requires root privileges, but is running as user mesos
> W0116 22:56:21.514150 25279 backend.cpp:76] Failed to create 'bind'
> backend: BindBackend requires root privileges
> I0116 22:56:21.515319 25285 slave.cpp:209] Mesos agent started on (678)@
> 172.17.0.4:33919
> I0116 22:56:21.515347 25285 slave.cpp:210] Flags at startup: --acls=""
> --appc_simple_discovery_uri_prefix="http://" --appc_store_dir="/tmp/mesos/store/appc"
> --authenticate_http_readonly="true" --authenticate_http_readwrite="true"
> --authenticatee="crammd5" --authentication_backoff_factor="1secs"
> --authorizer="local" --cgroups_cpu_enable_pids_and_tids_count="false"
> --cgroups_enable_cfs="false" --cgroups_hierarchy="/sys/fs/cgroup"
> --cgroups_limit_swap="false" --cgroups_root="mesos" --container_disk_watch_interval="15secs"
> --containerizers="mesos" --credential="/tmp/Endpoint_SlaveEndpointTest_
> UnauthorizedRequest_1_y1oVqK/credential" --default_role="*"
> --disk_watch_interval="1mins" --docker="docker"
> --docker_kill_orphans="true" --docker_registry="https://
> registry-1.docker.io" --docker_remove_delay="6hrs"
> --docker_socket="/var/run/docker.sock" --docker_stop_timeout="0ns"
> --docker_store_dir="/tmp/mesos/store/docker" --docker_volume_checkpoint_
> dir="/var/run/mesos/isolators/docker/volume" --enforce_container_disk_quota="false"
> --executor_registration_timeout="1mins" --executor_shutdown_grace_period="5secs"
> --fetcher_cache_dir="/tmp/Endpoint_SlaveEndpointTest_
> UnauthorizedRequest_1_y1oVqK/fetch" --fetcher_cache_size="2GB"
> --frameworks_home="" --gc_delay="1weeks" --gc_disk_headroom="0.1"
> --hadoop_home="" --help="false" --hostname_lookup="true"
> --http_authenticators="basic" --http_command_executor="false"
> --http_credentials="/tmp/Endpoint_SlaveEndpointTest_
> UnauthorizedRequest_1_y1oVqK/http_credentials" --http_heartbeat_interval="30secs"
> --image_provisioner_backend="copy" --initialize_driver_logging="true"
> --isolation="posix/cpu,posix/mem" --launcher="posix"
> --launcher_dir="/mesos/build/src" --logbufsecs="0" --logging_level="INFO"
> --max_completed_executors_per_framework="150" --oversubscribed_resources_interval="15secs"
> --perf_duration="10secs" --perf_interval="1mins"
> --qos_correction_interval_min="0ns" --quiet="false" --recover="reconnect"
> --recovery_timeout="15mins" --registration_backoff_factor="10ms"
> --resources="cpus:2;gpus:0;mem:1024;disk:1024;ports:[31000-32000]"
> --revocable_cpu_low_priority="true" --runtime_dir="/tmp/Endpoint_
> SlaveEndpointTest_UnauthorizedRequest_1_y1oVqK" --sandbox_directory="/mnt/mesos/sandbox"
> --strict="true" --switch_user="true" --systemd_enable_support="true"
> --systemd_runtime_directory="/run/systemd/system" --version="false"
> --work_dir="/tmp/Endpoint_SlaveEndpointTest_UnauthorizedRequest_1_zyy0j7"
> I0116 22:56:21.515822 25285 credentials.hpp:86] Loading credential for
> authentication from '/tmp/Endpoint_SlaveEndpointTest_
> UnauthorizedRequest_1_y1oVqK/credential'
> I0116 22:56:21.515938 25285 slave.cpp:352] Agent using credential for:
> test-principal
> I0116 22:56:21.515951 25285 credentials.hpp:37] Loading credentials for
> authentication from '/tmp/Endpoint_SlaveEndpointTest_
> UnauthorizedRequest_1_y1oVqK/http_credentials'
> I0116 22:56:21.516103 25285 http.cpp:922] Using default 'basic' HTTP
> authenticator for realm 'mesos-agent-readonly'
> I0116 22:56:21.516160 25285 http.cpp:922] Using default 'basic' HTTP
> authenticator for realm 'mesos-agent-readwrite'
> I0116 22:56:21.516500 25285 slave.cpp:539] Agent resources: cpus(*):2;
> mem(*):1024; disk(*):1024; ports(*):[31000-32000]
> I0116 22:56:21.516533 25285 slave.cpp:547] Agent attributes: [ ]
> I0116 22:56:21.516542 25285 slave.cpp:552] Agent hostname: 3a1d07e4d5f6
> I0116 22:56:21.517124 25284 state.cpp:60] Recovering state from
> '/tmp/Endpoint_SlaveEndpointTest_UnauthorizedRequest_1_zyy0j7/meta'
> I0116 22:56:21.517382 25284 status_update_manager.cpp:203] Recovering
> status update manager
> I0116 22:56:21.517628 25294 containerizer.cpp:599] Recovering containerizer
> I0116 22:56:21.518127 25294 provisioner.cpp:251] Provisioner recovery
> complete
> I0116 22:56:21.518271 25284 slave.cpp:5417] Finished recovery
> I0116 22:56:21.518735 25284 slave.cpp:5591] Querying resource estimator
> for oversubscribable resources
> I0116 22:56:21.518879 25284 slave.cpp:5605] Received oversubscribable
> resources {} from the resource estimator
> I0116 22:56:21.519809 25280 process.cpp:3676] Handling HTTP event for
> process 'slave(678)' with path: '/slave(678)/monitor/statistics.json'
> I0116 22:56:21.520352 25280 http.cpp:874] Authorizing principal
> 'test-principal' to GET the '/monitor/statistics.json' endpoint
> I0116 22:56:21.521363 25279 slave.cpp:796] Agent terminating
> [ OK ] Endpoint/SlaveEndpointTest.UnauthorizedRequest/1 (13 ms)
> [ RUN ] Endpoint/SlaveEndpointTest.UnauthorizedRequest/2
> I0116 22:56:21.527043 25279 containerizer.cpp:220] Using isolation:
> posix/cpu,posix/mem,filesystem/posix,network/cni
> W0116 22:56:21.527428 25279 backend.cpp:76] Failed to create 'aufs'
> backend: AufsBackend requires root privileges, but is running as user mesos
> W0116 22:56:21.527643 25279 backend.cpp:76] Failed to create 'bind'
> backend: BindBackend requires root privileges
> I0116 22:56:21.529171 25290 slave.cpp:209] Mesos agent started on (679)@
> 172.17.0.4:33919
> I0116 22:56:21.529345 25290 slave.cpp:210] Flags at startup: --acls=""
> --appc_simple_discovery_uri_prefix="http://" --appc_store_dir="/tmp/mesos/store/appc"
> --authenticate_http_readonly="true" --authenticate_http_readwrite="true"
> --authenticatee="crammd5" --authentication_backoff_factor="1secs"
> --authorizer="local" --cgroups_cpu_enable_pids_and_tids_count="false"
> --cgroups_enable_cfs="false" --cgroups_hierarchy="/sys/fs/cgroup"
> --cgroups_limit_swap="false" --cgroups_root="mesos" --container_disk_watch_interval="15secs"
> --containerizers="mesos" --credential="/tmp/Endpoint_SlaveEndpointTest_
> UnauthorizedRequest_2_hmfZZg/credential" --default_role="*"
> --disk_watch_interval="1mins" --docker="docker"
> --docker_kill_orphans="true" --docker_registry="https://
> registry-1.docker.io" --docker_remove_delay="6hrs"
> --docker_socket="/var/run/docker.sock" --docker_stop_timeout="0ns"
> --docker_store_dir="/tmp/mesos/store/docker" --docker_volume_checkpoint_
> dir="/var/run/mesos/isolators/docker/volume" --enforce_container_disk_quota="false"
> --executor_registration_timeout="1mins" --executor_shutdown_grace_period="5secs"
> --fetcher_cache_dir="/tmp/Endpoint_SlaveEndpointTest_
> UnauthorizedRequest_2_hmfZZg/fetch" --fetcher_cache_size="2GB"
> --frameworks_home="" --gc_delay="1weeks" --gc_disk_headroom="0.1"
> --hadoop_home="" --help="false" --hostname_lookup="true"
> --http_authenticators="basic" --http_command_executor="false"
> --http_credentials="/tmp/Endpoint_SlaveEndpointTest_
> UnauthorizedRequest_2_hmfZZg/http_credentials" --http_heartbeat_interval="30secs"
> --image_provisioner_backend="copy" --initialize_driver_logging="true"
> --isolation="posix/cpu,posix/mem" --launcher="posix"
> --launcher_dir="/mesos/build/src" --logbufsecs="0" --logging_level="INFO"
> --max_completed_executors_per_framework="150" --oversubscribed_resources_interval="15secs"
> --perf_duration="10secs" --perf_interval="1mins"
> --qos_correction_interval_min="0ns" --quiet="false" --recover="reconnect"
> --recovery_timeout="15mins" --registration_backoff_factor="10ms"
> --resources="cpus:2;gpus:0;mem:1024;disk:1024;ports:[31000-32000]"
> --revocable_cpu_low_priority="true" --runtime_dir="/tmp/Endpoint_
> SlaveEndpointTest_UnauthorizedRequest_2_hmfZZg" --sandbox_directory="/mnt/mesos/sandbox"
> --strict="true" --switch_user="true" --systemd_enable_support="true"
> --systemd_runtime_directory="/run/systemd/system" --version="false"
> --work_dir="/tmp/Endpoint_SlaveEndpointTest_UnauthorizedRequest_2_ZAESQD"
> I0116 22:56:21.529841 25290 credentials.hpp:86] Loading credential for
> authentication from '/tmp/Endpoint_SlaveEndpointTest_
> UnauthorizedRequest_2_hmfZZg/credential'
> I0116 22:56:21.530079 25290 slave.cpp:352] Agent using credential for:
> test-principal
> I0116 22:56:21.530094 25290 credentials.hpp:37] Loading credentials for
> authentication from '/tmp/Endpoint_SlaveEndpointTest_
> UnauthorizedRequest_2_hmfZZg/http_credentials'
> I0116 22:56:21.530267 25290 http.cpp:922] Using default 'basic' HTTP
> authenticator for realm 'mesos-agent-readonly'
> I0116 22:56:21.530359 25290 http.cpp:922] Using default 'basic' HTTP
> authenticator for realm 'mesos-agent-readwrite'
> I0116 22:56:21.530809 25290 slave.cpp:539] Agent resources: cpus(*):2;
> mem(*):1024; disk(*):1024; ports(*):[31000-32000]
> I0116 22:56:21.530843 25290 slave.cpp:547] Agent attributes: [ ]
> I0116 22:56:21.530850 25290 slave.cpp:552] Agent hostname: 3a1d07e4d5f6
> I0116 22:56:21.531440 25290 state.cpp:60] Recovering state from
> '/tmp/Endpoint_SlaveEndpointTest_UnauthorizedRequest_2_ZAESQD/meta'
> I0116 22:56:21.531755 25288 status_update_manager.cpp:203] Recovering
> status update manager
> I0116 22:56:21.531841 25288 containerizer.cpp:599] Recovering containerizer
> I0116 22:56:21.532428 25285 provisioner.cpp:251] Provisioner recovery
> complete
> I0116 22:56:21.532670 25291 slave.cpp:5417] Finished recovery
> I0116 22:56:21.533411 25291 slave.cpp:5591] Querying resource estimator
> for oversubscribable resources
> I0116 22:56:21.533534 25291 slave.cpp:5605] Received oversubscribable
> resources {} from the resource estimator
> I0116 22:56:21.534381 25291 process.cpp:3676] Handling HTTP event for
> process 'slave(679)' with path: '/slave(679)/containers'
> I0116 22:56:21.534746 25291 http.cpp:874] Authorizing principal
> 'test-principal' to GET the '/containers' endpoint
> I0116 22:56:21.535692 25279 slave.cpp:796] Agent terminating
> [ OK ] Endpoint/SlaveEndpointTest.UnauthorizedRequest/2 (14 ms)
> [ RUN ] Endpoint/SlaveEndpointTest.NoAuthorizer/0
> I0116 22:56:21.542310 25279 containerizer.cpp:220] Using isolation:
> posix/cpu,posix/mem,filesystem/posix,network/cni
> W0116 22:56:21.542739 25279 backend.cpp:76] Failed to create 'aufs'
> backend: AufsBackend requires root privileges, but is running as user mesos
> W0116 22:56:21.542839 25279 backend.cpp:76] Failed to create 'bind'
> backend: BindBackend requires root privileges
> I0116 22:56:21.543650 25279 cluster.cpp:446] Creating default 'local'
> authorizer
> I0116 22:56:21.544312 25287 slave.cpp:209] Mesos agent started on (680)@
> 172.17.0.4:33919
> I0116 22:56:21.544347 25287 slave.cpp:210] Flags at startup: --acls=""
> --appc_simple_discovery_uri_prefix="http://" --appc_store_dir="/tmp/mesos/store/appc"
> --authenticate_http_readonly="true" --authenticate_http_readwrite="true"
> --authenticatee="crammd5" --authentication_backoff_factor="1secs"
> --authorizer="local" --cgroups_cpu_enable_pids_and_tids_count="false"
> --cgroups_enable_cfs="false" --cgroups_hierarchy="/sys/fs/cgroup"
> --cgroups_limit_swap="false" --cgroups_root="mesos" --container_disk_watch_interval="15secs"
> --containerizers="mesos" --credential="/tmp/Endpoint_SlaveEndpointTest_
> NoAuthorizer_0_VsTGIN/credential" --default_role="*"
> --disk_watch_interval="1mins" --docker="docker"
> --docker_kill_orphans="true" --docker_registry="https://
> registry-1.docker.io" --docker_remove_delay="6hrs"
> --docker_socket="/var/run/docker.sock" --docker_stop_timeout="0ns"
> --docker_store_dir="/tmp/mesos/store/docker" --docker_volume_checkpoint_
> dir="/var/run/mesos/isolators/docker/volume" --enforce_container_disk_quota="false"
> --executor_registration_timeout="1mins" --executor_shutdown_grace_period="5secs"
> --fetcher_cache_dir="/tmp/Endpoint_SlaveEndpointTest_NoAuthorizer_0_VsTGIN/fetch"
> --fetcher_cache_size="2GB" --frameworks_home="" --gc_delay="1weeks"
> --gc_disk_headroom="0.1" --hadoop_home="" --help="false"
> --hostname_lookup="true" --http_authenticators="basic"
> --http_command_executor="false" --http_credentials="/tmp/
> Endpoint_SlaveEndpointTest_NoAuthorizer_0_VsTGIN/http_credentials"
> --http_heartbeat_interval="30secs" --image_provisioner_backend="copy"
> --initialize_driver_logging="true" --isolation="posix/cpu,posix/mem"
> --launcher="posix" --launcher_dir="/mesos/build/src" --logbufsecs="0"
> --logging_level="INFO" --max_completed_executors_per_framework="150"
> --oversubscribed_resources_interval="15secs" --perf_duration="10secs"
> --perf_interval="1mins" --qos_correction_interval_min="0ns"
> --quiet="false" --recover="reconnect" --recovery_timeout="15mins"
> --registration_backoff_factor="10ms" --resources="cpus:2;gpus:0;
> mem:1024;disk:1024;ports:[31000-32000]" --revocable_cpu_low_priority="true"
> --runtime_dir="/tmp/Endpoint_SlaveEndpointTest_NoAuthorizer_0_VsTGIN"
> --sandbox_directory="/mnt/mesos/sandbox" --strict="true"
> --switch_user="true" --systemd_enable_support="true"
> --systemd_runtime_directory="/run/systemd/system" --version="false"
> --work_dir="/tmp/Endpoint_SlaveEndpointTest_NoAuthorizer_0_Ojo9wa"
> I0116 22:56:21.544802 25287 credentials.hpp:86] Loading credential for
> authentication from '/tmp/Endpoint_SlaveEndpointTest_
> NoAuthorizer_0_VsTGIN/credential'
> I0116 22:56:21.544920 25287 slave.cpp:352] Agent using credential for:
> test-principal
> I0116 22:56:21.545023 25287 credentials.hpp:37] Loading credentials for
> authentication from '/tmp/Endpoint_SlaveEndpointTest_
> NoAuthorizer_0_VsTGIN/http_credentials'
> I0116 22:56:21.545167 25287 http.cpp:922] Using default 'basic' HTTP
> authenticator for realm 'mesos-agent-readonly'
> I0116 22:56:21.545296 25287 http.cpp:922] Using default 'basic' HTTP
> authenticator for realm 'mesos-agent-readwrite'
> I0116 22:56:21.545763 25287 slave.cpp:539] Agent resources: cpus(*):2;
> mem(*):1024; disk(*):1024; ports(*):[31000-32000]
> I0116 22:56:21.545805 25287 slave.cpp:547] Agent attributes: [ ]
> I0116 22:56:21.545814 25287 slave.cpp:552] Agent hostname: 3a1d07e4d5f6
> I0116 22:56:21.546344 25281 state.cpp:60] Recovering state from
> '/tmp/Endpoint_SlaveEndpointTest_NoAuthorizer_0_Ojo9wa/meta'
> I0116 22:56:21.546597 25294 status_update_manager.cpp:203] Recovering
> status update manager
> I0116 22:56:21.546871 25280 containerizer.cpp:599] Recovering containerizer
> I0116 22:56:21.548084 25287 provisioner.cpp:251] Provisioner recovery
> complete
> I0116 22:56:21.548193 25287 slave.cpp:5417] Finished recovery
> I0116 22:56:21.548642 25287 slave.cpp:5591] Querying resource estimator
> for oversubscribable resources
> I0116 22:56:21.553338 25283 slave.cpp:5605] Received oversubscribable
> resources {} from the resource estimator
> I0116 22:56:21.554309 25283 process.cpp:3676] Handling HTTP event for
> process 'slave(680)' with path: '/slave(680)/monitor/statistics'
> I0116 22:56:21.554738 25291 http.cpp:874] Authorizing principal
> 'test-principal' to GET the '/monitor/statistics' endpoint
> I0116 22:56:21.556201 25280 slave.cpp:796] Agent terminating
> [ OK ] Endpoint/SlaveEndpointTest.NoAuthorizer/0 (20 ms)
> [ RUN ] Endpoint/SlaveEndpointTest.NoAuthorizer/1
> I0116 22:56:21.562186 25279 containerizer.cpp:220] Using isolation:
> posix/cpu,posix/mem,filesystem/posix,network/cni
> W0116 22:56:21.562511 25279 backend.cpp:76] Failed to create 'aufs'
> backend: AufsBackend requires root privileges, but is running as user mesos
> W0116 22:56:21.562600 25279 backend.cpp:76] Failed to create 'bind'
> backend: BindBackend requires root privileges
> I0116 22:56:21.563249 25279 cluster.cpp:446] Creating default 'local'
> authorizer
> I0116 22:56:21.563733 25288 slave.cpp:209] Mesos agent started on (681)@
> 172.17.0.4:33919
> I0116 22:56:21.563913 25288 slave.cpp:210] Flags at startup: --acls=""
> --appc_simple_discovery_uri_prefix="http://" --appc_store_dir="/tmp/mesos/store/appc"
> --authenticate_http_readonly="true" --authenticate_http_readwrite="true"
> --authenticatee="crammd5" --authentication_backoff_factor="1secs"
> --authorizer="local" --cgroups_cpu_enable_pids_and_tids_count="false"
> --cgroups_enable_cfs="false" --cgroups_hierarchy="/sys/fs/cgroup"
> --cgroups_limit_swap="false" --cgroups_root="mesos" --container_disk_watch_interval="15secs"
> --containerizers="mesos" --credential="/tmp/Endpoint_SlaveEndpointTest_
> NoAuthorizer_1_6zVLDk/credential" --default_role="*"
> --disk_watch_interval="1mins" --docker="docker"
> --docker_kill_orphans="true" --docker_registry="https://
> registry-1.docker.io" --docker_remove_delay="6hrs"
> --docker_socket="/var/run/docker.sock" --docker_stop_timeout="0ns"
> --docker_store_dir="/tmp/mesos/store/docker" --docker_volume_checkpoint_
> dir="/var/run/mesos/isolators/docker/volume" --enforce_container_disk_quota="false"
> --executor_registration_timeout="1mins" --executor_shutdown_grace_period="5secs"
> --fetcher_cache_dir="/tmp/Endpoint_SlaveEndpointTest_NoAuthorizer_1_6zVLDk/fetch"
> --fetcher_cache_size="2GB" --frameworks_home="" --gc_delay="1weeks"
> --gc_disk_headroom="0.1" --hadoop_home="" --help="false"
> --hostname_lookup="true" --http_authenticators="basic"
> --http_command_executor="false" --http_credentials="/tmp/
> Endpoint_SlaveEndpointTest_NoAuthorizer_1_6zVLDk/http_credentials"
> --http_heartbeat_interval="30secs" --image_provisioner_backend="copy"
> --initialize_driver_logging="true" --isolation="posix/cpu,posix/mem"
> --launcher="posix" --launcher_dir="/mesos/build/src" --logbufsecs="0"
> --logging_level="INFO" --max_completed_executors_per_framework="150"
> --oversubscribed_resources_interval="15secs" --perf_duration="10secs"
> --perf_interval="1mins" --qos_correction_interval_min="0ns"
> --quiet="false" --recover="reconnect" --recovery_timeout="15mins"
> --registration_backoff_factor="10ms" --resources="cpus:2;gpus:0;
> mem:1024;disk:1024;ports:[31000-32000]" --revocable_cpu_low_priority="true"
> --runtime_dir="/tmp/Endpoint_SlaveEndpointTest_NoAuthorizer_1_6zVLDk"
> --sandbox_directory="/mnt/mesos/sandbox" --strict="true"
> --switch_user="true" --systemd_enable_support="true"
> --systemd_runtime_directory="/run/systemd/system" --version="false"
> --work_dir="/tmp/Endpoint_SlaveEndpointTest_NoAuthorizer_1_LZFXoH"
> I0116 22:56:21.564283 25288 credentials.hpp:86] Loading credential for
> authentication from '/tmp/Endpoint_SlaveEndpointTest_
> NoAuthorizer_1_6zVLDk/credential'
> I0116 22:56:21.564448 25288 slave.cpp:352] Agent using credential for:
> test-principal
> I0116 22:56:21.564465 25288 credentials.hpp:37] Loading credentials for
> authentication from '/tmp/Endpoint_SlaveEndpointTest_
> NoAuthorizer_1_6zVLDk/http_credentials'
> I0116 22:56:21.564615 25288 http.cpp:922] Using default 'basic' HTTP
> authenticator for realm 'mesos-agent-readonly'
> I0116 22:56:21.564672 25288 http.cpp:922] Using default 'basic' HTTP
> authenticator for realm 'mesos-agent-readwrite'
> I0116 22:56:21.565095 25288 slave.cpp:539] Agent resources: cpus(*):2;
> mem(*):1024; disk(*):1024; ports(*):[31000-32000]
> I0116 22:56:21.565129 25288 slave.cpp:547] Agent attributes: [ ]
> I0116 22:56:21.565137 25288 slave.cpp:552] Agent hostname: 3a1d07e4d5f6
> I0116 22:56:21.565559 25288 state.cpp:60] Recovering state from
> '/tmp/Endpoint_SlaveEndpointTest_NoAuthorizer_1_LZFXoH/meta'
> I0116 22:56:21.565747 25288 status_update_manager.cpp:203] Recovering
> status update manager
> I0116 22:56:21.565841 25289 containerizer.cpp:599] Recovering containerizer
> I0116 22:56:21.566490 25281 provisioner.cpp:251] Provisioner recovery
> complete
> I0116 22:56:21.566743 25286 slave.cpp:5417] Finished recovery
> I0116 22:56:21.567226 25286 slave.cpp:5591] Querying resource estimator
> for oversubscribable resources
> I0116 22:56:21.567438 25289 slave.cpp:5605] Received oversubscribable
> resources {} from the resource estimator
> I0116 22:56:21.568151 25288 process.cpp:3676] Handling HTTP event for
> process 'slave(681)' with path: '/slave(681)/monitor/statistics.json'
> I0116 22:56:21.568665 25280 http.cpp:874] Authorizing principal
> 'test-principal' to GET the '/monitor/statistics.json' endpoint
> I0116 22:56:21.570036 25291 slave.cpp:796] Agent terminating
> [ OK ] Endpoint/SlaveEndpointTest.NoAuthorizer/1 (26 ms)
> [ RUN ] Endpoint/SlaveEndpointTest.NoAuthorizer/2
> I0116 22:56:21.588699 25279 containerizer.cpp:220] Using isolation:
> posix/cpu,posix/mem,filesystem/posix,network/cni
> W0116 22:56:21.589056 25279 backend.cpp:76] Failed to create 'aufs'
> backend: AufsBackend requires root privileges, but is running as user mesos
> W0116 22:56:21.589216 25279 backend.cpp:76] Failed to create 'bind'
> backend: BindBackend requires root privileges
> I0116 22:56:21.589926 25279 cluster.cpp:446] Creating default 'local'
> authorizer
> I0116 22:56:21.590433 25294 slave.cpp:209] Mesos agent started on (682)@
> 172.17.0.4:33919
> I0116 22:56:21.590463 25294 slave.cpp:210] Flags at startup: --acls=""
> --appc_simple_discovery_uri_prefix="http://" --appc_store_dir="/tmp/mesos/store/appc"
> --authenticate_http_readonly="true" --authenticate_http_readwrite="true"
> --authenticatee="crammd5" --authentication_backoff_factor="1secs"
> --authorizer="local" --cgroups_cpu_enable_pids_and_tids_count="false"
> --cgroups_enable_cfs="false" --cgroups_hierarchy="/sys/fs/cgroup"
> --cgroups_limit_swap="false" --cgroups_root="mesos" --container_disk_watch_interval="15secs"
> --containerizers="mesos" --credential="/tmp/Endpoint_SlaveEndpointTest_
> NoAuthorizer_2_wvLNOR/credential" --default_role="*"
> --disk_watch_interval="1mins" --docker="docker"
> --docker_kill_orphans="true" --docker_registry="https://
> registry-1.docker.io" --docker_remove_delay="6hrs"
> --docker_socket="/var/run/docker.sock" --docker_stop_timeout="0ns"
> --docker_store_dir="/tmp/mesos/store/docker" --docker_volume_checkpoint_
> dir="/var/run/mesos/isolators/docker/volume" --enforce_container_disk_quota="false"
> --executor_registration_timeout="1mins" --executor_shutdown_grace_period="5secs"
> --fetcher_cache_dir="/tmp/Endpoint_SlaveEndpointTest_NoAuthorizer_2_wvLNOR/fetch"
> --fetcher_cache_size="2GB" --frameworks_home="" --gc_delay="1weeks"
> --gc_disk_headroom="0.1" --hadoop_home="" --help="false"
> --hostname_lookup="true" --http_authenticators="basic"
> --http_command_executor="false" --http_credentials="/tmp/
> Endpoint_SlaveEndpointTest_NoAuthorizer_2_wvLNOR/http_credentials"
> --http_heartbeat_interval="30secs" --image_provisioner_backend="copy"
> --initialize_driver_logging="true" --isolation="posix/cpu,posix/mem"
> --launcher="posix" --launcher_dir="/mesos/build/src" --logbufsecs="0"
> --logging_level="INFO" --max_completed_executors_per_framework="150"
> --oversubscribed_resources_interval="15secs" --perf_duration="10secs"
> --perf_interval="1mins" --qos_correction_interval_min="0ns"
> --quiet="false" --recover="reconnect" --recovery_timeout="15mins"
> --registration_backoff_factor="10ms" --resources="cpus:2;gpus:0;
> mem:1024;disk:1024;ports:[31000-32000]" --revocable_cpu_low_priority="true"
> --runtime_dir="/tmp/Endpoint_SlaveEndpointTest_NoAuthorizer_2_wvLNOR"
> --sandbox_directory="/mnt/mesos/sandbox" --strict="true"
> --switch_user="true" --systemd_enable_support="true"
> --systemd_runtime_directory="/run/systemd/system" --version="false"
> --work_dir="/tmp/Endpoint_SlaveEndpointTest_NoAuthorizer_2_BoOFve"
> I0116 22:56:21.590870 25294 credentials.hpp:86] Loading credential for
> authentication from '/tmp/Endpoint_SlaveEndpointTest_
> NoAuthorizer_2_wvLNOR/credential'
> I0116 22:56:21.590996 25294 slave.cpp:352] Agent using credential for:
> test-principal
> I0116 22:56:21.591013 25294 credentials.hpp:37] Loading credentials for
> authentication from '/tmp/Endpoint_SlaveEndpointTest_
> NoAuthorizer_2_wvLNOR/http_credentials'
> I0116 22:56:21.591158 25294 http.cpp:922] Using default 'basic' HTTP
> authenticator for realm 'mesos-agent-readonly'
> I0116 22:56:21.591228 25294 http.cpp:922] Using default 'basic' HTTP
> authenticator for realm 'mesos-agent-readwrite'
> I0116 22:56:21.591657 25294 slave.cpp:539] Agent resources: cpus(*):2;
> mem(*):1024; disk(*):1024; ports(*):[31000-32000]
> I0116 22:56:21.591703 25294 slave.cpp:547] Agent attributes: [ ]
> I0116 22:56:21.591714 25294 slave.cpp:552] Agent hostname: 3a1d07e4d5f6
> I0116 22:56:21.592466 25294 state.cpp:60] Recovering state from
> '/tmp/Endpoint_SlaveEndpointTest_NoAuthorizer_2_BoOFve/meta'
> I0116 22:56:21.592627 25294 status_update_manager.cpp:203] Recovering
> status update manager
> I0116 22:56:21.592703 25294 containerizer.cpp:599] Recovering containerizer
> I0116 22:56:21.593422 25294 provisioner.cpp:251] Provisioner recovery
> complete
> I0116 22:56:21.593621 25289 slave.cpp:5417] Finished recovery
> I0116 22:56:21.594104 25289 slave.cpp:5591] Querying resource estimator
> for oversubscribable resources
> I0116 22:56:21.594298 25289 slave.cpp:5605] Received oversubscribable
> resources {} from the resource estimator
> I0116 22:56:21.595685 25282 process.cpp:3676] Handling HTTP event for
> process 'slave(682)' with path: '/slave(682)/containers'
> I0116 22:56:21.596088 25283 http.cpp:874] Authorizing principal
> 'test-principal' to GET the '/containers' endpoint
> I0116 22:56:21.597349 25281 slave.cpp:796] Agent terminating
> [ OK ] Endpoint/SlaveEndpointTest.NoAuthorizer/2 (16 ms)
> [----------] 9 tests from Endpoint/SlaveEndpointTest (156 ms total)
>
> [----------] Global test environment tear-down
> [==========] 1401 tests from 157 test cases ran. (211180 ms total)
> [ PASSED ] 1400 tests.
> [ FAILED ] 1 test, listed below:
> [ FAILED ] MasterTest.AgentRestartNoReregisterRateLimit
>
> 1 FAILED TEST
> YOU HAVE 14 DISABLED TESTS
>
> make[3]: Leaving directory `/mesos/build'
> make[3]: *** [CMakeFiles/check] Error 1
> make[2]: *** [CMakeFiles/check.dir/all] Error 2
> make[2]: Leaving directory `/mesos/build'
> make[1]: *** [CMakeFiles/check.dir/rule] Error 2
> make[1]: Leaving directory `/mesos/build'
> make: *** [check] Error 2
> + docker rmi mesos-1484604825-7173
> Untagged: mesos-1484604825-7173:latest
> Deleted: sha256:4b04e700a3c8570e602228a14e567e
> 081471bca28754475666441458694acf78
> Deleted: sha256:39928b38e21a6b1b41d2d44f7467dd
> 10eef63c2a8d831f4a081a2d07525e10d7
> Deleted: sha256:b93388c002f9bb1c3a97fcf39d38e6
> 0bdb2292e36598c400cc287de852d3dc40
> Deleted: sha256:787b44c27d7f572fa31aa6435462d4
> 027d8c734133d5cfecea71b0e26b783be7
> Deleted: sha256:c67b8176396ec47872881618afbb15
> f02f794a33dfed960bb9d01b67318eded8
> Deleted: sha256:abdc6d554c26918f5e699174eda9fb
> f5add12140fcad03dbd08705fff7ae7ed8
> Deleted: sha256:a3020cc3464fcbd7b577fe5ad9188d
> 5591361c28c102deb6020f2653c9c6e948
> Deleted: sha256:175c7e5120d083cf8b5c9aa8d3b368
> 90e758f9a2c47093b3a2a82544fbec1bcb
> Deleted: sha256:211d5044deb0db983f111ede30b0f1
> e5f347b722342953743a56e6a75573fb09
> Deleted: sha256:d0e4fc188fa55eb7945f572e122494
> 417ba25c96554a8afb5700ee4ac6ebcb86
> Deleted: sha256:0b7ad0d2ecca39dd22056febff57f5
> d4d864f9180b64897ae564baa7761f98e4
> Deleted: sha256:3d674b3fafbf9f64767a2b6c4a00b7
> 0ea391a53e9b83c0804855a4b9d256a530
> Deleted: sha256:6feeafb41c9651f9d954bb8added21
> 7559b63dabdcd2bfbe5069d2cfc8ee7fa7
> Deleted: sha256:b66bdc44bf5386c529a87e225edd6a
> 61b59f5e9504bee4ca45d51ab096b5d671
> Deleted: sha256:5d4e24f19cdfb4d7b4706e18867c75
> 8c50f4b702f3ffa7e172e3ea7756ff1d76
> Deleted: sha256:2840f2a6a6662f9bf180bd78d13b7e
> 1bff2e13d6fa81e3759d35e4944ab94d6d
> Deleted: sha256:ccd7fa4f094a17048f5e2886be06e4
> 4ecc4f836379e9f2171a9d6d36f876e2fd
> Deleted: sha256:266e813ce72eadbca5a3d8bd12f36b
> b1f38ad24dc67445590c200f7fbe3bc6ff
> Deleted: sha256:7402994522d874df97caa618245a81
> 096c3a6160b27840e8c89ba39d28dee59b
> Deleted: sha256:25f3a2098695a04e7a523501e5ad88
> 5d85cc9b49149c9807ffdbdce39b5d1838
> Deleted: sha256:044046af0b1e47dbc9e5ac5e8dda3b
> e835a7f80103d4b4ba21433f3e19305e9c
> Deleted: sha256:72d4f0a27038732442005ef8df639f
> b87b7f176f6b38477e95657b6912bdcdb4
> Deleted: sha256:02ac93e7dfe4c8932c369717ac6c21
> 3bf38c0f48e9b9b40dc6c7d36a61d4e043
> Deleted: sha256:54700c33e5f9228fc828c9e987ea07
> fd11dc91af9d08a8248a311b57ee4bf079
> Build step 'Execute shell' marked build as failure
>
Jenkins build is back to normal : Mesos-Buildbot » cmake,clang,--verbose --enable-libevent --enable-ssl,GLOG_v=1 MESOS_VERBOSE=1,ubuntu:14.04,(docker||Hadoop)&&(!ubuntu-us1)&&(!ubuntu-6)&&(!ubuntu-eu2) #3117
Posted by Apache Jenkins Server <je...@builds.apache.org>.
See <https://builds.apache.org/job/Mesos-Buildbot/BUILDTOOL=cmake,COMPILER=clang,CONFIGURATION=--verbose%20--enable-libevent%20--enable-ssl,ENVIRONMENT=GLOG_v=1%20MESOS_VERBOSE=1,OS=ubuntu%3A14.04,label_exp=(docker%7C%7CHadoop)&&(!ubuntu-us1)&&(!ubuntu-6)&&(!ubuntu-eu2)/3117/changes>