You are viewing a plain text version of this content. The canonical link for it is here.
Posted to dev@lucene.apache.org by Apache Jenkins Server <je...@builds.apache.org> on 2016/10/04 12:19:04 UTC
[JENKINS] Lucene-Solr-Tests-master - Build # 1404 - Failure
Build: https://builds.apache.org/job/Lucene-Solr-Tests-master/1404/
1 tests failed.
FAILED: junit.framework.TestSuite.org.apache.solr.cloud.ReplaceNodeTest
Error Message:
1 thread leaked from SUITE scope at org.apache.solr.cloud.ReplaceNodeTest: 1) Thread[id=14611, name=OverseerHdfsCoreFailoverThread-96703727370174478-127.0.0.1:43310_solr-n_0000000003, state=TIMED_WAITING, group=Overseer Hdfs SolrCore Failover Thread.] at java.lang.Thread.sleep(Native Method) at org.apache.solr.cloud.OverseerAutoReplicaFailoverThread.run(OverseerAutoReplicaFailoverThread.java:137) at java.lang.Thread.run(Thread.java:745)
Stack Trace:
com.carrotsearch.randomizedtesting.ThreadLeakError: 1 thread leaked from SUITE scope at org.apache.solr.cloud.ReplaceNodeTest:
1) Thread[id=14611, name=OverseerHdfsCoreFailoverThread-96703727370174478-127.0.0.1:43310_solr-n_0000000003, state=TIMED_WAITING, group=Overseer Hdfs SolrCore Failover Thread.]
at java.lang.Thread.sleep(Native Method)
at org.apache.solr.cloud.OverseerAutoReplicaFailoverThread.run(OverseerAutoReplicaFailoverThread.java:137)
at java.lang.Thread.run(Thread.java:745)
at __randomizedtesting.SeedInfo.seed([AB71D7B2D5B39E16]:0)
Build Log:
[...truncated 12045 lines...]
[junit4] JVM J0: stdout was not empty, see: /x1/jenkins/jenkins-slave/workspace/Lucene-Solr-Tests-master/solr/build/solr-core/test/temp/junit4-J0-20161004_110639_190.sysout
[junit4] >>> JVM J0 emitted unexpected output (verbatim) ----
[junit4] java.lang.OutOfMemoryError: GC overhead limit exceeded
[junit4] Dumping heap to /x1/jenkins/jenkins-slave/workspace/Lucene-Solr-Tests-master/heapdumps/java_pid16904.hprof ...
[junit4] Heap dump file created [583667210 bytes in 14.312 secs]
[junit4] <<< JVM J0: EOF ----
[junit4] JVM J0: stderr was not empty, see: /x1/jenkins/jenkins-slave/workspace/Lucene-Solr-Tests-master/solr/build/solr-core/test/temp/junit4-J0-20161004_110639_190.syserr
[junit4] >>> JVM J0 emitted unexpected output (verbatim) ----
[junit4] WARN: Unhandled exception in event serialization. -> java.lang.OutOfMemoryError: GC overhead limit exceeded
[junit4]
[junit4] Exception: java.lang.OutOfMemoryError thrown from the UncaughtExceptionHandler in thread "NIOServerCxn.Factory:0.0.0.0/0.0.0.0:0"
[junit4] <<< JVM J0: EOF ----
[...truncated 7 lines...]
[junit4] Suite: org.apache.solr.cloud.ReplaceNodeTest
[junit4] 2> Creating dataDir: /x1/jenkins/jenkins-slave/workspace/Lucene-Solr-Tests-master/solr/build/solr-core/test/J2/temp/solr.cloud.ReplaceNodeTest_AB71D7B2D5B39E16-001/init-core-data-001
[junit4] 2> 2569054 INFO (SUITE-ReplaceNodeTest-seed#[AB71D7B2D5B39E16]-worker) [ ] o.a.s.SolrTestCaseJ4 Randomized ssl (true) and clientAuth (false) via: @org.apache.solr.util.RandomizeSSL(reason=, ssl=NaN, value=NaN, clientAuth=NaN)
[junit4] 2> 2569055 INFO (SUITE-ReplaceNodeTest-seed#[AB71D7B2D5B39E16]-worker) [ ] o.a.s.c.ZkTestServer STARTING ZK TEST SERVER
[junit4] 2> 2569059 INFO (Thread-2737) [ ] o.a.s.c.ZkTestServer client port:0.0.0.0/0.0.0.0:0
[junit4] 2> 2569059 INFO (Thread-2737) [ ] o.a.s.c.ZkTestServer Starting server
[junit4] 2> 2569162 INFO (SUITE-ReplaceNodeTest-seed#[AB71D7B2D5B39E16]-worker) [ ] o.a.s.c.ZkTestServer start zk server on port:54461
[junit4] 2> 2569195 INFO (jetty-launcher-2563-thread-1) [ ] o.e.j.s.Server jetty-9.3.8.v20160314
[junit4] 2> 2569197 INFO (jetty-launcher-2563-thread-2) [ ] o.e.j.s.Server jetty-9.3.8.v20160314
[junit4] 2> 2569204 INFO (jetty-launcher-2563-thread-3) [ ] o.e.j.s.Server jetty-9.3.8.v20160314
[junit4] 2> 2569205 INFO (jetty-launcher-2563-thread-4) [ ] o.e.j.s.Server jetty-9.3.8.v20160314
[junit4] 2> 2569207 INFO (jetty-launcher-2563-thread-5) [ ] o.e.j.s.Server jetty-9.3.8.v20160314
[junit4] 2> 2569216 INFO (jetty-launcher-2563-thread-4) [ ] o.e.j.s.h.ContextHandler Started o.e.j.s.ServletContextHandler@7266a746{/solr,null,AVAILABLE}
[junit4] 2> 2569216 INFO (jetty-launcher-2563-thread-6) [ ] o.e.j.s.Server jetty-9.3.8.v20160314
[junit4] 2> 2569217 INFO (jetty-launcher-2563-thread-6) [ ] o.e.j.s.h.ContextHandler Started o.e.j.s.ServletContextHandler@183d770{/solr,null,AVAILABLE}
[junit4] 2> 2569217 INFO (jetty-launcher-2563-thread-4) [ ] o.e.j.s.ServerConnector Started ServerConnector@4f56bd10{SSL,[ssl, http/1.1]}{127.0.0.1:33379}
[junit4] 2> 2569218 INFO (jetty-launcher-2563-thread-6) [ ] o.e.j.s.ServerConnector Started ServerConnector@396aff47{SSL,[ssl, http/1.1]}{127.0.0.1:45606}
[junit4] 2> 2569218 INFO (jetty-launcher-2563-thread-6) [ ] o.e.j.s.Server Started @2578331ms
[junit4] 2> 2569218 INFO (jetty-launcher-2563-thread-6) [ ] o.a.s.c.s.e.JettySolrRunner Jetty properties: {hostContext=/solr, hostPort=45606}
[junit4] 2> 2569219 INFO (jetty-launcher-2563-thread-6) [ ] o.a.s.s.SolrDispatchFilter ___ _ Welcome to Apache Solr? version 7.0.0
[junit4] 2> 2569219 INFO (jetty-launcher-2563-thread-6) [ ] o.a.s.s.SolrDispatchFilter / __| ___| |_ _ Starting in cloud mode on port null
[junit4] 2> 2569219 INFO (jetty-launcher-2563-thread-6) [ ] o.a.s.s.SolrDispatchFilter \__ \/ _ \ | '_| Install dir: null
[junit4] 2> 2569219 INFO (jetty-launcher-2563-thread-6) [ ] o.a.s.s.SolrDispatchFilter |___/\___/_|_| Start time: 2016-10-04T11:49:37.655Z
[junit4] 2> 2569221 INFO (jetty-launcher-2563-thread-6) [ ] o.a.s.s.SolrDispatchFilter solr.xml found in ZooKeeper. Loading...
[junit4] 2> 2569222 INFO (jetty-launcher-2563-thread-4) [ ] o.e.j.s.Server Started @2578335ms
[junit4] 2> 2569222 INFO (jetty-launcher-2563-thread-4) [ ] o.a.s.c.s.e.JettySolrRunner Jetty properties: {hostContext=/solr, hostPort=33379}
[junit4] 2> 2569223 INFO (jetty-launcher-2563-thread-4) [ ] o.a.s.s.SolrDispatchFilter ___ _ Welcome to Apache Solr? version 7.0.0
[junit4] 2> 2569223 INFO (jetty-launcher-2563-thread-4) [ ] o.a.s.s.SolrDispatchFilter / __| ___| |_ _ Starting in cloud mode on port null
[junit4] 2> 2569223 INFO (jetty-launcher-2563-thread-4) [ ] o.a.s.s.SolrDispatchFilter \__ \/ _ \ | '_| Install dir: null
[junit4] 2> 2569223 INFO (jetty-launcher-2563-thread-4) [ ] o.a.s.s.SolrDispatchFilter |___/\___/_|_| Start time: 2016-10-04T11:49:37.659Z
[junit4] 2> 2569227 INFO (jetty-launcher-2563-thread-3) [ ] o.e.j.s.h.ContextHandler Started o.e.j.s.ServletContextHandler@2fd43b69{/solr,null,AVAILABLE}
[junit4] 2> 2569229 INFO (jetty-launcher-2563-thread-3) [ ] o.e.j.s.ServerConnector Started ServerConnector@26adea22{SSL,[ssl, http/1.1]}{127.0.0.1:60660}
[junit4] 2> 2569229 INFO (jetty-launcher-2563-thread-3) [ ] o.e.j.s.Server Started @2578342ms
[junit4] 2> 2569229 INFO (jetty-launcher-2563-thread-3) [ ] o.a.s.c.s.e.JettySolrRunner Jetty properties: {hostContext=/solr, hostPort=60660}
[junit4] 2> 2569229 INFO (jetty-launcher-2563-thread-3) [ ] o.a.s.s.SolrDispatchFilter ___ _ Welcome to Apache Solr? version 7.0.0
[junit4] 2> 2569229 INFO (jetty-launcher-2563-thread-3) [ ] o.a.s.s.SolrDispatchFilter / __| ___| |_ _ Starting in cloud mode on port null
[junit4] 2> 2569229 INFO (jetty-launcher-2563-thread-3) [ ] o.a.s.s.SolrDispatchFilter \__ \/ _ \ | '_| Install dir: null
[junit4] 2> 2569230 INFO (jetty-launcher-2563-thread-3) [ ] o.a.s.s.SolrDispatchFilter |___/\___/_|_| Start time: 2016-10-04T11:49:37.666Z
[junit4] 2> 2569235 INFO (jetty-launcher-2563-thread-2) [ ] o.e.j.s.h.ContextHandler Started o.e.j.s.ServletContextHandler@6e52e65{/solr,null,AVAILABLE}
[junit4] 2> 2569236 INFO (jetty-launcher-2563-thread-2) [ ] o.e.j.s.ServerConnector Started ServerConnector@21ecebb6{SSL,[ssl, http/1.1]}{127.0.0.1:47481}
[junit4] 2> 2569236 INFO (jetty-launcher-2563-thread-2) [ ] o.e.j.s.Server Started @2578349ms
[junit4] 2> 2569236 INFO (jetty-launcher-2563-thread-2) [ ] o.a.s.c.s.e.JettySolrRunner Jetty properties: {hostContext=/solr, hostPort=47481}
[junit4] 2> 2569236 INFO (jetty-launcher-2563-thread-2) [ ] o.a.s.s.SolrDispatchFilter ___ _ Welcome to Apache Solr? version 7.0.0
[junit4] 2> 2569237 INFO (jetty-launcher-2563-thread-2) [ ] o.a.s.s.SolrDispatchFilter / __| ___| |_ _ Starting in cloud mode on port null
[junit4] 2> 2569237 INFO (jetty-launcher-2563-thread-2) [ ] o.a.s.s.SolrDispatchFilter \__ \/ _ \ | '_| Install dir: null
[junit4] 2> 2569237 INFO (jetty-launcher-2563-thread-2) [ ] o.a.s.s.SolrDispatchFilter |___/\___/_|_| Start time: 2016-10-04T11:49:37.673Z
[junit4] 2> 2569244 INFO (jetty-launcher-2563-thread-2) [ ] o.a.s.s.SolrDispatchFilter solr.xml found in ZooKeeper. Loading...
[junit4] 2> 2569258 INFO (jetty-launcher-2563-thread-1) [ ] o.e.j.s.h.ContextHandler Started o.e.j.s.ServletContextHandler@3e6d1826{/solr,null,AVAILABLE}
[junit4] 2> 2569259 INFO (jetty-launcher-2563-thread-1) [ ] o.e.j.s.ServerConnector Started ServerConnector@592c60bf{SSL,[ssl, http/1.1]}{127.0.0.1:44685}
[junit4] 2> 2569259 INFO (jetty-launcher-2563-thread-1) [ ] o.e.j.s.Server Started @2578372ms
[junit4] 2> 2569259 INFO (jetty-launcher-2563-thread-1) [ ] o.a.s.c.s.e.JettySolrRunner Jetty properties: {hostContext=/solr, hostPort=44685}
[junit4] 2> 2569260 INFO (jetty-launcher-2563-thread-1) [ ] o.a.s.s.SolrDispatchFilter ___ _ Welcome to Apache Solr? version 7.0.0
[junit4] 2> 2569260 INFO (jetty-launcher-2563-thread-1) [ ] o.a.s.s.SolrDispatchFilter / __| ___| |_ _ Starting in cloud mode on port null
[junit4] 2> 2569260 INFO (jetty-launcher-2563-thread-1) [ ] o.a.s.s.SolrDispatchFilter \__ \/ _ \ | '_| Install dir: null
[junit4] 2> 2569260 INFO (jetty-launcher-2563-thread-1) [ ] o.a.s.s.SolrDispatchFilter |___/\___/_|_| Start time: 2016-10-04T11:49:37.696Z
[junit4] 2> 2569312 INFO (jetty-launcher-2563-thread-5) [ ] o.e.j.s.h.ContextHandler Started o.e.j.s.ServletContextHandler@55b2de51{/solr,null,AVAILABLE}
[junit4] 2> 2569313 INFO (jetty-launcher-2563-thread-5) [ ] o.e.j.s.ServerConnector Started ServerConnector@57416795{SSL,[ssl, http/1.1]}{127.0.0.1:43310}
[junit4] 2> 2569313 INFO (jetty-launcher-2563-thread-5) [ ] o.e.j.s.Server Started @2578426ms
[junit4] 2> 2569313 INFO (jetty-launcher-2563-thread-5) [ ] o.a.s.c.s.e.JettySolrRunner Jetty properties: {hostContext=/solr, hostPort=43310}
[junit4] 2> 2569314 INFO (jetty-launcher-2563-thread-5) [ ] o.a.s.s.SolrDispatchFilter ___ _ Welcome to Apache Solr? version 7.0.0
[junit4] 2> 2569314 INFO (jetty-launcher-2563-thread-5) [ ] o.a.s.s.SolrDispatchFilter / __| ___| |_ _ Starting in cloud mode on port null
[junit4] 2> 2569314 INFO (jetty-launcher-2563-thread-5) [ ] o.a.s.s.SolrDispatchFilter \__ \/ _ \ | '_| Install dir: null
[junit4] 2> 2569314 INFO (jetty-launcher-2563-thread-5) [ ] o.a.s.s.SolrDispatchFilter |___/\___/_|_| Start time: 2016-10-04T11:49:37.750Z
[junit4] 2> 2569323 INFO (jetty-launcher-2563-thread-3) [ ] o.a.s.s.SolrDispatchFilter solr.xml found in ZooKeeper. Loading...
[junit4] 2> 2569349 INFO (jetty-launcher-2563-thread-5) [ ] o.a.s.s.SolrDispatchFilter solr.xml found in ZooKeeper. Loading...
[junit4] 2> 2569363 INFO (jetty-launcher-2563-thread-6) [ ] o.a.s.c.ZkContainer Zookeeper client=127.0.0.1:54461/solr
[junit4] 2> 2569366 INFO (jetty-launcher-2563-thread-2) [ ] o.a.s.c.ZkContainer Zookeeper client=127.0.0.1:54461/solr
[junit4] 2> 2569406 INFO (jetty-launcher-2563-thread-4) [ ] o.a.s.s.SolrDispatchFilter solr.xml found in ZooKeeper. Loading...
[junit4] 2> 2569435 INFO (jetty-launcher-2563-thread-5) [ ] o.a.s.c.ZkContainer Zookeeper client=127.0.0.1:54461/solr
[junit4] 2> 2569435 INFO (jetty-launcher-2563-thread-3) [ ] o.a.s.c.ZkContainer Zookeeper client=127.0.0.1:54461/solr
[junit4] 2> 2569455 INFO (jetty-launcher-2563-thread-1) [ ] o.a.s.s.SolrDispatchFilter solr.xml found in ZooKeeper. Loading...
[junit4] 2> 2569486 INFO (jetty-launcher-2563-thread-4) [ ] o.a.s.c.ZkContainer Zookeeper client=127.0.0.1:54461/solr
[junit4] 2> 2569537 INFO (jetty-launcher-2563-thread-2) [n:127.0.0.1:47481_solr ] o.a.s.c.OverseerElectionContext I am going to be the leader 127.0.0.1:47481_solr
[junit4] 2> 2569683 INFO (jetty-launcher-2563-thread-2) [n:127.0.0.1:47481_solr ] o.a.s.c.Overseer Overseer (id=96703727370174475-127.0.0.1:47481_solr-n_0000000000) starting
[junit4] 2> 2569693 INFO (jetty-launcher-2563-thread-6) [n:127.0.0.1:45606_solr ] o.a.s.c.ZkController Register node as live in ZooKeeper:/live_nodes/127.0.0.1:45606_solr
[junit4] 2> 2569696 INFO (jetty-launcher-2563-thread-3) [n:127.0.0.1:60660_solr ] o.a.s.c.c.ZkStateReader Updated live nodes from ZooKeeper... (0) -> (1)
[junit4] 2> 2569697 INFO (jetty-launcher-2563-thread-5) [n:127.0.0.1:43310_solr ] o.a.s.c.c.ZkStateReader Updated live nodes from ZooKeeper... (0) -> (1)
[junit4] 2> 2569705 INFO (jetty-launcher-2563-thread-3) [n:127.0.0.1:60660_solr ] o.a.s.c.ZkController Register node as live in ZooKeeper:/live_nodes/127.0.0.1:60660_solr
[junit4] 2> 2569709 INFO (jetty-launcher-2563-thread-5) [n:127.0.0.1:43310_solr ] o.a.s.c.ZkController Register node as live in ZooKeeper:/live_nodes/127.0.0.1:43310_solr
[junit4] 2> 2569723 INFO (jetty-launcher-2563-thread-1) [ ] o.a.s.c.ZkContainer Zookeeper client=127.0.0.1:54461/solr
[junit4] 2> 2569737 INFO (jetty-launcher-2563-thread-6) [n:127.0.0.1:45606_solr ] o.a.s.c.CorePropertiesLocator Found 0 core definitions underneath /x1/jenkins/jenkins-slave/workspace/Lucene-Solr-Tests-master/solr/build/solr-core/test/J2/temp/solr.cloud.ReplaceNodeTest_AB71D7B2D5B39E16-001/tempDir-001/node6/.
[junit4] 2> 2569744 INFO (jetty-launcher-2563-thread-5) [n:127.0.0.1:43310_solr ] o.a.s.c.CorePropertiesLocator Found 0 core definitions underneath /x1/jenkins/jenkins-slave/workspace/Lucene-Solr-Tests-master/solr/build/solr-core/test/J2/temp/solr.cloud.ReplaceNodeTest_AB71D7B2D5B39E16-001/tempDir-001/node5/.
[junit4] 2> 2569743 INFO (zkCallback-2589-thread-2-processing-n:127.0.0.1:43310_solr) [n:127.0.0.1:43310_solr ] o.a.s.c.c.ZkStateReader Updated live nodes from ZooKeeper... (1) -> (3)
[junit4] 2> 2569771 INFO (zkCallback-2586-thread-1-processing-n:127.0.0.1:45606_solr) [n:127.0.0.1:45606_solr ] o.a.s.c.c.ZkStateReader Updated live nodes from ZooKeeper... (0) -> (3)
[junit4] 2> 2569771 INFO (zkCallback-2583-thread-1-processing-n:127.0.0.1:47481_solr) [n:127.0.0.1:47481_solr ] o.a.s.c.c.ZkStateReader Updated live nodes from ZooKeeper... (0) -> (3)
[junit4] 2> 2569773 INFO (jetty-launcher-2563-thread-2) [n:127.0.0.1:47481_solr ] o.a.s.c.ZkController Register node as live in ZooKeeper:/live_nodes/127.0.0.1:47481_solr
[junit4] 2> 2569774 INFO (zkCallback-2586-thread-1-processing-n:127.0.0.1:45606_solr) [n:127.0.0.1:45606_solr ] o.a.s.c.c.ZkStateReader Updated live nodes from ZooKeeper... (3) -> (4)
[junit4] 2> 2569774 INFO (zkCallback-2583-thread-1-processing-n:127.0.0.1:47481_solr) [n:127.0.0.1:47481_solr ] o.a.s.c.c.ZkStateReader Updated live nodes from ZooKeeper... (3) -> (4)
[junit4] 2> 2569787 INFO (jetty-launcher-2563-thread-2) [n:127.0.0.1:47481_solr ] o.a.s.c.CorePropertiesLocator Found 0 core definitions underneath /x1/jenkins/jenkins-slave/workspace/Lucene-Solr-Tests-master/solr/build/solr-core/test/J2/temp/solr.cloud.ReplaceNodeTest_AB71D7B2D5B39E16-001/tempDir-001/node2/.
[junit4] 2> 2569791 INFO (zkCallback-2588-thread-1-processing-n:127.0.0.1:60660_solr) [n:127.0.0.1:60660_solr ] o.a.s.c.c.ZkStateReader Updated live nodes from ZooKeeper... (1) -> (4)
[junit4] 2> 2569794 INFO (zkCallback-2589-thread-2-processing-n:127.0.0.1:43310_solr) [n:127.0.0.1:43310_solr ] o.a.s.c.c.ZkStateReader Updated live nodes from ZooKeeper... (3) -> (4)
[junit4] 2> 2569817 INFO (jetty-launcher-2563-thread-4) [n:127.0.0.1:33379_solr ] o.a.s.c.c.ZkStateReader Updated live nodes from ZooKeeper... (0) -> (4)
[junit4] 2> 2569820 INFO (jetty-launcher-2563-thread-1) [n:127.0.0.1:44685_solr ] o.a.s.c.c.ZkStateReader Updated live nodes from ZooKeeper... (0) -> (4)
[junit4] 2> 2569831 INFO (jetty-launcher-2563-thread-4) [n:127.0.0.1:33379_solr ] o.a.s.c.ZkController Register node as live in ZooKeeper:/live_nodes/127.0.0.1:33379_solr
[junit4] 2> 2569834 INFO (zkCallback-2588-thread-1-processing-n:127.0.0.1:60660_solr) [n:127.0.0.1:60660_solr ] o.a.s.c.c.ZkStateReader Updated live nodes from ZooKeeper... (4) -> (5)
[junit4] 2> 2569834 INFO (zkCallback-2586-thread-1-processing-n:127.0.0.1:45606_solr) [n:127.0.0.1:45606_solr ] o.a.s.c.c.ZkStateReader Updated live nodes from ZooKeeper... (4) -> (5)
[junit4] 2> 2569834 INFO (zkCallback-2583-thread-1-processing-n:127.0.0.1:47481_solr) [n:127.0.0.1:47481_solr ] o.a.s.c.c.ZkStateReader Updated live nodes from ZooKeeper... (4) -> (5)
[junit4] 2> 2569834 INFO (zkCallback-2589-thread-2-processing-n:127.0.0.1:43310_solr) [n:127.0.0.1:43310_solr ] o.a.s.c.c.ZkStateReader Updated live nodes from ZooKeeper... (4) -> (5)
[junit4] 2> 2569839 INFO (zkCallback-2598-thread-1-processing-n:127.0.0.1:44685_solr) [n:127.0.0.1:44685_solr ] o.a.s.c.c.ZkStateReader Updated live nodes from ZooKeeper... (4) -> (5)
[junit4] 2> 2569839 INFO (jetty-launcher-2563-thread-1) [n:127.0.0.1:44685_solr ] o.a.s.c.ZkController Register node as live in ZooKeeper:/live_nodes/127.0.0.1:44685_solr
[junit4] 2> 2569842 INFO (jetty-launcher-2563-thread-3) [n:127.0.0.1:60660_solr ] o.a.s.c.CorePropertiesLocator Found 0 core definitions underneath /x1/jenkins/jenkins-slave/workspace/Lucene-Solr-Tests-master/solr/build/solr-core/test/J2/temp/solr.cloud.ReplaceNodeTest_AB71D7B2D5B39E16-001/tempDir-001/node3/.
[junit4] 2> 2569845 INFO (jetty-launcher-2563-thread-4) [n:127.0.0.1:33379_solr ] o.a.s.c.CorePropertiesLocator Found 0 core definitions underneath /x1/jenkins/jenkins-slave/workspace/Lucene-Solr-Tests-master/solr/build/solr-core/test/J2/temp/solr.cloud.ReplaceNodeTest_AB71D7B2D5B39E16-001/tempDir-001/node4/.
[junit4] 2> 2569847 INFO (zkCallback-2597-thread-1-processing-n:127.0.0.1:33379_solr) [n:127.0.0.1:33379_solr ] o.a.s.c.c.ZkStateReader Updated live nodes from ZooKeeper... (4) -> (5)
[junit4] 2> 2569852 INFO (zkCallback-2586-thread-1-processing-n:127.0.0.1:45606_solr) [n:127.0.0.1:45606_solr ] o.a.s.c.c.ZkStateReader Updated live nodes from ZooKeeper... (5) -> (6)
[junit4] 2> 2569852 INFO (zkCallback-2589-thread-2-processing-n:127.0.0.1:43310_solr) [n:127.0.0.1:43310_solr ] o.a.s.c.c.ZkStateReader Updated live nodes from ZooKeeper... (5) -> (6)
[junit4] 2> 2569862 INFO (jetty-launcher-2563-thread-1) [n:127.0.0.1:44685_solr ] o.a.s.c.CorePropertiesLocator Found 0 core definitions underneath /x1/jenkins/jenkins-slave/workspace/Lucene-Solr-Tests-master/solr/build/solr-core/test/J2/temp/solr.cloud.ReplaceNodeTest_AB71D7B2D5B39E16-001/tempDir-001/node1/.
[junit4] 2> 2569863 INFO (zkCallback-2583-thread-1-processing-n:127.0.0.1:47481_solr) [n:127.0.0.1:47481_solr ] o.a.s.c.c.ZkStateReader Updated live nodes from ZooKeeper... (5) -> (6)
[junit4] 2> 2569866 INFO (zkCallback-2588-thread-1-processing-n:127.0.0.1:60660_solr) [n:127.0.0.1:60660_solr ] o.a.s.c.c.ZkStateReader Updated live nodes from ZooKeeper... (5) -> (6)
[junit4] 2> 2569866 INFO (zkCallback-2598-thread-1-processing-n:127.0.0.1:44685_solr) [n:127.0.0.1:44685_solr ] o.a.s.c.c.ZkStateReader Updated live nodes from ZooKeeper... (5) -> (6)
[junit4] 2> 2569874 INFO (zkCallback-2597-thread-1-processing-n:127.0.0.1:33379_solr) [n:127.0.0.1:33379_solr ] o.a.s.c.c.ZkStateReader Updated live nodes from ZooKeeper... (5) -> (6)
[junit4] 2> 2569899 INFO (SUITE-ReplaceNodeTest-seed#[AB71D7B2D5B39E16]-worker) [ ] o.a.s.c.c.ZkStateReader Updated live nodes from ZooKeeper... (0) -> (6)
[junit4] 2> 2570052 INFO (TEST-ReplaceNodeTest.test-seed#[AB71D7B2D5B39E16]) [ ] o.a.s.SolrTestCaseJ4 ###Starting test
[junit4] 2> 2570057 INFO (TEST-ReplaceNodeTest.test-seed#[AB71D7B2D5B39E16]) [ ] o.a.s.c.ReplaceNodeTest total_jettys: 6
[junit4] 2> 2570172 INFO (qtp469615316-14375) [n:127.0.0.1:43310_solr ] o.a.s.h.a.CollectionsHandler Invoked Collection Action :create with params replicationFactor=2&collection.configName=conf1&maxShardsPerNode=3&name=replacenodetest_coll&action=CREATE&numShards=5&createNodeSet=127.0.0.1:33379_solr,127.0.0.1:43310_solr,127.0.0.1:47481_solr,127.0.0.1:45606_solr,127.0.0.1:44685_solr&wt=javabin&version=2 and sendToOCPQueue=true
[junit4] 2> 2570175 INFO (OverseerThreadFactory-6299-thread-1-processing-n:127.0.0.1:47481_solr) [n:127.0.0.1:47481_solr ] o.a.s.c.CreateCollectionCmd Create collection replacenodetest_coll
[junit4] 2> 2570424 INFO (qtp1367335269-14359) [n:127.0.0.1:44685_solr ] o.a.s.h.a.CoreAdminOperation core create command qt=/admin/cores&collection.configName=conf1&name=replacenodetest_coll_shard5_replica1&action=CREATE&numShards=5&collection=replacenodetest_coll&shard=shard5&wt=javabin&version=2
[junit4] 2> 2570483 INFO (qtp469615316-14372) [n:127.0.0.1:43310_solr ] o.a.s.h.a.CoreAdminOperation core create command qt=/admin/cores&collection.configName=conf1&name=replacenodetest_coll_shard4_replica1&action=CREATE&numShards=5&collection=replacenodetest_coll&shard=shard4&wt=javabin&version=2
[junit4] 2> 2570483 INFO (qtp469615316-14369) [n:127.0.0.1:43310_solr ] o.a.s.h.a.CoreAdminOperation core create command qt=/admin/cores&collection.configName=conf1&name=replacenodetest_coll_shard1_replica2&action=CREATE&numShards=5&collection=replacenodetest_coll&shard=shard1&wt=javabin&version=2
[junit4] 2> 2570493 INFO (qtp513113570-14314) [n:127.0.0.1:33379_solr ] o.a.s.h.a.CoreAdminOperation core create command qt=/admin/cores&collection.configName=conf1&name=replacenodetest_coll_shard3_replica1&action=CREATE&numShards=5&collection=replacenodetest_coll&shard=shard3&wt=javabin&version=2
[junit4] 2> 2570563 INFO (qtp2104945643-14348) [n:127.0.0.1:47481_solr ] o.a.s.h.a.CoreAdminOperation core create command qt=/admin/cores&collection.configName=conf1&name=replacenodetest_coll_shard3_replica2&action=CREATE&numShards=5&collection=replacenodetest_coll&shard=shard3&wt=javabin&version=2
[junit4] 2> 2570564 INFO (qtp1344576036-14324) [n:127.0.0.1:45606_solr ] o.a.s.h.a.CoreAdminOperation core create command qt=/admin/cores&collection.configName=conf1&name=replacenodetest_coll_shard4_replica2&action=CREATE&numShards=5&collection=replacenodetest_coll&shard=shard4&wt=javabin&version=2
[junit4] 2> 2570669 INFO (zkCallback-2598-thread-1-processing-n:127.0.0.1:44685_solr) [n:127.0.0.1:44685_solr ] o.a.s.c.c.ZkStateReader A cluster state change: [WatchedEvent state:SyncConnected type:NodeDataChanged path:/collections/replacenodetest_coll/state.json] for collection [replacenodetest_coll] has occurred - updating... (live nodes size: [6])
[junit4] 2> 2570670 INFO (zkCallback-2589-thread-2-processing-n:127.0.0.1:43310_solr) [n:127.0.0.1:43310_solr ] o.a.s.c.c.ZkStateReader A cluster state change: [WatchedEvent state:SyncConnected type:NodeDataChanged path:/collections/replacenodetest_coll/state.json] for collection [replacenodetest_coll] has occurred - updating... (live nodes size: [6])
[junit4] 2> 2570671 INFO (zkCallback-2597-thread-1-processing-n:127.0.0.1:33379_solr) [n:127.0.0.1:33379_solr ] o.a.s.c.c.ZkStateReader A cluster state change: [WatchedEvent state:SyncConnected type:NodeDataChanged path:/collections/replacenodetest_coll/state.json] for collection [replacenodetest_coll] has occurred - updating... (live nodes size: [6])
[junit4] 2> 2570703 INFO (qtp1367335269-14361) [n:127.0.0.1:44685_solr ] o.a.s.h.a.CoreAdminOperation core create command qt=/admin/cores&collection.configName=conf1&name=replacenodetest_coll_shard2_replica2&action=CREATE&numShards=5&collection=replacenodetest_coll&shard=shard2&wt=javabin&version=2
[junit4] 2> 2570707 INFO (qtp1344576036-14326) [n:127.0.0.1:45606_solr ] o.a.s.h.a.CoreAdminOperation core create command qt=/admin/cores&collection.configName=conf1&name=replacenodetest_coll_shard2_replica1&action=CREATE&numShards=5&collection=replacenodetest_coll&shard=shard2&wt=javabin&version=2
[junit4] 2> 2570707 INFO (qtp2104945643-14350) [n:127.0.0.1:47481_solr ] o.a.s.h.a.CoreAdminOperation core create command qt=/admin/cores&collection.configName=conf1&name=replacenodetest_coll_shard1_replica1&action=CREATE&numShards=5&collection=replacenodetest_coll&shard=shard1&wt=javabin&version=2
[junit4] 2> 2570719 INFO (qtp513113570-14317) [n:127.0.0.1:33379_solr ] o.a.s.h.a.CoreAdminOperation core create command qt=/admin/cores&collection.configName=conf1&name=replacenodetest_coll_shard5_replica2&action=CREATE&numShards=5&collection=replacenodetest_coll&shard=shard5&wt=javabin&version=2
[junit4] 2> 2570848 INFO (zkCallback-2597-thread-1-processing-n:127.0.0.1:33379_solr) [n:127.0.0.1:33379_solr ] o.a.s.c.c.ZkStateReader A cluster state change: [WatchedEvent state:SyncConnected type:NodeDataChanged path:/collections/replacenodetest_coll/state.json] for collection [replacenodetest_coll] has occurred - updating... (live nodes size: [6])
[junit4] 2> 2570848 INFO (zkCallback-2586-thread-1-processing-n:127.0.0.1:45606_solr) [n:127.0.0.1:45606_solr ] o.a.s.c.c.ZkStateReader A cluster state change: [WatchedEvent state:SyncConnected type:NodeDataChanged path:/collections/replacenodetest_coll/state.json] for collection [replacenodetest_coll] has occurred - updating... (live nodes size: [6])
[junit4] 2> 2570848 INFO (zkCallback-2589-thread-2-processing-n:127.0.0.1:43310_solr) [n:127.0.0.1:43310_solr ] o.a.s.c.c.ZkStateReader A cluster state change: [WatchedEvent state:SyncConnected type:NodeDataChanged path:/collections/replacenodetest_coll/state.json] for collection [replacenodetest_coll] has occurred - updating... (live nodes size: [6])
[junit4] 2> 2570849 INFO (zkCallback-2598-thread-1-processing-n:127.0.0.1:44685_solr) [n:127.0.0.1:44685_solr ] o.a.s.c.c.ZkStateReader A cluster state change: [WatchedEvent state:SyncConnected type:NodeDataChanged path:/collections/replacenodetest_coll/state.json] for collection [replacenodetest_coll] has occurred - updating... (live nodes size: [6])
[junit4] 2> 2570849 INFO (zkCallback-2583-thread-4-processing-n:127.0.0.1:47481_solr) [n:127.0.0.1:47481_solr ] o.a.s.c.c.ZkStateReader A cluster state change: [WatchedEvent state:SyncConnected type:NodeDataChanged path:/collections/replacenodetest_coll/state.json] for collection [replacenodetest_coll] has occurred - updating... (live nodes size: [6])
[junit4] 2> 2571502 INFO (qtp469615316-14372) [n:127.0.0.1:43310_solr c:replacenodetest_coll s:shard4 x:replacenodetest_coll_shard4_replica1] o.a.s.c.SolrConfig Using Lucene MatchVersion: 7.0.0
[junit4] 2> 2571510 INFO (qtp469615316-14369) [n:127.0.0.1:43310_solr c:replacenodetest_coll s:shard1 x:replacenodetest_coll_shard1_replica2] o.a.s.c.SolrConfig Using Lucene MatchVersion: 7.0.0
[junit4] 2> 2571522 INFO (qtp469615316-14369) [n:127.0.0.1:43310_solr c:replacenodetest_coll s:shard1 x:replacenodetest_coll_shard1_replica2] o.a.s.s.IndexSchema [replacenodetest_coll_shard1_replica2] Schema name=cloud-dynamic
[junit4] 2> 2571534 INFO (qtp469615316-14372) [n:127.0.0.1:43310_solr c:replacenodetest_coll s:shard4 x:replacenodetest_coll_shard4_replica1] o.a.s.s.IndexSchema [replacenodetest_coll_shard4_replica1] Schema name=cloud-dynamic
[junit4] 2> 2571750 WARN (qtp469615316-14369) [n:127.0.0.1:43310_solr c:replacenodetest_coll s:shard1 x:replacenodetest_coll_shard1_replica2] o.a.s.s.IndexSchema [replacenodetest_coll_shard1_replica2] default search field in schema is text. WARNING: Deprecated, please use 'df' on request instead.
[junit4] 2> 2571751 INFO (qtp469615316-14369) [n:127.0.0.1:43310_solr c:replacenodetest_coll s:shard1 x:replacenodetest_coll_shard1_replica2] o.a.s.s.IndexSchema Loaded schema cloud-dynamic/1.6 with uniqueid field id
[junit4] 2> 2571769 WARN (qtp469615316-14372) [n:127.0.0.1:43310_solr c:replacenodetest_coll s:shard4 x:replacenodetest_coll_shard4_replica1] o.a.s.s.IndexSchema [replacenodetest_coll_shard4_replica1] default search field in schema is text. WARNING: Deprecated, please use 'df' on request instead.
[junit4] 2> 2571889 INFO (qtp1344576036-14326) [n:127.0.0.1:45606_solr c:replacenodetest_coll s:shard2 x:replacenodetest_coll_shard2_replica1] o.a.s.c.SolrConfig Using Lucene MatchVersion: 7.0.0
[junit4] 2> 2571896 INFO (qtp469615316-14372) [n:127.0.0.1:43310_solr c:replacenodetest_coll s:shard4 x:replacenodetest_coll_shard4_replica1] o.a.s.s.IndexSchema Loaded schema cloud-dynamic/1.6 with uniqueid field id
[junit4] 2> 2571897 INFO (qtp469615316-14372) [n:127.0.0.1:43310_solr c:replacenodetest_coll s:shard4 x:replacenodetest_coll_shard4_replica1] o.a.s.c.CoreContainer Creating SolrCore 'replacenodetest_coll_shard4_replica1' using configuration from collection replacenodetest_coll
[junit4] 2> 2571898 INFO (qtp469615316-14372) [n:127.0.0.1:43310_solr c:replacenodetest_coll s:shard4 r:core_node2 x:replacenodetest_coll_shard4_replica1] o.a.s.c.SolrCore [[replacenodetest_coll_shard4_replica1] ] Opening new SolrCore at [/x1/jenkins/jenkins-slave/workspace/Lucene-Solr-Tests-master/solr/build/solr-core/test/J2/temp/solr.cloud.ReplaceNodeTest_AB71D7B2D5B39E16-001/tempDir-001/node5/replacenodetest_coll_shard4_replica1], dataDir=[/x1/jenkins/jenkins-slave/workspace/Lucene-Solr-Tests-master/solr/build/solr-core/test/J2/temp/solr.cloud.ReplaceNodeTest_AB71D7B2D5B39E16-001/tempDir-001/node5/./replacenodetest_coll_shard4_replica1/data/]
[junit4] 2> 2571902 INFO (qtp1344576036-14326) [n:127.0.0.1:45606_solr c:replacenodetest_coll s:shard2 x:replacenodetest_coll_shard2_replica1] o.a.s.s.IndexSchema [replacenodetest_coll_shard2_replica1] Schema name=cloud-dynamic
[junit4] 2> 2571886 INFO (qtp513113570-14314) [n:127.0.0.1:33379_solr c:replacenodetest_coll s:shard3 x:replacenodetest_coll_shard3_replica1] o.a.s.c.SolrConfig Using Lucene MatchVersion: 7.0.0
[junit4] 2> 2571880 INFO (qtp2104945643-14348) [n:127.0.0.1:47481_solr c:replacenodetest_coll s:shard3 x:replacenodetest_coll_shard3_replica2] o.a.s.c.SolrConfig Using Lucene MatchVersion: 7.0.0
[junit4] 2> 2571878 INFO (qtp1367335269-14361) [n:127.0.0.1:44685_solr c:replacenodetest_coll s:shard2 x:replacenodetest_coll_shard2_replica2] o.a.s.c.SolrConfig Using Lucene MatchVersion: 7.0.0
[junit4] 2> 2571876 INFO (qtp1344576036-14324) [n:127.0.0.1:45606_solr c:replacenodetest_coll s:shard4 x:replacenodetest_coll_shard4_replica2] o.a.s.c.SolrConfig Using Lucene MatchVersion: 7.0.0
[junit4] 2> 2571873 INFO (qtp1367335269-14359) [n:127.0.0.1:44685_solr c:replacenodetest_coll s:shard5 x:replacenodetest_coll_shard5_replica1] o.a.s.c.SolrConfig Using Lucene MatchVersion: 7.0.0
[junit4] 2> 2571871 INFO (qtp2104945643-14350) [n:127.0.0.1:47481_solr c:replacenodetest_coll s:shard1 x:replacenodetest_coll_shard1_replica1] o.a.s.c.SolrConfig Using Lucene MatchVersion: 7.0.0
[junit4] 2> 2571867 INFO (qtp513113570-14317) [n:127.0.0.1:33379_solr c:replacenodetest_coll s:shard5 x:replacenodetest_coll_shard5_replica2] o.a.s.c.SolrConfig Using Lucene MatchVersion: 7.0.0
[junit4] 2> 2571780 INFO (qtp469615316-14369) [n:127.0.0.1:43310_solr c:replacenodetest_coll s:shard1 x:replacenodetest_coll_shard1_replica2] o.a.s.c.CoreContainer Creating SolrCore 'replacenodetest_coll_shard1_replica2' using configuration from collection replacenodetest_coll
[junit4] 2> 2571991 INFO (qtp469615316-14369) [n:127.0.0.1:43310_solr c:replacenodetest_coll s:shard1 r:core_node1 x:replacenodetest_coll_shard1_replica2] o.a.s.c.SolrCore [[replacenodetest_coll_shard1_replica2] ] Opening new SolrCore at [/x1/jenkins/jenkins-slave/workspace/Lucene-Solr-Tests-master/solr/build/solr-core/test/J2/temp/solr.cloud.ReplaceNodeTest_AB71D7B2D5B39E16-001/tempDir-001/node5/replacenodetest_coll_shard1_replica2], dataDir=[/x1/jenkins/jenkins-slave/workspace/Lucene-Solr-Tests-master/solr/build/solr-core/test/J2/temp/solr.cloud.ReplaceNodeTest_AB71D7B2D5B39E16-001/tempDir-001/node5/./replacenodetest_coll_shard1_replica2/data/]
[junit4] 2> 2571984 WARN (qtp1344576036-14326) [n:127.0.0.1:45606_solr c:replacenodetest_coll s:shard2 x:replacenodetest_coll_shard2_replica1] o.a.s.s.IndexSchema [replacenodetest_coll_shard2_replica1] default search field in schema is text. WARNING: Deprecated, please use 'df' on request instead.
[junit4] 2> 2571992 INFO (qtp1344576036-14326) [n:127.0.0.1:45606_solr c:replacenodetest_coll s:shard2 x:replacenodetest_coll_shard2_replica1] o.a.s.s.IndexSchema Loaded schema cloud-dynamic/1.6 with uniqueid field id
[junit4] 2> 2571992 INFO (qtp513113570-14314) [n:127.0.0.1:33379_solr c:replacenodetest_coll s:shard3 x:replacenodetest_coll_shard3_replica1] o.a.s.s.IndexSchema [replacenodetest_coll_shard3_replica1] Schema name=cloud-dynamic
[junit4] 2> 2571999 INFO (qtp469615316-14372) [n:127.0.0.1:43310_solr c:replacenodetest_coll s:shard4 r:core_node2 x:replacenodetest_coll_shard4_replica1] o.a.s.u.UpdateHandler Using UpdateLog implementation: org.apache.solr.update.UpdateLog
[junit4] 2> 2571999 INFO (qtp469615316-14372) [n:127.0.0.1:43310_solr c:replacenodetest_coll s:shard4 r:core_node2 x:replacenodetest_coll_shard4_replica1] o.a.s.u.UpdateLog Initializing UpdateLog: dataDir=null defaultSyncLevel=FLUSH numRecordsToKeep=100 maxNumLogsToKeep=10 numVersionBuckets=65536
[junit4] 2> 2572003 INFO (qtp1344576036-14324) [n:127.0.0.1:45606_solr c:replacenodetest_coll s:shard4 x:replacenodetest_coll_shard4_replica2] o.a.s.s.IndexSchema [replacenodetest_coll_shard4_replica2] Schema name=cloud-dynamic
[junit4] 2> 2572010 INFO (qtp1367335269-14359) [n:127.0.0.1:44685_solr c:replacenodetest_coll s:shard5 x:replacenodetest_coll_shard5_replica1] o.a.s.s.IndexSchema [replacenodetest_coll_shard5_replica1] Schema name=cloud-dynamic
[junit4] 2> 2572010 INFO (qtp2104945643-14348) [n:127.0.0.1:47481_solr c:replacenodetest_coll s:shard3 x:replacenodetest_coll_shard3_replica2] o.a.s.s.IndexSchema [replacenodetest_coll_shard3_replica2] Schema name=cloud-dynamic
[junit4] 2> 2572013 WARN (qtp513113570-14314) [n:127.0.0.1:33379_solr c:replacenodetest_coll s:shard3 x:replacenodetest_coll_shard3_replica1] o.a.s.s.IndexSchema [replacenodetest_coll_shard3_replica1] default search field in schema is text. WARNING: Deprecated, please use 'df' on request instead.
[junit4] 2> 2572014 INFO (qtp513113570-14314) [n:127.0.0.1:33379_solr c:replacenodetest_coll s:shard3 x:replacenodetest_coll_shard3_replica1] o.a.s.s.IndexSchema Loaded schema cloud-dynamic/1.6 with uniqueid field id
[junit4] 2> 2572015 INFO (qtp513113570-14317) [n:127.0.0.1:33379_solr c:replacenodetest_coll s:shard5 x:replacenodetest_coll_shard5_replica2] o.a.s.s.IndexSchema [replacenodetest_coll_shard5_replica2] Schema name=cloud-dynamic
[junit4] 2> 2572015 INFO (qtp513113570-14314) [n:127.0.0.1:33379_solr c:replacenodetest_coll s:shard3 x:replacenodetest_coll_shard3_replica1] o.a.s.c.CoreContainer Creating SolrCore 'replacenodetest_coll_shard3_replica1' using configuration from collection replacenodetest_coll
[junit4] 2> 2572015 INFO (qtp513113570-14314) [n:127.0.0.1:33379_solr c:replacenodetest_coll s:shard3 r:core_node3 x:replacenodetest_coll_shard3_replica1] o.a.s.c.SolrCore [[replacenodetest_coll_shard3_replica1] ] Opening new SolrCore at [/x1/jenkins/jenkins-slave/workspace/Lucene-Solr-Tests-master/solr/build/solr-core/test/J2/temp/solr.cloud.ReplaceNodeTest_AB71D7B2D5B39E16-001/tempDir-001/node4/replacenodetest_coll_shard3_replica1], dataDir=[/x1/jenkins/jenkins-slave/workspace/Lucene-Solr-Tests-master/solr/build/solr-core/test/J2/temp/solr.cloud.ReplaceNodeTest_AB71D7B2D5B39E16-001/tempDir-001/node4/./replacenodetest_coll_shard3_replica1/data/]
[junit4] 2> 2571989 INFO (qtp2104945643-14350) [n:127.0.0.1:47481_solr c:replacenodetest_coll s:shard1 x:replacenodetest_coll_shard1_replica1] o.a.s.s.IndexSchema [replacenodetest_coll_shard1_replica1] Schema name=cloud-dynamic
[junit4] 2> 2571988 INFO (qtp1367335269-14361) [n:127.0.0.1:44685_solr c:replacenodetest_coll s:shard2 x:replacenodetest_coll_shard2_replica2] o.a.s.s.IndexSchema [replacenodetest_coll_shard2_replica2] Schema name=cloud-dynamic
[junit4] 2> 2572003 INFO (qtp469615316-14372) [n:127.0.0.1:43310_solr c:replacenodetest_coll s:shard4 r:core_node2 x:replacenodetest_coll_shard4_replica1] o.a.s.u.CommitTracker Hard AutoCommit: disabled
[junit4] 2> 2572017 INFO (qtp469615316-14372) [n:127.0.0.1:43310_solr c:replacenodetest_coll s:shard4 r:core_node2 x:replacenodetest_coll_shard4_replica1] o.a.s.u.CommitTracker Soft AutoCommit: disabled
[junit4] 2> 2572017 INFO (qtp1344576036-14326) [n:127.0.0.1:45606_solr c:replacenodetest_coll s:shard2 x:replacenodetest_coll_shard2_replica1] o.a.s.c.CoreContainer Creating SolrCore 'replacenodetest_coll_shard2_replica1' using configuration from collection replacenodetest_coll
[junit4] 2> 2572017 INFO (qtp469615316-14372) [n:127.0.0.1:43310_solr c:replacenodetest_coll s:shard4 r:core_node2 x:replacenodetest_coll_shard4_replica1] o.a.s.s.SolrIndexSearcher Opening [Searcher@6e1f5ef2[replacenodetest_coll_shard4_replica1] main]
[junit4] 2> 2572117 INFO (qtp1344576036-14326) [n:127.0.0.1:45606_solr c:replacenodetest_coll s:shard2 r:core_node8 x:replacenodetest_coll_shard2_replica1] o.a.s.c.SolrCore [[replacenodetest_coll_shard2_replica1] ] Opening new SolrCore at [/x1/jenkins/jenkins-slave/workspace/Lucene-Solr-Tests-master/solr/build/solr-core/test/J2/temp/solr.cloud.ReplaceNodeTest_AB71D7B2D5B39E16-001/tempDir-001/node6/replacenodetest_coll_shard2_replica1], dataDir=[/x1/jenkins/jenkins-slave/workspace/Lucene-Solr-Tests-master/solr/build/solr-core/test/J2/temp/solr.cloud.ReplaceNodeTest_AB71D7B2D5B39E16-001/tempDir-001/node6/./replacenodetest_coll_shard2_replica1/data/]
[junit4] 2> 2572118 INFO (qtp469615316-14372) [n:127.0.0.1:43310_solr c:replacenodetest_coll s:shard4 r:core_node2 x:replacenodetest_coll_shard4_replica1] o.a.s.r.ManagedResourceStorage Configured ZooKeeperStorageIO with znodeBase: /configs/conf1
[junit4] 2> 2572119 INFO (qtp469615316-14372) [n:127.0.0.1:43310_solr c:replacenodetest_coll s:shard4 r:core_node2 x:replacenodetest_coll_shard4_replica1] o.a.s.r.ManagedResourceStorage Loaded null at path _rest_managed.json using ZooKeeperStorageIO:path=/configs/conf1
[junit4] 2> 2572119 INFO (qtp469615316-14372) [n:127.0.0.1:43310_solr c:replacenodetest_coll s:shard4 r:core_node2 x:replacenodetest_coll_shard4_replica1] o.a.s.h.ReplicationHandler Commits will be reserved for 10000
[junit4] 2> 2572171 INFO (qtp469615316-14369) [n:127.0.0.1:43310_solr c:replacenodetest_coll s:shard1 r:core_node1 x:replacenodetest_coll_shard1_replica2] o.a.s.u.UpdateHandler Using UpdateLog implementation: org.apache.solr.update.UpdateLog
[junit4] 2> 2572171 INFO (qtp469615316-14369) [n:127.0.0.1:43310_solr c:replacenodetest_coll s:shard1 r:core_node1 x:replacenodetest_coll_shard1_replica2] o.a.s.u.UpdateLog Initializing UpdateLog: dataDir=null defaultSyncLevel=FLUSH numRecordsToKeep=100 maxNumLogsToKeep=10 numVersionBuckets=65536
[junit4] 2> 2572172 INFO (qtp469615316-14369) [n:127.0.0.1:43310_solr c:replacenodetest_coll s:shard1 r:core_node1 x:replacenodetest_coll_shard1_replica2] o.a.s.u.CommitTracker Hard AutoCommit: disabled
[junit4] 2> 2572172 INFO (qtp469615316-14369) [n:127.0.0.1:43310_solr c:replacenodetest_coll s:shard1 r:core_node1 x:replacenodetest_coll_shard1_replica2] o.a.s.u.CommitTracker Soft AutoCommit: disabled
[junit4] 2> 2572175 INFO (qtp469615316-14369) [n:127.0.0.1:43310_solr c:replacenodetest_coll s:shard1 r:core_node1 x:replacenodetest_coll_shard1_replica2] o.a.s.s.SolrIndexSearcher Opening [Searcher@7ce26ab3[replacenodetest_coll_shard1_replica2] main]
[junit4] 2> 2572179 INFO (qtp469615316-14369) [n:127.0.0.1:43310_solr c:replacenodetest_coll s:shard1 r:core_node1 x:replacenodetest_coll_shard1_replica2] o.a.s.r.ManagedResourceStorage Configured ZooKeeperStorageIO with znodeBase: /configs/conf1
[junit4] 2> 2572179 INFO (qtp469615316-14369) [n:127.0.0.1:43310_solr c:replacenodetest_coll s:shard1 r:core_node1 x:replacenodetest_coll_shard1_replica2] o.a.s.r.ManagedResourceStorage Loaded null at path _rest_managed.json using ZooKeeperStorageIO:path=/configs/conf1
[junit4] 2> 2572179 INFO (qtp469615316-14369) [n:127.0.0.1:43310_solr c:replacenodetest_coll s:shard1 r:core_node1 x:replacenodetest_coll_shard1_replica2] o.a.s.h.ReplicationHandler Commits will be reserved for 10000
[junit4] 2> 2572180 INFO (qtp469615316-14369) [n:127.0.0.1:43310_solr c:replacenodetest_coll s:shard1 r:core_node1 x:replacenodetest_coll_shard1_replica2] o.a.s.u.UpdateLog Could not find max version in index or recent updates, using new clock 1547259641191202816
[junit4] 2> 2572256 INFO (qtp469615316-14372) [n:127.0.0.1:43310_solr c:replacenodetest_coll s:shard4 r:core_node2 x:replacenodetest_coll_shard4_replica1] o.a.s.u.UpdateLog Could not find max version in index or recent updates, using new clock 1547259641270894592
[junit4] 2> 2572270 INFO (searcherExecutor-6308-thread-1-processing-n:127.0.0.1:43310_solr x:replacenodetest_coll_shard4_replica1 s:shard4 c:replacenodetest_coll r:core_node2) [n:127.0.0.1:43310_solr c:replacenodetest_coll s:shard4 r:core_node2 x:replacenodetest_coll_shard4_replica1] o.a.s.c.SolrCore [replacenodetest_coll_shard4_replica1] Registered new searcher Searcher@6e1f5ef2[replacenodetest_coll_shard4_replica1] main{ExitableDirectoryReader(UninvertingDirectoryReader())}
[junit4] 2> 2572279 INFO (qtp513113570-14314) [n:127.0.0.1:33379_solr c:replacenodetest_coll s:shard3 r:core_node3 x:replacenodetest_coll_shard3_replica1] o.a.s.u.UpdateHandler Using UpdateLog implementation: org.apache.solr.update.UpdateLog
[junit4] 2> 2572279 INFO (qtp513113570-14314) [n:127.0.0.1:33379_solr c:replacenodetest_coll s:shard3 r:core_node3 x:replacenodetest_coll_shard3_replica1] o.a.s.u.UpdateLog Initializing UpdateLog: dataDir=null defaultSyncLevel=FLUSH numRecordsToKeep=100 maxNumLogsToKeep=10 numVersionBuckets=65536
[junit4] 2> 2572280 INFO (qtp513113570-14314) [n:127.0.0.1:33379_solr c:replacenodetest_coll s:shard3 r:core_node3 x:replacenodetest_coll_shard3_replica1] o.a.s.u.CommitTracker Hard AutoCommit: disabled
[junit4] 2> 2572280 INFO (qtp513113570-14314) [n:127.0.0.1:33379_solr c:replacenodetest_coll s:shard3 r:core_node3 x:replacenodetest_coll_shard3_replica1] o.a.s.u.CommitTracker Soft AutoCommit: disabled
[junit4] 2> 2572283 WARN (qtp1367335269-14359) [n:127.0.0.1:44685_solr c:replacenodetest_coll s:shard5 x:replacenodetest_coll_shard5_replica1] o.a.s.s.IndexSchema [replacenodetest_coll_shard5_replica1] default search field in schema is text. WARNING: Deprecated, please use 'df' on request instead.
[junit4] 2> 2572283 INFO (qtp1367335269-14359) [n:127.0.0.1:44685_solr c:replacenodetest_coll s:shard5 x:replacenodetest_coll_shard5_replica1] o.a.s.s.IndexSchema Loaded schema cloud-dynamic/1.6 with uniqueid field id
[junit4] 2> 2572284 INFO (searcherExecutor-6309-thread-1-processing-n:127.0.0.1:43310_solr x:replacenodetest_coll_shard1_replica2 s:shard1 c:replacenodetest_coll r:core_node1) [n:127.0.0.1:43310_solr c:replacenodetest_coll s:shard1 r:core_node1 x:replacenodetest_coll_shard1_replica2] o.a.s.c.SolrCore [replacenodetest_coll_shard1_replica2] Registered new searcher Searcher@7ce26ab3[replacenodetest_coll_shard1_replica2] main{ExitableDirectoryReader(UninvertingDirectoryReader())}
[junit4] 2> 2572284 INFO (qtp1367335269-14359) [n:127.0.0.1:44685_solr c:replacenodetest_coll s:shard5 x:replacenodetest_coll_shard5_replica1] o.a.s.c.CoreContainer Creating SolrCore 'replacenodetest_coll_shard5_replica1' using configuration from collection replacenodetest_coll
[junit4] 2> 2572285 INFO (qtp1367335269-14359) [n:127.0.0.1:44685_solr c:replacenodetest_coll s:shard5 r:core_node4 x:replacenodetest_coll_shard5_replica1] o.a.s.c.SolrCore [[replacenodetest_coll_shard5_replica1] ] Opening new SolrCore at [/x1/jenkins/jenkins-slave/workspace/Lucene-Solr-Tests-master/solr/build/solr-core/test/J2/temp/solr.cloud.ReplaceNodeTest_AB71D7B2D5B39E16-001/tempDir-001/node1/replacenodetest_coll_shard5_replica1], dataDir=[/x1/jenkins/jenkins-slave/workspace/Lucene-Solr-Tests-master/solr/build/solr-core/test/J2/temp/solr.cloud.ReplaceNodeTest_AB71D7B2D5B39E16-001/tempDir-001/node1/./replacenodetest_coll_shard5_replica1/data/]
[junit4] 2> 2572287 INFO (qtp513113570-14314) [n:127.0.0.1:33379_solr c:replacenodetest_coll s:shard3 r:core_node3 x:replacenodetest_coll_shard3_replica1] o.a.s.s.SolrIndexSearcher Opening [Searcher@39059d8[replacenodetest_coll_shard3_replica1] main]
[junit4] 2> 2572296 INFO (qtp1344576036-14326) [n:127.0.0.1:45606_solr c:replacenodetest_coll s:shard2 r:core_node8 x:replacenodetest_coll_shard2_replica1] o.a.s.u.UpdateHandler Using UpdateLog implementation: org.apache.solr.update.UpdateLog
[junit4] 2> 2572296 INFO (qtp1344576036-14326) [n:127.0.0.1:45606_solr c:replacenodetest_coll s:shard2 r:core_node8 x:replacenodetest_coll_shard2_replica1] o.a.s.u.UpdateLog Initializing UpdateLog: dataDir=null defaultSyncLevel=FLUSH numRecordsToKeep=100 maxNumLogsToKeep=10 numVersionBuckets=65536
[junit4] 2> 2572297 INFO (qtp1344576036-14326) [n:127.0.0.1:45606_solr c:replacenodetest_coll s:shard2 r:core_node8 x:replacenodetest_coll_shard2_replica1] o.a.s.u.CommitTracker Hard AutoCommit: disabled
[junit4] 2> 2572297 INFO (qtp1344576036-14326) [n:127.0.0.1:45606_solr c:replacenodetest_coll s:shard2 r:core_node8 x:replacenodetest_coll_shard2_replica1] o.a.s.u.CommitTracker Soft AutoCommit: disabled
[junit4] 2> 2572297 INFO (qtp1344576036-14326) [n:127.0.0.1:45606_solr c:replacenodetest_coll s:shard2 r:core_node8 x:replacenodetest_coll_shard2_replica1] o.a.s.s.SolrIndexSearcher Opening [Searcher@6b1f1aec[replacenodetest_coll_shard2_replica1] main]
[junit4] 2> 2572302 INFO (qtp513113570-14314) [n:127.0.0.1:33379_solr c:replacenodetest_coll s:shard3 r:core_node3 x:replacenodetest_coll_shard3_replica1] o.a.s.r.ManagedResourceStorage Configured ZooKeeperStorageIO with znodeBase: /configs/conf1
[junit4] 2> 2572303 INFO (qtp1344576036-14326) [n:127.0.0.1:45606_solr c:replacenodetest_coll s:shard2 r:core_node8 x:replacenodetest_coll_shard2_replica1] o.a.s.r.ManagedResourceStorage Configured ZooKeeperStorageIO with znodeBase: /configs/conf1
[junit4] 2> 2572303 INFO (qtp1344576036-14326) [n:127.0.0.1:45606_solr c:replacenodetest_coll s:shard2 r:core_node8 x:replacenodetest_coll_shard2_replica1] o.a.s.r.ManagedResourceStorage Loaded null at path _rest_managed.json using ZooKeeperStorageIO:path=/configs/conf1
[junit4] 2> 2572303 INFO (qtp1344576036-14326) [n:127.0.0.1:45606_solr c:replacenodetest_coll s:shard2 r:core_node8 x:replacenodetest_coll_shard2_replica1] o.a.s.h.ReplicationHandler Commits will be reserved for 10000
[junit4] 2> 2572303 INFO (qtp1344576036-14326) [n:127.0.0.1:45606_solr c:replacenodetest_coll s:shard2 r:core_node8 x:replacenodetest_coll_shard2_replica1] o.a.s.u.UpdateLog Could not find max version in index or recent updates, using new clock 1547259641320177664
[junit4] 2> 2572307 INFO (qtp513113570-14314) [n:127.0.0.1:33379_solr c:replacenodetest_coll s:shard3 r:core_node3 x:replacenodetest_coll_shard3_replica1] o.a.s.r.ManagedResourceStorage Loaded null at path _rest_managed.json using ZooKeeperStorageIO:path=/configs/conf1
[junit4] 2> 2572307 INFO (qtp513113570-14314) [n:127.0.0.1:33379_solr c:replacenodetest_coll s:shard3 r:core_node3 x:replacenodetest_coll_shard3_replica1] o.a.s.h.ReplicationHandler Commits will be reserved for 10000
[junit4] 2> 2572307 INFO (qtp513113570-14314) [n:127.0.0.1:33379_solr c:replacenodetest_coll s:shard3 r:core_node3 x:replacenodetest_coll_shard3_replica1] o.a.s.u.UpdateLog Could not find max version in index or recent updates, using new clock 1547259641324371968
[junit4] 2> 2572310 INFO (searcherExecutor-6315-thread-1-processing-n:127.0.0.1:45606_solr x:replacenodetest_coll_shard2_replica1 s:shard2 c:replacenodetest_coll r:core_node8) [n:127.0.0.1:45606_solr c:replacenodetest_coll s:shard2 r:core_node8 x:replacenodetest_coll_shard2_replica1] o.a.s.c.SolrCore [replacenodetest_coll_shard2_replica1] Registered new searcher Searcher@6b1f1aec[replacenodetest_coll_shard2_replica1] main{ExitableDirectoryReader(UninvertingDirectoryReader())}
[junit4] 2> 2572311 INFO (qtp1367335269-14359) [n:127.0.0.1:44685_solr c:replacenodetest_coll s:shard5 r:core_node4 x:replacenodetest_coll_shard5_replica1] o.a.s.u.UpdateHandler Using UpdateLog implementation: org.apache.solr.update.UpdateLog
[junit4] 2> 2572311 INFO (qtp1367335269-14359) [n:127.0.0.1:44685_solr c:replacenodetest_coll s:shard5 r:core_node4 x:replacenodetest_coll_shard5_replica1] o.a.s.u.UpdateLog Initializing UpdateLog: dataDir=null defaultSyncLevel=FLUSH numRecordsToKeep=100 maxNumLogsToKeep=10 numVersionBuckets=65536
[junit4] 2> 2572312 INFO (qtp1367335269-14359) [n:127.0.0.1:44685_solr c:replacenodetest_coll s:shard5 r:core_node4 x:replacenodetest_coll_shard5_replica1] o.a.s.u.CommitTracker Hard AutoCommit: disabled
[junit4] 2> 2572312 INFO (qtp1367335269-14359) [n:127.0.0.1:44685_solr c:replacenodetest_coll s:shard5 r:core_node4 x:replacenodetest_coll_shard5_replica1] o.a.s.u.CommitTracker Soft AutoCommit: disabled
[junit4] 2> 2572315 INFO (searcherExecutor-6313-thread-1-processing-n:127.0.0.1:33379_solr x:replacenodetest_coll_shard3_replica1 s:shard3 c:replacenodetest_coll r:core_node3) [n:127.0.0.1:33379_solr c:replacenodetest_coll s:shard3 r:core_node3 x:replacenodetest_coll_shard3_replica1] o.a.s.c.SolrCore [replacenodetest_coll_shard3_replica1] Registered new searcher Searcher@39059d8[replacenodetest_coll_shard3_replica1] main{ExitableDirectoryReader(UninvertingDirectoryReader())}
[junit4] 2> 2572317 INFO (qtp1344576036-14326) [n:127.0.0.1:45606_solr c:replacenodetest_coll s:shard2 r:core_node8 x:replacenodetest_coll_shard2_replica1] o.a.s.c.ShardLeaderElectionContext Waiting until we see more replicas up for shard shard2: total=2 found=1 timeoutin=9999ms
[junit4] 2> 2572323 INFO (qtp469615316-14372) [n:127.0.0.1:43310_solr c:replacenodetest_coll s:shard4 r:core_node2 x:replacenodetest_coll_shard4_replica1] o.a.s.c.ShardLeaderElectionContext Waiting until we see more replicas up for shard shard4: total=2 found=1 timeoutin=9997ms
[junit4] 2> 2572323 INFO (qtp1367335269-14359) [n:127.0.0.1:44685_solr c:replacenodetest_coll s:shard5 r:core_node4 x:replacenodetest_coll_shard5_replica1] o.a.s.s.SolrIndexSearcher Opening [Searcher@4abdcff2[replacenodetest_coll_shard5_replica1] main]
[junit4] 2> 2572323 INFO (qtp469615316-14369) [n:127.0.0.1:43310_solr c:replacenodetest_coll s:shard1 r:core_node1 x:replacenodetest_coll_shard1_replica2] o.a.s.c.ShardLeaderElectionContext Waiting until we see more replicas up for shard shard1: total=2 found=1 timeoutin=9997ms
[junit4] 2> 2572324 WARN (qtp2104945643-14348) [n:127.0.0.1:47481_solr c:replacenodetest_coll s:shard3 x:replacenodetest_coll_shard3_replica2] o.a.s.s.IndexSchema [replacenodetest_coll_shard3_replica2] default search field in schema is text. WARNING: Deprecated, please use 'df' on request instead.
[junit4] 2> 2572325 INFO (qtp2104945643-14348) [n:127.0.0.1:47481_solr c:replacenodetest_coll s:shard3 x:replacenodetest_coll_shard3_replica2] o.a.s.s.IndexSchema Loaded schema cloud-dynamic/1.6 with uniqueid field id
[junit4] 2> 2572334 INFO (qtp1367335269-14359) [n:127.0.0.1:44685_solr c:replacenodetest_coll s:shard5 r:core_node4 x:replacenodetest_coll_shard5_replica1] o.a.s.r.ManagedResourceStorage Configured ZooKeeperStorageIO with znodeBase: /configs/conf1
[junit4] 2> 2572334 WARN (qtp1367335269-14361) [n:127.0.0.1:44685_solr c:replacenodetest_coll s:shard2 x:replacenodetest_coll_shard2_replica2] o.a.s.s.IndexSchema [replacenodetest_coll_shard2_replica2] default search field in schema is text. WARNING: Deprecated, please use 'df' on request instead.
[junit4] 2> 2572336 INFO (qtp1367335269-14361) [n:127.0.0.1:44685_solr c:replacenodetest_coll s:shard2 x:replacenodetest_coll_shard2_replica2] o.a.s.s.IndexSchema Loaded schema cloud-dynamic/1.6 with uniqueid field id
[junit4] 2> 2572339 INFO (qtp1367335269-14359) [n:127.0.0.1:44685_solr c:replacenodetest_coll s:shard5 r:core_node4 x:replacenodetest_coll_shard5_replica1] o.a.s.r.ManagedResourceStorage Loaded null at path _rest_managed.json using ZooKeeperStorageIO:path=/configs/conf1
[junit4] 2> 2572339 INFO (qtp1367335269-14359) [n:127.0.0.1:44685_solr c:replacenodetest_coll s:shard5 r:core_node4 x:replacenodetest_coll_shard5_replica1] o.a.s.h.ReplicationHandler Commits will be reserved for 10000
[junit4] 2> 2572339 INFO (qtp1367335269-14359) [n:127.0.0.1:44685_solr c:replacenodetest_coll s:shard5 r:core_node4 x:replacenodetest_coll_shard5_replica1] o.a.s.u.UpdateLog Could not find max version in index or recent updates, using new clock 1547259641357926400
[junit4] 2> 2572341 INFO (searcherExecutor-6324-thread-1-processing-n:127.0.0.1:44685_solr x:replacenodetest_coll_shard5_replica1 s:shard5 c:replacenodetest_coll r:core_node4) [n:127.0.0.1:44685_solr c:replacenodetest_coll s:shard5 r:core_node4 x:replacenodetest_coll_shard5_replica1] o.a.s.c.SolrCore [replacenodetest_coll_shard5_replica1] Registered new searcher Searcher@4abdcff2[replacenodetest_coll_shard5_replica1] main{ExitableDirectoryReader(UninvertingDirectoryReader())}
[junit4] 2> 2572335 INFO (qtp2104945643-14348) [n:127.0.0.1:47481_solr c:replacenodetest_coll s:shard3 x:replacenodetest_coll_shard3_replica2] o.a.s.c.CoreContainer Creating SolrCore 'replacenodetest_coll_shard3_replica2' using configuration from collection replacenodetest_coll
[junit4] 2> 2572343 INFO (qtp2104945643-14348) [n:127.0.0.1:47481_solr c:replacenodetest_coll s:shard3 r:core_node6 x:replacenodetest_coll_shard3_replica2] o.a.s.c.SolrCore [[replacenodetest_coll_shard3_replica2] ] Opening new SolrCore at [/x1/jenkins/jenkins-slave/workspace/Lucene-Solr-Tests-master/solr/build/solr-core/test/J2/temp/solr.cloud.ReplaceNodeTest_AB71D7B2D5B39E16-001/tempDir-001/node2/replacenodetest_coll_shard3_replica2], dataDir=[/x1/jenkins/jenkins-slave/workspace/Lucene-Solr-Tests-master/solr/build/solr-core/test/J2/temp/solr.cloud.ReplaceNodeTest_AB71D7B2D5B39E16-001/tempDir-001/node2/./replacenodetest_coll_shard3_replica2/data/]
[junit4] 2> 2572345 INFO (qtp1367335269-14361) [n:127.0.0.1:44685_solr c:replacenodetest_coll s:shard2 x:replacenodetest_coll_shard2_replica2] o.a.s.c.CoreContainer Creating SolrCore 'replacenodetest_coll_shard2_replica2' using configuration from collection replacenodetest_coll
[junit4] 2> 2572346 INFO (qtp1367335269-14361) [n:127.0.0.1:44685_solr c:replacenodetest_coll s:shard2 r:core_node7 x:replacenodetest_coll_shard2_replica2] o.a.s.c.SolrCore [[replacenodetest_coll_shard2_replica2] ] Opening new SolrCore at [/x1/jenkins/jenkins-slave/workspace/Lucene-Solr-Tests-master/solr/build/solr-core/test/J2/temp/solr.cloud.ReplaceNodeTest_AB71D7B2D5B39E16-001/tempDir-001/node1/replacenodetest_coll_shard2_replica2], dataDir=[/x1/jenkins/jenkins-slave/workspace/Lucene-Solr-Tests-master/solr/build/solr-core/test/J2/temp/solr.cloud.ReplaceNodeTest_AB71D7B2D5B39E16-001/tempDir-001/node1/./replacenodetest_coll_shard2_replica2/data/]
[junit4] 2> 2572352 INFO (qtp1367335269-14359) [n:127.0.0.1:44685_solr c:replacenodetest_coll s:shard5 r:core_node4 x:replacenodetest_coll_shard5_replica1] o.a.s.c.ShardLeaderElectionContext Waiting until we see more replicas up for shard shard5: total=2 found=1 timeoutin=9999ms
[junit4] 2> 2572356 WARN (qtp1344576036-14324) [n:127.0.0.1:45606_solr c:replacenodetest_coll s:shard4 x:replacenodetest_coll_shard4_replica2] o.a.s.s.IndexSchema [replacenodetest_coll_shard4_replica2] default search field in schema is text. WARNING: Deprecated, please use 'df' on request instead.
[junit4] 2> 2572357 INFO (qtp1344576036-14324) [n:127.0.0.1:45606_solr c:replacenodetest_coll s:shard4 x:replacenodetest_coll_shard4_replica2] o.a.s.s.IndexSchema Loaded schema cloud-dynamic/1.6 with uniqueid field id
[junit4] 2> 2572360 INFO (zkCallback-2597-thread-1-processing-n:127.0.0.1:33379_solr) [n:127.0.0.1:33379_solr ] o.a.s.c.c.ZkStateReader A cluster state change: [WatchedEvent state:SyncConnected type:NodeDataChanged path:/collections/replacenodetest_coll/state.json] for collection [replacenodetest_coll] has occurred - updating... (live nodes size: [6])
[junit4] 2> 2572360 INFO (zkCallback-2583-thread-2-processing-n:127.0.0.1:47481_solr) [n:127.0.0.1:47481_solr ] o.a.s.c.c.ZkStateReader A cluster state change: [WatchedEvent state:SyncConnected type:NodeDataChanged path:/collections/replacenodetest_coll/state.json] for collection [replacenodetest_coll] has occurred - updating... (live nodes size: [6])
[junit4] 2> 2572360 INFO (zkCallback-2589-thread-2-processing-n:127.0.0.1:43310_solr) [n:127.0.0.1:43310_solr ] o.a.s.c.c.ZkStateReader A cluster state change: [WatchedEvent state:SyncConnected type:NodeDataChanged path:/collections/replacenodetest_coll/state.json] for collection [replacenodetest_coll] has occurred - updating... (live nodes size: [6])
[junit4] 2> 2572366 WARN (qtp2104945643-14350) [n:127.0.0.1:47481_solr c:replacenodetest_coll s:shard1 x:replacenodetest_coll_shard1_replica1] o.a.s.s.IndexSchema [replacenodetest_coll_shard1_replica1] default search field in schema is text. WARNING: Deprecated, please use 'df' on request instead.
[junit4] 2> 2572367 INFO (qtp513113570-14314) [n:127.0.0.1:33379_solr c:replacenodetest_coll s:shard3 r:core_node3 x:replacenodetest_coll_shard3_replica1] o.a.s.c.ShardLeaderElectionContext Waiting until we see more replicas up for shard shard3: total=2 found=1 timeoutin=9999ms
[junit4] 2> 2572370 INFO (zkCallback-2598-thread-1-processing-n:127.0.0.1:44685_solr) [n:127.0.0.1:44685_solr ] o.a.s.c.c.ZkStateReader A cluster state change: [WatchedEvent state:SyncConnected type:NodeDataChanged path:/collections/replacenodetest_coll/state.json] for collection [replacenodetest_coll] has occurred - updating... (live nodes size: [6])
[junit4] 2> 2572371 INFO (qtp2104945643-14348) [n:127.0.0.1:47481_solr c:replacenodetest_coll s:shard3 r:core_node6 x:replacenodetest_coll_shard3_replica2] o.a.s.u.UpdateHandler Using UpdateLog implementation: org.apache.solr.update.UpdateLog
[junit4] 2> 2572371 INFO (qtp2104945643-14348) [n:127.0.0.1:47481_solr c:replacenodetest_coll s:shard3 r:core_node6 x:replacenodetest_coll_shard3_replica2] o.a.s.u.UpdateLog Initializing UpdateLog: dataDir=null defaultSyncLevel=FLUSH numRecordsToKeep=100 maxNumLogsToKeep=10 numVersionBuckets=65536
[junit4] 2> 2572372 INFO (zkCallback-2586-thread-1-processing-n:127.0.0.1:45606_solr) [n:127.0.0.1:45606_solr ] o.a.s.c.c.ZkStateReader A cluster state change: [WatchedEvent state:SyncConnected type:NodeDataChanged path:/collections/replacenodetest_coll/state.json] for collection [replacenodetest_coll] has occurred - updating... (live nodes size: [6])
[junit4] 2> 2572372 INFO (qtp2104945643-14348) [n:127.0.0.1:47481_solr c:replacenodetest_coll s:shard3 r:core_node6 x:replacenodetest_coll_shard3_replica2] o.a.s.u.CommitTracker Hard AutoCommit: disabled
[junit4] 2> 2572373 INFO (qtp2104945643-14348) [n:127.0.0.1:47481_solr c:replacenodetest_coll s:shard3 r:core_node6 x:replacenodetest_coll_shard3_replica2] o.a.s.u.CommitTracker Soft AutoCommit: disabled
[junit4] 2> 2572374 INFO (qtp1344576036-14324) [n:127.0.0.1:45606_solr c:replacenodetest_coll s:shard4 x:replacenodetest_coll_shard4_replica2] o.a.s.c.CoreContainer Creating SolrCore 'replacenodetest_coll_shard4_replica2' using configuration from collection replacenodetest_coll
[junit4] 2> 2572374 INFO (qtp1344576036-14324) [n:127.0.0.1:45606_solr c:replacenodetest_coll s:shard4 r:core_node5 x:replacenodetest_coll_shard4_replica2] o.a.s.c.SolrCore [[replacenodetest_coll_shard4_replica2] ] Opening new SolrCore at [/x1/jenkins/jenkins-slave/workspace/Lucene-Solr-Tests-master/solr/build/solr-core/test/J2/temp/solr.cloud.ReplaceNodeTest_AB71D7B2D5B39E16-001/tempDir-001/node6/replacenodetest_coll_shard4_replica2], dataDir=[/x1/jenkins/jenkins-slave/workspace/Lucene-Solr-Tests-master/solr/build/solr-core/test/J2/temp/solr.cloud.ReplaceNodeTest_AB71D7B2D5B39E16-001/tempDir-001/node6/./replacenodetest_coll_shard4_replica2/data/]
[junit4] 2> 2572379 INFO (qtp2104945643-14350) [n:127.0.0.1:47481_solr c:replacenodetest_coll s:shard1 x:replacenodetest_coll_shard1_replica1] o.a.s.s.IndexSchema Loaded schema cloud-dynamic/1.6 with uniqueid field id
[junit4] 2> 2572387 INFO (qtp1367335269-14361) [n:127.0.0.1:44685_solr c:replacenodetest_coll s:shard2 r:core_node7 x:replacenodetest_coll_shard2_replica2] o.a.s.u.UpdateHandler Using UpdateLog implementation: org.apache.solr.update.UpdateLog
[junit4] 2> 2572387 INFO (qtp1367335269-14361) [n:127.0.0.1:44685_solr c:replacenodetest_coll s:shard2 r:core_node7 x:replacenodetest_coll_shard2_replica2] o.a.s.u.UpdateLog Initializing UpdateLog: dataDir=null defaultSyncLevel=FLUSH numRecordsToKeep=100 maxNumLogsToKeep=10 numVersionBuckets=65536
[junit4] 2> 2572387 INFO (qtp2104945643-14348) [n:127.0.0.1:47481_solr c:replacenodetest_coll s:shard3 r:core_node6 x:replacenodetest_coll_shard3_replica2] o.a.s.s.SolrIndexSearcher Opening [Searcher@167394f9[replacenodetest_coll_shard3_replica2] main]
[junit4] 2> 2572395 WARN (qtp513113570-14317) [n:127.0.0.1:33379_solr c:replacenodetest_coll s:shard5 x:replacenodetest_coll_shard5_replica2] o.a.s.s.IndexSchema [replacenodetest_coll_shard5_replica2] default search field in schema is text. WARNING: Deprecated, please use 'df' on request instead.
[junit4] 2> 2572396 INFO (qtp513113570-14317) [n:127.0.0.1:33379_solr c:replacenodetest_coll s:shard5 x:replacenodetest_coll_shard5_replica2] o.a.s.s.IndexSchema Loaded schema cloud-dynamic/1.6 with uniqueid field id
[junit4] 2> 2572399 INFO (qtp1367335269-14361) [n:127.0.0.1:44685_solr c:replacenodetest_coll s:shard2 r:core_node7 x:replacenodetest_coll_shard2_replica2] o.a.s.u.CommitTracker Hard AutoCommit: disabled
[junit4] 2> 2572399 INFO (qtp1367335269-14361) [n:127.0.0.1:44685_solr c:replacenodetest_coll s:shard2 r:core_node7 x:replacenodetest_coll_shard2_replica2] o.a.s.u.CommitTracker Soft AutoCommit: disabled
[junit4] 2> 2572403 INFO (qtp1367335269-14361) [n:127.0.0.1:44685_solr c:replacenodetest_coll s:shard2 r:core_node7 x:replacenodetest_coll_shard2_replica2] o.a.s.s.SolrIndexSearcher Opening [Searcher@64e4f249[replacenodetest_coll_shard2_replica2] main]
[junit4] 2> 2572407 INFO (qtp2104945643-14350) [n:127.0.0.1:47481_solr c:replacenodetest_coll s:shard1 x:replacenodetest_coll_shard1_replica1] o.a.s.c.CoreContainer Creating SolrCore 'replacenodetest_coll_shard1_replica1' using configuration from collection replacenodetest_coll
[junit4] 2> 2572408 INFO (qtp2104945643-14350) [n:127.0.0.1:47481_solr c:replacenodetest_coll s:shard1 r:core_node9 x:replacenodetest_coll_shard1_replica1] o.a.s.c.SolrCore [[replacenodetest_coll_shard1_replica1] ] Opening new SolrCore at [/x1/jenkins/jenkins-slave/workspace/Lucene-Solr-Tests-master/solr/build/solr-core/test/J2/temp/solr.cloud.ReplaceNodeTest_AB71D7B2D5B39E16-001/tempDir-001/node2/replacenodetest_coll_shard1_replica1], dataDir=[/x1/jenkins/jenkins-slave/workspace/Lucene-Solr-Tests-master/solr/build/solr-core/test/J2/temp/solr.cloud.ReplaceNodeTest_AB71D7B2D5B39E16-001/tempDir-001/node2/./replacenodetest_coll_shard1_replica1/data/]
[junit4] 2> 2572409 INFO (qtp513113570-14317) [n:127.0.0.1:33379_solr c:replacenodetest_coll s:shard5 x:replacenodetest_coll_shard5_replica2] o.a.s.c.CoreContainer Creating SolrCore 'replacenodetest_coll_shard5_replica2' using configuration from collection replacenodetest_coll
[junit4] 2> 2572410 INFO (qtp1367335269-14361) [n:127.0.0.1:44685_solr c:replacenodetest_coll s:shard2 r:core_node7 x:replacenodetest_coll_shard2_replica2] o.a.s.r.ManagedResourceStorage Configured ZooKeeperStorageIO with znodeBase: /configs/conf1
[junit4] 2> 2572411 INFO (qtp1367335269-14361) [n:127.0.0.1:44685_solr c:replacenodetest_coll s:shard2 r:core_node7 x:replacenodetest_coll_shard2_replica2] o.a.s.r.ManagedResourceStorage Loaded null at path _rest_managed.json using ZooKeeperStorageIO:path=/configs/conf1
[junit4] 2> 2572411 INFO (qtp1367335269-14361) [n:127.0.0.1:44685_solr c:replacenodetest_coll s:shard2 r:core_node7 x:replacenodetest_coll_shard2_replica2] o.a.s.h.ReplicationHandler Commits will be reserved for 10000
[junit4] 2> 2572411 INFO (qtp1367335269-14361) [n:127.0.0.1:44685_solr c:replacenodetest_coll s:shard2 r:core_node7 x:replacenodetest_coll_shard2_replica2] o.a.s.u.UpdateLog Could not find max version in index or recent updates, using new clock 1547259641433423872
[junit4] 2> 2572413 INFO (searcherExecutor-6334-thread-1-processing-n:127.0.0.1:44685_solr x:replacenodetest_coll_shard2_replica2 s:shard2 c:replacenodetest_coll r:core_node7) [n:127.0.0.1:44685_solr c:replacenodetest_coll s:shard2 r:core_node7 x:replacenodetest_coll_shard2_replica2] o.a.s.c.SolrCore [replacenodetest_coll_shard2_replica2] Registered new searcher Searcher@64e4f249[replacenodetest_coll_shard2_replica2] main{ExitableDirectoryReader(UninvertingDirectoryReader())}
[junit4] 2> 2572413 INFO (qtp2104945643-14348) [n:127.0.0.1:47481_solr c:replacenodetest_coll s:shard3 r:core_node6 x:replacenodetest_coll_shard3_replica2] o.a.s.r.ManagedResourceStorage Configured ZooKeeperStorageIO with znodeBase: /configs/conf1
[junit4] 2> 2572413 INFO (qtp513113570-14317) [n:127.0.0.1:33379_solr c:replacenodetest_coll s:shard5 r:core_node10 x:replacenodetest_coll_shard5_replica2] o.a.s.c.SolrCore [[replacenodetest_coll_shard5_replica2] ] Opening new SolrCore at [/x1/jenkins/jenkins-slave/workspace/Lucene-Solr-Tests-master/solr/build/solr-core/test/J2/temp/solr.cloud.ReplaceNodeTest_AB71D7B2D5B39E16-001/tempDir-001/node4/replacenodetest_coll_shard5_replica2], dataDir=[/x1/jenkins/jenkins-slave/workspace/Lucene-Solr-Tests-master/solr/build/solr-core/test/J2/temp/solr.cloud.ReplaceNodeTest_AB71D7B2D5B39E16-001/tempDir-001/node4/./replacenodetest_coll_shard5_replica2/data/]
[junit4] 2> 2572414 INFO (qtp2104945643-14348) [n:127.0.0.1:47481_solr c:replacenodetest_coll s:shard3 r:core_node6 x:replacenodetest_coll_shard3_replica2] o.a.s.r.ManagedResourceStorage Loaded null at path _rest_managed.json using ZooKeeperStorageIO:path=/configs/conf1
[junit4] 2> 2572415 INFO (qtp2104945643-14348) [n:127.0.0.1:47481_solr c:replacenodetest_coll s:shard3 r:core_node6 x:replacenodetest_coll_shard3_replica2] o.a.s.h.ReplicationHandler Commits will be reserved for 10000
[junit4] 2> 2572415 INFO (qtp2104945643-14348) [n:127.0.0.1:47481_solr c:replacenodetest_coll s:shard3 r:core_node6 x:replacenodetest_coll_shard3_replica2] o.a.s.u.UpdateLog Could not find max version in index or recent updates, using new clock 1547259641437618176
[junit4] 2> 2572417 INFO (searcherExecutor-6333-thread-1-processing-n:127.0.0.1:47481_solr x:replacenodetest_coll_shard3_replica2 s:shard3 c:replacenodetest_coll r:core_node6) [n:127.0.0.1:47481_solr c:replacenodetest_coll s:shard3 r:core_node6 x:replacenodetest_coll_shard3_replica2] o.a.s.c.SolrCore [replacenodetest_coll_shard3_replica2] Registered new searcher Searcher@167394f9[replacenodetest_coll_shard3_replica2] main{ExitableDirectoryReader(UninvertingDirectoryReader())}
[junit4] 2> 2572439 INFO (qtp1344576036-14324) [n:127.0.0.1:45606_solr c:replacenodetest_coll s:shard4 r:core_node5 x:replacenodetest_coll_shard4_replica2] o.a.s.u.UpdateHandler Using UpdateLog implementation: org.apache.solr.update.UpdateLog
[junit4] 2> 2572439 INFO (qtp1344576036-14324) [n:127.0.0.1:45606_solr c:replacenodetest_coll s:shard4 r:core_node5 x:replacenodetest_coll_shard4_replica2] o.a.s.u.UpdateLog Initializing UpdateLog: dataDir=null defaultSyncLevel=FLUSH numRecordsToKeep=100 maxNumLogsToKeep=10 numVersionBuckets=65536
[junit4] 2> 2572440 INFO (qtp1344576036-14324) [n:127.0.0.1:45606_solr c:replacenodetest_coll s:shard4 r:core_node5 x:replacenodetest_coll_shard4_replica2] o.a.s.u.CommitTracker Hard AutoCommit: disabled
[junit4] 2> 2572440 INFO (qtp1344576036-14324) [n:127.0.0.1:45606_solr c:replacenodetest_coll s:shard4 r:core_node5 x:replacenodetest_coll_shard4_replica2] o.a.s.u.CommitTracker Soft AutoCommit: disabled
[junit4] 2> 2572447 INFO (qtp1344576036-14324) [n:127.0.0.1:45606_solr c:replacenodetest_coll s:shard4 r:core_node5 x:replacenodetest_coll_shard4_replica2] o.a.s.s.SolrIndexSearcher Opening [Searcher@4c1909f3[replacenodetest_coll_shard4_replica2] main]
[junit4] 2> 2572448 INFO (qtp1344576036-14324) [n:127.0.0.1:45606_solr c:replacenodetest_coll s:shard4 r:core_node5 x:replacenodetest_coll_shard4_replica2] o.a.s.r.ManagedResourceStorage Configured ZooKeeperStorageIO with znodeBase: /configs/conf1
[junit4] 2> 2572448 INFO (qtp1344576036-14324) [n:127.0.0.1:45606_solr c:replacenodetest_coll s:shard4 r:core_node5 x:replacenodetest_coll_shard4_replica2] o.a.s.r.ManagedResourceStorage Loaded null at path _rest_managed.json using ZooKeeperStorageIO:path=/configs/conf1
[junit4] 2> 2572448 INFO (qtp1344576036-14324) [n:127.0.0.1:45606_solr c:replacenodetest_coll s:shard4 r:core_node5 x:replacenodetest_coll_shard4_replica2] o.a.s.h.ReplicationHandler Commits will be reserved for 10000
[junit4] 2> 2572448 INFO (qtp1344576036-14324) [n:127.0.0.1:45606_solr c:replacenodetest_coll s:shard4 r:core_node5 x:replacenodetest_coll_shard4_replica2] o.a.s.u.UpdateLog Could not find max version in index or recent updates, using new clock 1547259641472221184
[junit4] 2> 2572450 INFO (searcherExecutor-6339-thread-1-processing-n:127.0.0.1:45606_solr x:replacenodetest_coll_shard4_replica2 s:shard4 c:replacenodetest_coll r:core_node5) [n:127.0.0.1:45606_solr c:replacenodetest_coll s:shard4 r:core_node5 x:replacenodetest_coll_shard4_replica2] o.a.s.c.SolrCore [replacenodetest_coll_shard4_replica2] Registered new searcher Searcher@4c1909f3[replacenodetest_coll_shard4_replica2] main{ExitableDirectoryReader(UninvertingDirectoryReader())}
[junit4] 2> 2572455 INFO (qtp513113570-14317) [n:127.0.0.1:33379_solr c:replacenodetest_coll s:shard5 r:core_node10 x:replacenodetest_coll_shard5_replica2] o.a.s.u.UpdateHandler Using UpdateLog implementation: org.apache.solr.update.UpdateLog
[junit4] 2> 2572455 INFO (qtp513113570-14317) [n:127.0.0.1:33379_solr c:replacenodetest_coll s:shard5 r:core_node10 x:replacenodetest_coll_shard5_replica2] o.a.s.u.UpdateLog Initializing UpdateLog: dataDir=null defaultSyncLevel=FLUSH numRecordsToKeep=100 maxNumLogsToKeep=10 numVersionBuckets=65536
[junit4] 2> 2572457 INFO (qtp2104945643-14350) [n:127.0.0.1:47481_solr c:replacenodetest_coll s:shard1 r:core_node9 x:replacenodetest_coll_shard1_replica1] o.a.s.u.UpdateHandler Using UpdateLog implementation: org.apache.solr.update.UpdateLog
[junit4] 2> 2572457 INFO (qtp2104945643-14350) [n:127.0.0.1:47481_solr c:replacenodetest_coll s:shard1 r:core_node9 x:replacenodetest_coll_shard1_replica1] o.a.s.u.UpdateLog Initializing UpdateLog: dataDir=null defaultSyncLevel=FLUSH numRecordsToKeep=100 maxNumLogsToKeep=10 numVersionBuckets=65536
[junit4] 2> 2572533 INFO (qtp2104945643-14350) [n:127.0.0.1:47481_solr c:replacenodetest_coll s:shard1 r:core_node9 x:replacenodetest_coll_shard1_replica1] o.a.s.u.CommitTracker Hard AutoCommit: disabled
[junit4] 2> 2572533 INFO (qtp2104945643-14350) [n:127.0.0.1:47481_solr c:replacenodetest_coll s:shard1 r:core_node9 x:replacenodetest_coll_shard1_replica1] o.a.s.u.CommitTracker Soft AutoCommit: disabled
[junit4] 2> 2572533 INFO (qtp513113570-14317) [n:127.0.0.1:33379_solr c:replacenodetest_coll s:shard5 r:core_node10 x:replacenodetest_coll_shard5_replica2] o.a.s.u.CommitTracker Hard AutoCommit: disabled
[junit4] 2> 2572533 INFO (qtp513113570-14317) [n:127.0.0.1:33379_solr c:replacenodetest_coll s:shard5 r:core_node10 x:replacenodetest_coll_shard5_replica2] o.a.s.u.CommitTracker Soft AutoCommit: disabled
[junit4] 2> 2572534 INFO (qtp2104945643-14350) [n:127.0.0.1:47481_solr c:replacenodetest_coll s:shard1 r:core_node9 x:replacenodetest_coll_shard1_replica1] o.a.s.s.SolrIndexSearcher Opening [Searcher@78bce506[replacenodetest_coll_shard1_replica1] main]
[junit4] 2> 2572534 INFO (qtp513113570-14317) [n:127.0.0.1:33379_solr c:replacenodetest_coll s:shard5 r:core_node10 x:replacenodetest_coll_shard5_replica2] o.a.s.s.SolrIndexSearcher Opening [Searcher@4aedba2a[replacenodetest_coll_shard5_replica2] main]
[junit4] 2> 2572536 INFO (qtp513113570-14317) [n:127.0.0.1:33379_solr c:replacenodetest_coll s:shard5 r:core_node10 x:replacenodetest_coll_shard5_replica2] o.a.s.r.ManagedResourceStorage Configured ZooKeeperStorageIO with znodeBase: /configs/conf1
[junit4] 2> 2572536 INFO (qtp513113570-14317) [n:127.0.0.1:33379_solr c:replacenodetest_coll s:shard5 r:core_node10 x:replacenodetest_coll_shard5_replica2] o.a.s.r.ManagedResourceStorage Loaded null at path _rest_managed.json using ZooKeeperStorageIO:path=/configs/conf1
[junit4] 2> 2572537 INFO (qtp513113570-14317) [n:127.0.0.1:33379_solr c:replacenodetest_coll s:shard5 r:core_node10 x:replacenodetest_coll_shard5_replica2] o.a.s.h.ReplicationHandler Commits will be reserved for 10000
[junit4] 2> 2572537 INFO (qtp513113570-14317) [n:127.0.0.1:33379_solr c:replacenodetest_coll s:shard5 r:core_node10 x:replacenodetest_coll_shard5_replica2] o.a.s.u.UpdateLog Could not find max version in index or recent updates, using new clock 1547259641565544448
[junit4] 2> 2572539 INFO (searcherExecutor-6345-thread-1-processing-n:127.0.0.1:33379_solr x:replacenodetest_coll_shard5_replica2 s:shard5 c:replacenodetest_coll r:core_node10) [n:127.0.0.1:33379_solr c:replacenodetest_coll s:shard5 r:core_node10 x:replacenodetest_coll_shard5_replica2] o.a.s.c.SolrCore [replacenodetest_coll_shard5_replica2] Registered new searcher Searcher@4aedba2a[replacenodetest_coll_shard5_replica2] main{ExitableDirectoryReader(UninvertingDirectoryReader())}
[junit4] 2> 2572558 INFO (qtp2104945643-14350) [n:127.0.0.1:47481_solr c:replacenodetest_coll s:shard1 r:core_node9 x:replacenodetest_coll_shard1_replica1] o.a.s.r.ManagedResourceStorage Configured ZooKeeperStorageIO with znodeBase: /configs/conf1
[junit4] 2> 2572562 INFO (qtp2104945643-14350) [n:127.0.0.1:47481_solr c:replacenodetest_coll s:shard1 r:core_node9 x:replacenodetest_coll_shard1_replica1] o.a.s.r.ManagedResourceStorage Loaded null at path _rest_managed.json using ZooKeeperStorageIO:path=/configs/conf1
[junit4] 2> 2572562 INFO (qtp2104945643-14350) [n:127.0.0.1:47481_solr c:replacenodetest_coll s:shard1 r:core_node9 x:replacenodetest_coll_shard1_replica1] o.a.s.h.ReplicationHandler Commits will be reserved for 10000
[junit4] 2> 2572563 INFO (qtp2104945643-14350) [n:127.0.0.1:47481_solr c:replacenodetest_coll s:shard1 r:core_node9 x:replacenodetest_coll_shard1_replica1] o.a.s.u.UpdateLog Could not find max version in index or recent updates, using new clock 1547259641592807424
[junit4] 2> 2572565 INFO (searcherExecutor-6344-thread-1-processing-n:127.0.0.1:47481_solr x:replacenodetest_coll_shard1_replica1 s:shard1 c:replacenodetest_coll r:core_node9) [n:127.0.0.1:47481_solr c:replacenodetest_coll s:shard1 r:core_node9 x:replacenodetest_coll_shard1_replica1] o.a.s.c.SolrCore [replacenodetest_coll_shard1_replica1] Registered new searcher Searcher@78bce506[replacenodetest_coll_shard1_replica1] main{ExitableDirectoryReader(UninvertingDirectoryReader())}
[junit4] 2> 2572654 INFO (zkCallback-2598-thread-1-processing-n:127.0.0.1:44685_solr) [n:127.0.0.1:44685_solr ] o.a.s.c.c.ZkStateReader A cluster state change: [WatchedEvent state:SyncConnected type:NodeDataChanged path:/collections/replacenodetest_coll/state.json] for collection [replacenodetest_coll] has occurred - updating... (live nodes size: [6])
[junit4] 2> 2572654 INFO (zkCallback-2586-thread-1-processing-n:127.0.0.1:45606_solr) [n:127.0.0.1:45606_solr ] o.a.s.c.c.ZkStateReader A cluster state change: [WatchedEvent state:SyncConnected type:NodeDataChanged path:/collections/replacenodetest_coll/state.json] for collection [replacenodetest_coll] has occurred - updating... (live nodes size: [6])
[junit4] 2> 2572654 INFO (zkCallback-2589-thread-2-processing-n:127.0.0.1:43310_solr) [n:127.0.0.1:43310_solr ] o.a.s.c.c.ZkStateReader A cluster state change: [WatchedEvent state:SyncConnected type:NodeDataChanged path:/collections/replacenodetest_coll/state.json] for collection [replacenodetest_coll] has occurred - updating... (live nodes size: [6])
[junit4] 2> 2572655 INFO (zkCallback-2597-thread-1-processing-n:127.0.0.1:33379_solr) [n:127.0.0.1:33379_solr ] o.a.s.c.c.ZkStateReader A cluster state change: [WatchedEvent state:SyncConnected type:NodeDataChanged path:/collections/replacenodetest_coll/state.json] for collection [replacenodetest_coll] has occurred - updating... (live nodes size: [6])
[junit4] 2> 2572656 INFO (zkCallback-2583-thread-2-processing-n:127.0.0.1:47481_solr) [n:127.0.0.1:47481_solr ] o.a.s.c.c.ZkStateReader A cluster state change: [WatchedEvent state:SyncConnected type:NodeDataChanged path:/collections/replacenodetest_coll/state.json] for collection [replacenodetest_coll] has occurred - updating... (live nodes size: [6])
[junit4] 2> 2572817 INFO (qtp1344576036-14326) [n:127.0.0.1:45606_solr c:replacenodetest_coll s:shard2 r:core_node8 x:replacenodetest_coll_shard2_replica1] o.a.s.c.ShardLeaderElectionContext Enough replicas found to continue.
[junit4] 2> 2572817 INFO (qtp1344576036-14326) [n:127.0.0.1:45606_solr c:replacenodetest_coll s:shard2 r:core_node8 x:replacenodetest_coll_shard2_replica1] o.a.s.c.ShardLeaderElectionContext I may be the new leader - try and sync
[junit4] 2> 2572817 INFO (qtp1344576036-14326) [n:127.0.0.1:45606_solr c:replacenodetest_coll s:shard2 r:core_node8 x:replacenodetest_coll_shard2_replica1] o.a.s.c.SyncStrategy Sync replicas to https://127.0.0.1:45606/solr/replacenodetest_coll_shard2_replica1/
[junit4] 2> 2572818 INFO (qtp1344576036-14326) [n:127.0.0.1:45606_solr c:replacenodetest_coll s:shard2 r:core_node8 x:replacenodetest_coll_shard2_replica1] o.a.s.u.PeerSync PeerSync: core=replacenodetest_coll_shard2_replica1 url=https://127.0.0.1:45606/solr START replicas=[https://127.0.0.1:44685/solr/replacenodetest_coll_shard2_replica2/] nUpdates=100
[junit4] 2> 2572823 INFO (qtp469615316-14369) [n:127.0.0.1:43310_solr c:replacenodetest_coll s:shard1 r:core_node1 x:replacenodetest_coll_shard1_replica2] o.a.s.c.ShardLeaderElectionContext Enough replicas found to continue.
[junit4] 2> 2572823 INFO (qtp469615316-14369) [n:127.0.0.1:43310_solr c:replacenodetest_coll s:shard1 r:core_node1 x:replacenodetest_coll_shard1_replica2] o.a.s.c.ShardLeaderElectionContext I may be the new leader - try and sync
[junit4] 2> 2572824 INFO (qtp469615316-14369) [n:127.0.0.1:43310_solr c:replacenodetest_coll s:shard1 r:core_node1 x:replacenodetest_coll_shard1_replica2] o.a.s.c.SyncStrategy Sync replicas to https://127.0.0.1:43310/solr/replacenodetest_coll_shard1_replica2/
[junit4] 2> 2572824 INFO (qtp469615316-14369) [n:127.0.0.1:43310_solr c:replacenodetest_coll s:shard1 r:core_node1 x:replacenodetest_coll_shard1_replica2] o.a.s.u.PeerSync PeerSync: core=replacenodetest_coll_shard1_replica2 url=https://127.0.0.1:43310/solr START replicas=[https://127.0.0.1:47481/solr/replacenodetest_coll_shard1_replica1/] nUpdates=100
[junit4] 2> 2572824 INFO (qtp469615316-14372) [n:127.0.0.1:43310_solr c:replacenodetest_coll s:shard4 r:core_node2 x:replacenodetest_coll_shard4_replica1] o.a.s.c.ShardLeaderElectionContext Enough replicas found to continue.
[junit4] 2> 2572824 INFO (qtp469615316-14372) [n:127.0.0.1:43310_solr c:replacenodetest_coll s:shard4 r:core_node2 x:replacenodetest_coll_shard4_replica1] o.a.s.c.ShardLeaderElectionContext I may be the new leader - try and sync
[junit4] 2> 2572824 INFO (qtp469615316-14372) [n:127.0.0.1:43310_solr c:replacenodetest_coll s:shard4 r:core_node2 x:replacenodetest_coll_shard4_replica1] o.a.s.c.SyncStrategy Sync replicas to https://127.0.0.1:43310/solr/replacenodetest_coll_shard4_replica1/
[junit4] 2> 2572824 INFO (qtp469615316-14372) [n:127.0.0.1:43310_solr c:replacenodetest_coll s:shard4 r:core_node2 x:replacenodetest_coll_shard4_replica1] o.a.s.u.PeerSync PeerSync: core=replacenodetest_coll_shard4_replica1 url=https://127.0.0.1:43310/solr START replicas=[https://127.0.0.1:45606/solr/replacenodetest_coll_shard4_replica2/] nUpdates=100
[junit4] 2> 2572834 INFO (qtp1344576036-14326) [n:127.0.0.1:45606_solr c:replacenodetest_coll s:shard2 r:core_node8 x:replacenodetest_coll_shard2_replica1] o.a.s.u.PeerSync PeerSync: core=replacenodetest_coll_shard2_replica1 url=https://127.0.0.1:45606/solr DONE. We have no versions. sync failed.
[junit4] 2> 2572840 INFO (qtp469615316-14372) [n:127.0.0.1:43310_solr c:replacenodetest_coll s:shard4 r:core_node2 x:replacenodetest_coll_shard4_replica1] o.a.s.u.PeerSync PeerSync: core=replacenodetest_coll_shard4_replica1 url=https://127.0.0.1:43310/solr DONE. We have no versions. sync failed.
[junit4] 2> 2572843 INFO (qtp469615316-14369) [n:127.0.0.1:43310_solr c:replacenodetest_coll s:shard1 r:core_node1 x:replacenodetest_coll_shard1_replica2] o.a.s.u.PeerSync PeerSync: core=replacenodetest_coll_shard1_replica2 url=https://127.0.0.1:43310/solr DONE. We have no versions. sync failed.
[junit4] 2> 2572860 INFO (qtp1367335269-14355) [n:127.0.0.1:44685_solr c:replacenodetest_coll s:shard2 r:core_node7 x:replacenodetest_coll_shard2_replica2] o.a.s.c.S.Request [replacenodetest_coll_shard2_replica2] webapp=/solr path=/get params={distrib=false&qt=/get&fingerprint=false&getVersions=100&wt=javabin&version=2} status=0 QTime=0
[junit4] 2> 2572860 INFO (qtp1344576036-14321) [n:127.0.0.1:45606_solr c:replacenodetest_coll s:shard4 r:core_node5 x:replacenodetest_coll_shard4_replica2] o.a.s.c.S.Request [replacenodetest_coll_shard4_replica2] webapp=/solr path=/get params={distrib=false&qt=/get&fingerprint=false&getVersions=100&wt=javabin&version=2} status=0 QTime=0
[junit4] 2> 2572861 INFO (qtp469615316-14372) [n:127.0.0.1:43310_solr c:replacenodetest_coll s:shard4 r:core_node2 x:replacenodetest_coll_shard4_replica1] o.a.s.c.SyncStrategy Leader's attempt to sync with shard failed, moving to the next candidate
[junit4] 2> 2572861 INFO (qtp469615316-14372) [n:127.0.0.1:43310_solr c:replacenodetest_coll s:shard4 r:core_node2 x:replacenodetest_coll_shard4_replica1] o.a.s.c.ShardLeaderElectionContext We failed sync, but we have no versions - we can't sync in that case - we were active before, so become leader anyway
[junit4] 2> 2572862 INFO (qtp1344576036-14326) [n:127.0.0.1:45606_solr c:replacenodetest_coll s:shard2 r:core_node8 x:replacenodetest_coll_shard2_replica1] o.a.s.c.SyncStrategy Leader's attempt to sync with shard failed, moving to the next candidate
[junit4] 2> 2572862 INFO (qtp1344576036-14326) [n:127.0.0.1:45606_solr c:replacenodetest_coll s:shard2 r:core_node8 x:replacenodetest_coll_shard2_replica1] o.a.s.c.ShardLeaderElectionContext We failed sync, but we have no versions - we can't sync in that case - we were active before, so become leader anyway
[junit4] 2> 2572866 INFO (qtp1367335269-14359) [n:127.0.0.1:44685_solr c:replacenodetest_coll s:shard5 r:core_node4 x:replacenodetest_coll_shard5_replica1] o.a.s.c.ShardLeaderElectionContext Enough replicas found to continue.
[junit4] 2> 2572866 INFO (qtp1367335269-14359) [n:127.0.0.1:44685_solr c:replacenodetest_coll s:shard5 r:core_node4 x:replacenodetest_coll_shard5_replica1] o.a.s.c.ShardLeaderElectionContext I may be the new leader - try and sync
[junit4] 2> 2572866 INFO (qtp1367335269-14359) [n:127.0.0.1:44685_solr c:replacenodetest_coll s:shard5 r:core_node4 x:replacenodetest_coll_shard5_replica1] o.a.s.c.SyncStrategy Sync replicas to https://127.0.0.1:44685/solr/replacenodetest_coll_shard5_replica1/
[junit4] 2> 2572866 INFO (qtp1367335269-14359) [n:127.0.0.1:44685_solr c:replacenodetest_coll s:shard5 r:core_node4 x:replacenodetest_coll_shard5_replica1] o.a.s.u.PeerSync PeerSync: core=replacenodetest_coll_shard5_replica1 url=https://127.0.0.1:44685/solr START replicas=[https://127.0.0.1:33379/solr/replacenodetest_coll_shard5_replica2/] nUpdates=100
[junit4] 2> 2572866 INFO (qtp469615316-14372) [n:127.0.0.1:43310_solr c:replacenodetest_coll s:shard4 r:core_node2 x:replacenodetest_coll_shard4_replica1] o.a.s.c.ShardLeaderElectionContext I am the new leader: https://127.0.0.1:43310/solr/replacenodetest_coll_shard4_replica1/ shard4
[junit4] 2> 2572870 INFO (qtp1367335269-14359) [n:127.0.0.1:44685_solr c:replacenodetest_coll s:shard5 r:core_node4 x:replacenodetest_coll_shard5_replica1] o.a.s.u.PeerSync PeerSync: core=replacenodetest_coll_shard5_replica1 url=https://127.0.0.1:44685/solr DONE. We have no versions. sync failed.
[junit4] 2> 2572890 INFO (qtp513113570-14314) [n:127.0.0.1:33379_solr c:replacenodetest_coll s:shard3 r:core_node3 x:replacenodetest_coll_shard3_replica1] o.a.s.c.ShardLeaderElectionContext Enough replicas found to continue.
[junit4] 2> 2572890 INFO (qtp513113570-14314) [n:127.0.0.1:33379_solr c:replacenodetest_coll s:shard3 r:core_node3 x:replacenodetest_coll_shard3_replica1] o.a.s.c.ShardLeaderElectionContext I may be the new leader - try and sync
[junit4] 2> 2572890 INFO (qtp513113570-14314) [n:127.0.0.1:33379_solr c:replacenodetest_coll s:shard3 r:core_node3 x:replacenodetest_coll_shard3_replica1] o.a.s.c.SyncStrategy Sync replicas to https://127.0.0.1:33379/solr/replacenodetest_coll_shard3_replica1/
[junit4] 2> 2572890 INFO (qtp513113570-14314) [n:127.0.0.1:33379_solr c:replacenodetest_coll s:shard3 r:core_node3 x:replacenodetest_coll_shard3_replica1] o.a.s.u.PeerSync PeerSync: core=replacenodetest_coll_shard3_replica1 url=https://127.0.0.1:33379/solr START replicas=[https://127.0.0.1:47481/solr/replacenodetest_coll_shard3_replica2/] nUpdates=100
[junit4] 2> 2572892 INFO (qtp513113570-14314) [n:127.0.0.1:33379_solr c:replacenodetest_coll s:shard3 r:core_node3 x:replacenodetest_coll_shard3_replica1] o.a.s.u.PeerSync PeerSync: core=replacenodetest_coll_shard3_replica1 url=https://127.0.0.1:33379/solr DONE. We have no versions. sync failed.
[junit4] 2> 2572910 INFO (qtp2104945643-14343) [n:127.0.0.1:47481_solr c:replacenodetest_coll s:shard1 r:core_node9 x:replacenodetest_coll_shard1_replica1] o.a.s.c.S.Request [replacenodetest_coll_shard1_replica1] webapp=/solr path=/get params={distrib=false&qt=/get&fingerprint=false&getVersions=100&wt=javabin&version=2} status=0 QTime=20
[junit4] 2> 2572911 INFO (qtp513113570-14315) [n:127.0.0.1:33379_solr c:replacenodetest_coll s:shard5 r:core_node10 x:replacenodetest_coll_shard5_replica2] o.a.s.c.S.Request [replacenodetest_coll_shard5_replica2] webapp=/solr path=/get params={distrib=false&qt=/get&fingerprint=false&getVersions=100&wt=javabin&version=2} status=0 QTime=0
[junit4] 2> 2572912 INFO (qtp2104945643-14346) [n:127.0.0.1:47481_solr c:replacenodetest_coll s:shard3 r:core_node6 x:replacenodetest_coll_shard3_replica2] o.a.s.c.S.Request [replacenodetest_coll_shard3_replica2] webapp=/solr path=/get params={distrib=false&qt=/get&fingerprint=false&getVersions=100&wt=javabin&version=2} status=0 QTime=1
[junit4] 2> 2572912 INFO (qtp513113570-14314) [n:127.0.0.1:33379_solr c:replacenodetest_coll s:shard3 r:core_node3 x:replacenodetest_coll_shard3_replica1] o.a.s.c.SyncStrategy Leader's attempt to sync with shard failed, moving to the next candidate
[junit4] 2> 2572912 INFO (qtp513113570-14314) [n:127.0.0.1:33379_solr c:replacenodetest_coll s:shard3 r:core_node3 x:replacenodetest_coll_shard3_replica1] o.a.s.c.ShardLeaderElectionContext We failed sync, but we have no versions - we can't sync in that case - we were active before, so become leader anyway
[junit4] 2> 2572914 INFO (qtp1367335269-14359) [n:127.0.0.1:44685_solr c:replacenodetest_coll s:shard5 r:core_node4 x:replacenodetest_coll_shard5_replica1] o.a.s.c.SyncStrategy Leader's attempt to sync with shard failed, moving to the next candidate
[junit4] 2> 2572914 INFO (qtp469615316-14369) [n:127.0.0.1:43310_solr c:replac
[...truncated too long message...]
er/solr/core/test-lib/apacheds-core-avl-2.0.0-M15.jar:/x1/jenkins/jenkins-slave/workspace/Lucene-Solr-Tests-master/solr/core/test-lib/apacheds-core-shared-2.0.0-M15.jar:/x1/jenkins/jenkins-slave/workspace/Lucene-Solr-Tests-master/solr/core/test-lib/apacheds-i18n-2.0.0-M15.jar:/x1/jenkins/jenkins-slave/workspace/Lucene-Solr-Tests-master/solr/core/test-lib/apacheds-interceptor-kerberos-2.0.0-M15.jar:/x1/jenkins/jenkins-slave/workspace/Lucene-Solr-Tests-master/solr/core/test-lib/apacheds-interceptors-admin-2.0.0-M15.jar:/x1/jenkins/jenkins-slave/workspace/Lucene-Solr-Tests-master/solr/core/test-lib/apacheds-interceptors-authn-2.0.0-M15.jar:/x1/jenkins/jenkins-slave/workspace/Lucene-Solr-Tests-master/solr/core/test-lib/apacheds-interceptors-authz-2.0.0-M15.jar:/x1/jenkins/jenkins-slave/workspace/Lucene-Solr-Tests-master/solr/core/test-lib/apacheds-interceptors-changelog-2.0.0-M15.jar:/x1/jenkins/jenkins-slave/workspace/Lucene-Solr-Tests-master/solr/core/test-lib/apacheds-interceptors-collective-2.0.0-M15.jar:/x1/jenkins/jenkins-slave/workspace/Lucene-Solr-Tests-master/solr/core/test-lib/apacheds-interceptors-event-2.0.0-M15.jar:/x1/jenkins/jenkins-slave/workspace/Lucene-Solr-Tests-master/solr/core/test-lib/apacheds-interceptors-exception-2.0.0-M15.jar:/x1/jenkins/jenkins-slave/workspace/Lucene-Solr-Tests-master/solr/core/test-lib/apacheds-interceptors-journal-2.0.0-M15.jar:/x1/jenkins/jenkins-slave/workspace/Lucene-Solr-Tests-master/solr/core/test-lib/apacheds-interceptors-normalization-2.0.0-M15.jar:/x1/jenkins/jenkins-slave/workspace/Lucene-Solr-Tests-master/solr/core/test-lib/apacheds-interceptors-operational-2.0.0-M15.jar:/x1/jenkins/jenkins-slave/workspace/Lucene-Solr-Tests-master/solr/core/test-lib/apacheds-interceptors-referral-2.0.0-M15.jar:/x1/jenkins/jenkins-slave/workspace/Lucene-Solr-Tests-master/solr/core/test-lib/apacheds-interceptors-schema-2.0.0-M15.jar:/x1/jenkins/jenkins-slave/workspace/Lucene-Solr-Tests-master/solr/core/test-lib/apacheds-interceptors-subtree-2.0.0-M15.jar:/x1/jenkins/jenkins-slave/workspace/Lucene-Solr-Tests-master/solr/core/test-lib/apacheds-interceptors-trigger-2.0.0-M15.jar:/x1/jenkins/jenkins-slave/workspace/Lucene-Solr-Tests-master/solr/core/test-lib/apacheds-jdbm-partition-2.0.0-M15.jar:/x1/jenkins/jenkins-slave/workspace/Lucene-Solr-Tests-master/solr/core/test-lib/apacheds-jdbm1-2.0.0-M2.jar:/x1/jenkins/jenkins-slave/workspace/Lucene-Solr-Tests-master/solr/core/test-lib/apacheds-kerberos-codec-2.0.0-M15.jar:/x1/jenkins/jenkins-slave/workspace/Lucene-Solr-Tests-master/solr/core/test-lib/apacheds-ldif-partition-2.0.0-M15.jar:/x1/jenkins/jenkins-slave/workspace/Lucene-Solr-Tests-master/solr/core/test-lib/apacheds-mavibot-partition-2.0.0-M15.jar:/x1/jenkins/jenkins-slave/workspace/Lucene-Solr-Tests-master/solr/core/test-lib/apacheds-protocol-kerberos-2.0.0-M15.jar:/x1/jenkins/jenkins-slave/workspace/Lucene-Solr-Tests-master/solr/core/test-lib/apacheds-protocol-ldap-2.0.0-M15.jar:/x1/jenkins/jenkins-slave/workspace/Lucene-Solr-Tests-master/solr/core/test-lib/apacheds-protocol-shared-2.0.0-M15.jar:/x1/jenkins/jenkins-slave/workspace/Lucene-Solr-Tests-master/solr/core/test-lib/apacheds-xdbm-partition-2.0.0-M15.jar:/x1/jenkins/jenkins-slave/workspace/Lucene-Solr-Tests-master/solr/core/test-lib/api-all-1.0.0-M20.jar:/x1/jenkins/jenkins-slave/workspace/Lucene-Solr-Tests-master/solr/core/test-lib/bcprov-jdk15-1.45.jar:/x1/jenkins/jenkins-slave/workspace/Lucene-Solr-Tests-master/solr/core/test-lib/cglib-nodep-2.2.jar:/x1/jenkins/jenkins-slave/workspace/Lucene-Solr-Tests-master/solr/core/test-lib/commons-collections-3.2.2.jar:/x1/jenkins/jenkins-slave/workspace/Lucene-Solr-Tests-master/solr/core/test-lib/commons-math3-3.4.1.jar:/x1/jenkins/jenkins-slave/workspace/Lucene-Solr-Tests-master/solr/core/test-lib/easymock-3.0.jar:/x1/jenkins/jenkins-slave/workspace/Lucene-Solr-Tests-master/solr/core/test-lib/ehcache-core-2.4.4.jar:/x1/jenkins/jenkins-slave/workspace/Lucene-Solr-Tests-master/solr/core/test-lib/hadoop-common-2.7.2-tests.jar:/x1/jenkins/jenkins-slave/workspace/Lucene-Solr-Tests-master/solr/core/test-lib/hadoop-hdfs-2.7.2-tests.jar:/x1/jenkins/jenkins-slave/workspace/Lucene-Solr-Tests-master/solr/core/test-lib/hadoop-minikdc-2.7.2.jar:/x1/jenkins/jenkins-slave/workspace/Lucene-Solr-Tests-master/solr/core/test-lib/htrace-core-3.2.0-incubating.jar:/x1/jenkins/jenkins-slave/workspace/Lucene-Solr-Tests-master/solr/core/test-lib/jackson-annotations-2.5.4.jar:/x1/jenkins/jenkins-slave/workspace/Lucene-Solr-Tests-master/solr/core/test-lib/jackson-databind-2.5.4.jar:/x1/jenkins/jenkins-slave/workspace/Lucene-Solr-Tests-master/solr/core/test-lib/jersey-core-1.9.jar:/x1/jenkins/jenkins-slave/workspace/Lucene-Solr-Tests-master/solr/core/test-lib/jersey-server-1.9.jar:/x1/jenkins/jenkins-slave/workspace/Lucene-Solr-Tests-master/solr/core/test-lib/jetty-6.1.26.jar:/x1/jenkins/jenkins-slave/workspace/Lucene-Solr-Tests-master/solr/core/test-lib/jetty-util-6.1.26.jar:/x1/jenkins/jenkins-slave/workspace/Lucene-Solr-Tests-master/solr/core/test-lib/mina-core-2.0.0-M5.jar:/x1/jenkins/jenkins-slave/workspace/Lucene-Solr-Tests-master/solr/core/test-lib/mockito-core-1.9.5.jar:/x1/jenkins/jenkins-slave/workspace/Lucene-Solr-Tests-master/solr/core/test-lib/netty-all-4.0.36.Final.jar:/x1/jenkins/jenkins-slave/workspace/Lucene-Solr-Tests-master/solr/core/test-lib/objenesis-1.2.jar:/x1/jenkins/jenkins-slave/workspace/Lucene-Solr-Tests-master/solr/core/test-lib/presto-parser-0.122.jar:/x1/jenkins/jenkins-slave/workspace/Lucene-Solr-Tests-master/solr/core/test-lib/slice-0.10.jar:/x1/jenkins/jenkins-slave/workspace/Lucene-Solr-Tests-master/lucene/build/analysis/icu/lucene-analyzers-icu-7.0.0-SNAPSHOT.jar:/x1/jenkins/jenkins-slave/workspace/Lucene-Solr-Tests-master/solr/build/contrib/solr-analysis-extras/classes/java:/x1/jenkins/jenkins-slave/workspace/Lucene-Solr-Tests-master/lucene/build/queryparser/classes/test:/x1/jenkins/jenkins-slave/workspace/Lucene-Solr-Tests-master/solr/contrib/analysis-extras/lib/icu4j-56.1.jar:/home/jenkins/tools/ant/apache-ant-1.8.4/lib/ant-launcher.jar:/x1/jenkins/.ant/lib/ivy-2.3.0.jar:/home/jenkins/tools/ant/apache-ant-1.8.4/lib/ant-junit.jar:/home/jenkins/tools/ant/apache-ant-1.8.4/lib/ant-apache-log4j.jar:/home/jenkins/tools/ant/apache-ant-1.8.4/lib/ant-junit4.jar:/home/jenkins/tools/ant/apache-ant-1.8.4/lib/ant-jai.jar:/home/jenkins/tools/ant/apache-ant-1.8.4/lib/ant-javamail.jar:/home/jenkins/tools/ant/apache-ant-1.8.4/lib/ant-apache-bsf.jar:/home/jenkins/tools/ant/apache-ant-1.8.4/lib/ant-commons-net.jar:/home/jenkins/tools/ant/apache-ant-1.8.4/lib/ant-antlr.jar:/home/jenkins/tools/ant/apache-ant-1.8.4/lib/ant-jsch.jar:/home/jenkins/tools/ant/apache-ant-1.8.4/lib/ant-apache-oro.jar:/home/jenkins/tools/ant/apache-ant-1.8.4/lib/ant-commons-logging.jar:/home/jenkins/tools/ant/apache-ant-1.8.4/lib/ant.jar:/home/jenkins/tools/ant/apache-ant-1.8.4/lib/ant-netrexx.jar:/home/jenkins/tools/ant/apache-ant-1.8.4/lib/ant-testutil.jar:/home/jenkins/tools/ant/apache-ant-1.8.4/lib/ant-jdepend.jar:/home/jenkins/tools/ant/apache-ant-1.8.4/lib/ant-apache-bcel.jar:/home/jenkins/tools/ant/apache-ant-1.8.4/lib/ant-apache-xalan2.jar:/home/jenkins/tools/ant/apache-ant-1.8.4/lib/ant-apache-resolver.jar:/home/jenkins/tools/ant/apache-ant-1.8.4/lib/ant-jmf.jar:/home/jenkins/tools/ant/apache-ant-1.8.4/lib/ant-apache-regexp.jar:/home/jenkins/tools/ant/apache-ant-1.8.4/lib/ant-swing.jar:/usr/local/asfpackages/java/jdk1.8.0_102/lib/tools.jar:/x1/jenkins/.ivy2/cache/com.carrotsearch.randomizedtesting/junit4-ant/jars/junit4-ant-2.3.4.jar com.carrotsearch.ant.tasks.junit4.slave.SlaveMainSafe -eventsfile /x1/jenkins/jenkins-slave/workspace/Lucene-Solr-Tests-master/solr/build/solr-core/test/temp/junit4-J0-20161004_110639_190.events @/x1/jenkins/jenkins-slave/workspace/Lucene-Solr-Tests-master/solr/build/solr-core/test/temp/junit4-J0-20161004_110639_190.suites -stdin
[junit4] ERROR: JVM J0 ended with an exception: Quit event not received from the forked process? This may indicate JVM crash or runner bugs.
[junit4] at com.carrotsearch.ant.tasks.junit4.JUnit4.executeSlave(JUnit4.java:1501)
[junit4] at com.carrotsearch.ant.tasks.junit4.JUnit4.access$000(JUnit4.java:121)
[junit4] at com.carrotsearch.ant.tasks.junit4.JUnit4$2.call(JUnit4.java:955)
[junit4] at com.carrotsearch.ant.tasks.junit4.JUnit4$2.call(JUnit4.java:952)
[junit4] at java.util.concurrent.FutureTask.run(FutureTask.java:266)
[junit4] at java.util.concurrent.ThreadPoolExecutor.runWorker(ThreadPoolExecutor.java:1142)
[junit4] at java.util.concurrent.ThreadPoolExecutor$Worker.run(ThreadPoolExecutor.java:617)
[junit4] at java.lang.Thread.run(Thread.java:745)
BUILD FAILED
/x1/jenkins/jenkins-slave/workspace/Lucene-Solr-Tests-master/build.xml:763: The following error occurred while executing this line:
/x1/jenkins/jenkins-slave/workspace/Lucene-Solr-Tests-master/build.xml:707: The following error occurred while executing this line:
/x1/jenkins/jenkins-slave/workspace/Lucene-Solr-Tests-master/build.xml:59: The following error occurred while executing this line:
/x1/jenkins/jenkins-slave/workspace/Lucene-Solr-Tests-master/solr/build.xml:252: The following error occurred while executing this line:
/x1/jenkins/jenkins-slave/workspace/Lucene-Solr-Tests-master/solr/common-build.xml:536: The following error occurred while executing this line:
/x1/jenkins/jenkins-slave/workspace/Lucene-Solr-Tests-master/lucene/common-build.xml:1443: The following error occurred while executing this line:
/x1/jenkins/jenkins-slave/workspace/Lucene-Solr-Tests-master/lucene/common-build.xml:984: At least one slave process threw an exception, first: Quit event not received from the forked process? This may indicate JVM crash or runner bugs.
Total time: 115 minutes 22 seconds
Build step 'Invoke Ant' marked build as failure
Archiving artifacts
Recording test results
Email was triggered for: Failure - Any
Sending email for trigger: Failure - Any
[JENKINS] Lucene-Solr-Tests-master - Build # 1405 - Still Failing
Posted by Apache Jenkins Server <je...@builds.apache.org>.
Build: https://builds.apache.org/job/Lucene-Solr-Tests-master/1405/
No tests ran.
Build Log:
[...truncated 196 lines...]
[javac] Compiling 441 source files to /x1/jenkins/jenkins-slave/workspace/Lucene-Solr-Tests-master/lucene/build/core/classes/test
[javac] /x1/jenkins/jenkins-slave/workspace/Lucene-Solr-Tests-master/lucene/core/src/test/org/apache/lucene/codecs/lucene54/TestLucene54DocValuesFormat.java:474: warning: [cast] redundant cast to int
[javac] final int target = TestUtil.nextInt(random(), 0, (int) maxDoc);
[javac] ^
[javac] /x1/jenkins/jenkins-slave/workspace/Lucene-Solr-Tests-master/lucene/core/src/test/org/apache/lucene/codecs/lucene70/TestLucene70DocValuesFormat.java:475: warning: [cast] redundant cast to int
[javac] final int target = TestUtil.nextInt(random(), 0, (int) maxDoc);
[javac] ^
[javac] /x1/jenkins/jenkins-slave/workspace/Lucene-Solr-Tests-master/lucene/core/src/test/org/apache/lucene/codecs/perfield/TestPerFieldDocValuesFormat.java:205: error: <anonymous org.apache.lucene.codecs.perfield.TestPerFieldDocValuesFormat$MergeRecordingDocValueFormatWrapper$1> is not abstract and does not override abstract method addSortedSetField(FieldInfo,DocValuesProducer) in DocValuesConsumer
[javac] return new DocValuesConsumer() {
[javac] ^
[javac] /x1/jenkins/jenkins-slave/workspace/Lucene-Solr-Tests-master/lucene/core/src/test/org/apache/lucene/codecs/perfield/TestPerFieldDocValuesFormat.java:206: error: method does not override or implement a method from a supertype
[javac] @Override
[javac] ^
[javac] /x1/jenkins/jenkins-slave/workspace/Lucene-Solr-Tests-master/lucene/core/src/test/org/apache/lucene/codecs/perfield/TestPerFieldDocValuesFormat.java:208: error: incompatible types: Iterable<Number> cannot be converted to DocValuesProducer
[javac] consumer.addNumericField(field, values);
[javac] ^
[javac] /x1/jenkins/jenkins-slave/workspace/Lucene-Solr-Tests-master/lucene/core/src/test/org/apache/lucene/codecs/perfield/TestPerFieldDocValuesFormat.java:211: error: method does not override or implement a method from a supertype
[javac] @Override
[javac] ^
[javac] /x1/jenkins/jenkins-slave/workspace/Lucene-Solr-Tests-master/lucene/core/src/test/org/apache/lucene/codecs/perfield/TestPerFieldDocValuesFormat.java:213: error: incompatible types: Iterable<BytesRef> cannot be converted to DocValuesProducer
[javac] consumer.addBinaryField(field, values);
[javac] ^
[javac] /x1/jenkins/jenkins-slave/workspace/Lucene-Solr-Tests-master/lucene/core/src/test/org/apache/lucene/codecs/perfield/TestPerFieldDocValuesFormat.java:216: error: method does not override or implement a method from a supertype
[javac] @Override
[javac] ^
[javac] /x1/jenkins/jenkins-slave/workspace/Lucene-Solr-Tests-master/lucene/core/src/test/org/apache/lucene/codecs/perfield/TestPerFieldDocValuesFormat.java:218: error: method addSortedField in class DocValuesConsumer cannot be applied to given types;
[javac] consumer.addSortedField(field, values, docToOrd);
[javac] ^
[javac] required: FieldInfo,DocValuesProducer
[javac] found: FieldInfo,Iterable<BytesRef>,Iterable<Number>
[javac] reason: actual and formal argument lists differ in length
[javac] /x1/jenkins/jenkins-slave/workspace/Lucene-Solr-Tests-master/lucene/core/src/test/org/apache/lucene/codecs/perfield/TestPerFieldDocValuesFormat.java:221: error: method does not override or implement a method from a supertype
[javac] @Override
[javac] ^
[javac] /x1/jenkins/jenkins-slave/workspace/Lucene-Solr-Tests-master/lucene/core/src/test/org/apache/lucene/codecs/perfield/TestPerFieldDocValuesFormat.java:223: error: method addSortedNumericField in class DocValuesConsumer cannot be applied to given types;
[javac] consumer.addSortedNumericField(field, docToValueCount, values);
[javac] ^
[javac] required: FieldInfo,DocValuesProducer
[javac] found: FieldInfo,Iterable<Number>,Iterable<Number>
[javac] reason: actual and formal argument lists differ in length
[javac] /x1/jenkins/jenkins-slave/workspace/Lucene-Solr-Tests-master/lucene/core/src/test/org/apache/lucene/codecs/perfield/TestPerFieldDocValuesFormat.java:226: error: method does not override or implement a method from a supertype
[javac] @Override
[javac] ^
[javac] /x1/jenkins/jenkins-slave/workspace/Lucene-Solr-Tests-master/lucene/core/src/test/org/apache/lucene/codecs/perfield/TestPerFieldDocValuesFormat.java:228: error: method addSortedSetField in class DocValuesConsumer cannot be applied to given types;
[javac] consumer.addSortedSetField(field, values, docToOrdCount, ords);
[javac] ^
[javac] required: FieldInfo,DocValuesProducer
[javac] found: FieldInfo,Iterable<BytesRef>,Iterable<Number>,Iterable<Number>
[javac] reason: actual and formal argument lists differ in length
[javac] Note: Some input files use or override a deprecated API.
[javac] Note: Recompile with -Xlint:deprecation for details.
[javac] Note: Some messages have been simplified; recompile with -Xdiags:verbose to get full output
[javac] 11 errors
[...truncated 1 lines...]
BUILD FAILED
/x1/jenkins/jenkins-slave/workspace/Lucene-Solr-Tests-master/build.xml:763: The following error occurred while executing this line:
/x1/jenkins/jenkins-slave/workspace/Lucene-Solr-Tests-master/build.xml:707: The following error occurred while executing this line:
/x1/jenkins/jenkins-slave/workspace/Lucene-Solr-Tests-master/build.xml:59: The following error occurred while executing this line:
/x1/jenkins/jenkins-slave/workspace/Lucene-Solr-Tests-master/lucene/build.xml:50: The following error occurred while executing this line:
/x1/jenkins/jenkins-slave/workspace/Lucene-Solr-Tests-master/lucene/common-build.xml:795: The following error occurred while executing this line:
/x1/jenkins/jenkins-slave/workspace/Lucene-Solr-Tests-master/lucene/common-build.xml:807: The following error occurred while executing this line:
/x1/jenkins/jenkins-slave/workspace/Lucene-Solr-Tests-master/lucene/common-build.xml:1955: Compile failed; see the compiler error output for details.
Total time: 47 seconds
Build step 'Invoke Ant' marked build as failure
Archiving artifacts
Recording test results
ERROR: Step ‘Publish JUnit test result report’ failed: No test report files were found. Configuration error?
Email was triggered for: Failure - Any
Sending email for trigger: Failure - Any