You are viewing a plain text version of this content. The canonical link for it is here.
Posted to builds@beam.apache.org by Apache Jenkins Server <je...@builds.apache.org> on 2020/12/04 12:26:31 UTC

Build failed in Jenkins: beam_PerformanceTests_XmlIOIT_HDFS #3886

See <https://ci-beam.apache.org/job/beam_PerformanceTests_XmlIOIT_HDFS/3886/display/redirect>

Changes:


------------------------------------------
[...truncated 185.35 KB...]
> Task :model:fn-execution:extractIncludeProto
Watching 271 directories to track changes
Caching disabled for task ':model:fn-execution:extractIncludeProto' because:
  Caching has not been enabled for the task
Task ':model:fn-execution:extractIncludeProto' is not up-to-date because:
  No history is available.
Watching 271 directories to track changes
Watching 284 directories to track changes
:model:fn-execution:extractIncludeProto (Thread[Execution **** for ':' Thread 8,5,main]) completed. Took 2.424 secs.
:model:fn-execution:generateProto (Thread[Execution **** for ':' Thread 6,5,main]) started.

> Task :model:job-management:extractIncludeProto
Watching 270 directories to track changes
Caching disabled for task ':model:job-management:extractIncludeProto' because:
  Caching has not been enabled for the task
Task ':model:job-management:extractIncludeProto' is not up-to-date because:
  No history is available.
Watching 270 directories to track changes

> Task :model:fn-execution:generateProto FROM-CACHE
Watching 285 directories to track changes
Watching 286 directories to track changes
Build cache key for task ':model:fn-execution:generateProto' is f6965b372b316aecedc197fbe18ad68f
Task ':model:fn-execution:generateProto' is not up-to-date because:
  No history is available.
Watching 285 directories to track changes
Watching 301 directories to track changes
Loaded cache entry for task ':model:fn-execution:generateProto' with cache key f6965b372b316aecedc197fbe18ad68f
:model:fn-execution:generateProto (Thread[Execution **** for ':' Thread 6,5,main]) completed. Took 0.134 secs.
:model:fn-execution:compileJava (Thread[Execution **** for ':' Thread 8,5,main]) started.

> Task :model:job-management:extractIncludeProto
Watching 317 directories to track changes
:model:job-management:extractIncludeProto (Thread[Execution **** for ':' Thread 7,5,main]) completed. Took 2.935 secs.
:model:job-management:generateProto (Thread[Execution **** for ':' Thread 6,5,main]) started.

> Task :model:job-management:generateProto FROM-CACHE
Watching 318 directories to track changes
Build cache key for task ':model:job-management:generateProto' is d3bc937ad7c258a0ca65e7383e83e979
Task ':model:job-management:generateProto' is not up-to-date because:
  No history is available.
Watching 317 directories to track changes
Watching 337 directories to track changes
Loaded cache entry for task ':model:job-management:generateProto' with cache key d3bc937ad7c258a0ca65e7383e83e979
:model:job-management:generateProto (Thread[Execution **** for ':' Thread 6,5,main]) completed. Took 0.103 secs.
:model:job-management:compileJava (Thread[Execution **** for ':' Thread 5,5,main]) started.

> Task :model:fn-execution:compileJava FROM-CACHE
file or directory '<https://ci-beam.apache.org/job/beam_PerformanceTests_XmlIOIT_HDFS/ws/src/model/fn-execution/src/main/java',> not found
Watching 302 directories to track changes
Watching 303 directories to track changes
Watching 303 directories to track changes
Watching 341 directories to track changes
Custom actions are attached to task ':model:fn-execution:compileJava'.
Build cache key for task ':model:fn-execution:compileJava' is 3c3ddd911a0316dd7ef8646ee539ffd5
Task ':model:fn-execution:compileJava' is not up-to-date because:
  No history is available.
Watching 341 directories to track changes
Watching 341 directories to track changes
Watching 340 directories to track changes
Watching 349 directories to track changes
Watching 351 directories to track changes
Watching 353 directories to track changes
Loaded cache entry for task ':model:fn-execution:compileJava' with cache key 3c3ddd911a0316dd7ef8646ee539ffd5
:model:fn-execution:compileJava (Thread[Execution **** for ':' Thread 8,5,main]) completed. Took 1.409 secs.
:model:fn-execution:classes (Thread[Execution **** for ':' Thread 6,5,main]) started.

> Task :model:fn-execution:classes
Skipping task ':model:fn-execution:classes' as it has no actions.
:model:fn-execution:classes (Thread[Execution **** for ':' Thread 6,5,main]) completed. Took 0.0 secs.
:model:fn-execution:shadowJar (Thread[Execution **** for ':' Thread 6,5,main]) started.

> Task :model:job-management:compileJava FROM-CACHE
file or directory '<https://ci-beam.apache.org/job/beam_PerformanceTests_XmlIOIT_HDFS/ws/src/model/job-management/src/main/java',> not found
Watching 338 directories to track changes
Watching 339 directories to track changes
Watching 339 directories to track changes
Watching 342 directories to track changes
Custom actions are attached to task ':model:job-management:compileJava'.
Build cache key for task ':model:job-management:compileJava' is a6720878596aed0f77e2209e9887ba15
Task ':model:job-management:compileJava' is not up-to-date because:
  No history is available.
Watching 342 directories to track changes
Watching 342 directories to track changes
Watching 341 directories to track changes
Watching 363 directories to track changes
Watching 365 directories to track changes
Watching 367 directories to track changes
Loaded cache entry for task ':model:job-management:compileJava' with cache key a6720878596aed0f77e2209e9887ba15
:model:job-management:compileJava (Thread[Execution **** for ':' Thread 5,5,main]) completed. Took 1.04 secs.
:model:job-management:classes (Thread[Execution **** for ':' Thread 5,5,main]) started.

> Task :model:job-management:classes
Skipping task ':model:job-management:classes' as it has no actions.
:model:job-management:classes (Thread[Execution **** for ':' Thread 5,5,main]) completed. Took 0.0 secs.
:model:job-management:shadowJar (Thread[Execution **** for ':' Thread 8,5,main]) started.

> Task :model:job-management:shadowJar FROM-CACHE
Watching 367 directories to track changes
Watching 368 directories to track changes
Custom actions are attached to task ':model:job-management:shadowJar'.
Build cache key for task ':model:job-management:shadowJar' is 4933dc18b4ad3c8be070918031e08e01
Task ':model:job-management:shadowJar' is not up-to-date because:
  No history is available.
Watching 368 directories to track changes
Watching 370 directories to track changes
Loaded cache entry for task ':model:job-management:shadowJar' with cache key 4933dc18b4ad3c8be070918031e08e01
:model:job-management:shadowJar (Thread[Execution **** for ':' Thread 8,5,main]) completed. Took 0.619 secs.
:sdks:java:core:compileJava (Thread[Execution **** for ':' Thread 5,5,main]) started.

> Task :model:fn-execution:shadowJar FROM-CACHE
Watching 353 directories to track changes
Watching 369 directories to track changes
Custom actions are attached to task ':model:fn-execution:shadowJar'.
Build cache key for task ':model:fn-execution:shadowJar' is 7a27389d5f1e711631ee96f56ace269a
Task ':model:fn-execution:shadowJar' is not up-to-date because:
  No history is available.
Watching 370 directories to track changes
Watching 371 directories to track changes
Loaded cache entry for task ':model:fn-execution:shadowJar' with cache key 7a27389d5f1e711631ee96f56ace269a
:model:fn-execution:shadowJar (Thread[Execution **** for ':' Thread 6,5,main]) completed. Took 0.907 secs.

> Task :sdks:java:core:compileJava
Watching 370 directories to track changes
Watching 370 directories to track changes
Watching 370 directories to track changes
Watching 373 directories to track changes
Watching 408 directories to track changes
Watching 408 directories to track changes
Custom actions are attached to task ':sdks:java:core:compileJava'.
Build cache key for task ':sdks:java:core:compileJava' is 5d985c062e74c8173964848d57ebf861
Task ':sdks:java:core:compileJava' is not up-to-date because:
  No history is available.
Watching 408 directories to track changes
Watching 408 directories to track changes
Watching 408 directories to track changes
Watching 446 directories to track changes
Watching 469 directories to track changes
Watching 471 directories to track changes
Loaded cache entry for task ':sdks:java:core:compileJava' with cache key 5d985c062e74c8173964848d57ebf861

> Task :sdks:java:core:compileJava FROM-CACHE
:sdks:java:core:compileJava (Thread[Execution **** for ':' Thread 5,5,main]) completed. Took 4.848 secs.
:sdks:java:core:classes (Thread[Execution **** for ':' Thread 6,5,main]) started.

> Task :sdks:java:core:classes
Skipping task ':sdks:java:core:classes' as it has no actions.
:sdks:java:core:classes (Thread[Execution **** for ':' Thread 6,5,main]) completed. Took 0.0 secs.
:sdks:java:core:shadowJar (Thread[Execution **** for ':' Thread 6,5,main]) started.

> Task :sdks:java:core:shadowJar
Watching 471 directories to track changes
Watching 472 directories to track changes
Custom actions are attached to task ':sdks:java:core:shadowJar'.
Build cache key for task ':sdks:java:core:shadowJar' is 854011a67b874843ebcd424761957002
Task ':sdks:java:core:shadowJar' is not up-to-date because:
  No history is available.
Watching 472 directories to track changes
Watching 471 directories to track changes
*******************
GRADLE SHADOW STATS

Total Jars: 4 (includes project)
Total Time: 5.558s [5558ms]
Average Time/Jar: 1.3895s [1389.5ms]
*******************
Watching 472 directories to track changes

> Task :sdks:java:core:shadowJar FAILED
:sdks:java:core:shadowJar (Thread[Execution **** for ':' Thread 6,5,main]) completed. Took 1 mins 20.969 secs.
:sdks:java:core:jar (Thread[Execution **** for ':' Thread 9,5,main]) started.

> Task :sdks:java:core:jar
Watching 472 directories to track changes
Watching 473 directories to track changes
Caching disabled for task ':sdks:java:core:jar' because:
  Caching has not been enabled for the task
Task ':sdks:java:core:jar' is not up-to-date because:
  No history is available.
Watching 473 directories to track changes
Watching 473 directories to track changes
:sdks:java:core:jar (Thread[Execution **** for ':' Thread 9,5,main]) completed. Took 3.557 secs.
:sdks:java:core:compileTestJava (Thread[Execution **** for ':' Thread 9,5,main]) started.

> Task :sdks:java:core:compileTestJava
Watching 473 directories to track changes
Watching 473 directories to track changes
Watching 473 directories to track changes
Watching 501 directories to track changes
Custom actions are attached to task ':sdks:java:core:compileTestJava'.
Build cache key for task ':sdks:java:core:compileTestJava' is 153a198ccc8baf4ca77097afa0b3a65d
Task ':sdks:java:core:compileTestJava' is not up-to-date because:
  No history is available.
Invalidating in-memory cache of /home/jenkins/.gradle/caches/journal-1/file-access.bin
Watching 501 directories to track changes
Watching 501 directories to track changes
Watching 501 directories to track changes
Watching 531 directories to track changes
Watching 541 directories to track changes
Watching 542 directories to track changes
Loaded cache entry for task ':sdks:java:core:compileTestJava' with cache key 153a198ccc8baf4ca77097afa0b3a65d

> Task :sdks:java:core:compileTestJava FROM-CACHE
:sdks:java:core:compileTestJava (Thread[Execution **** for ':' Thread 9,5,main]) completed. Took 56.078 secs.
:sdks:java:core:testClasses (Thread[Execution **** for ':' Thread 9,5,main]) started.

> Task :sdks:java:core:testClasses
Skipping task ':sdks:java:core:testClasses' as it has no actions.
:sdks:java:core:testClasses (Thread[Execution **** for ':' Thread 9,5,main]) completed. Took 0.0 secs.
:sdks:java:core:shadowTestJar (Thread[Execution **** for ':' Thread 9,5,main]) started.

> Task :sdks:java:core:shadowTestJar FROM-CACHE
Watching 542 directories to track changes
Invalidating in-memory cache of /home/jenkins/.gradle/caches/6.7/fileHashes/fileHashes.bin
Invalidating in-memory cache of /home/jenkins/.gradle/caches/6.7/fileHashes/resourceHashesCache.bin
Watching 543 directories to track changes
Build cache key for task ':sdks:java:core:shadowTestJar' is 919b57fa41f3c7721a209807e6376ae1
Task ':sdks:java:core:shadowTestJar' is not up-to-date because:
  No history is available.
Invalidating in-memory cache of /home/jenkins/.gradle/caches/journal-1/file-access.bin
Watching 543 directories to track changes
Watching 543 directories to track changes
Loaded cache entry for task ':sdks:java:core:shadowTestJar' with cache key 919b57fa41f3c7721a209807e6376ae1
:sdks:java:core:shadowTestJar (Thread[Execution **** for ':' Thread 9,5,main]) completed. Took 1.312 secs.

FAILURE: Build failed with an exception.

* What went wrong:
Execution failed for task ':sdks:java:core:shadowJar'.
> Failed to store cache entry for task ':sdks:java:core:shadowJar'

* Try:
Run with --stacktrace option to get the stack trace. Run with --debug option to get more log output. Run with --scan to get full insights.

* Get more help at https://help.gradle.org

Deprecated Gradle features were used in this build, making it incompatible with Gradle 7.0.
Use '--warning-mode all' to show the individual deprecation warnings.
See https://docs.gradle.org/6.7/userguide/command_line_interface.html#sec:command_line_warnings

BUILD FAILED in 4m 34s
64 actionable tasks: 48 executed, 16 from cache
Watching 543 directories to track changes

Publishing build scan...
https://gradle.com/s/5wsnycfbo5ncy

Build step 'Invoke Gradle script' changed build result to FAILURE
Build step 'Invoke Gradle script' marked build as failure

---------------------------------------------------------------------
To unsubscribe, e-mail: builds-unsubscribe@beam.apache.org
For additional commands, e-mail: builds-help@beam.apache.org


Jenkins build is back to normal : beam_PerformanceTests_XmlIOIT_HDFS #3887

Posted by Apache Jenkins Server <je...@builds.apache.org>.
See <https://ci-beam.apache.org/job/beam_PerformanceTests_XmlIOIT_HDFS/3887/display/redirect?page=changes>


---------------------------------------------------------------------
To unsubscribe, e-mail: builds-unsubscribe@beam.apache.org
For additional commands, e-mail: builds-help@beam.apache.org