You are viewing a plain text version of this content. The canonical link for it is here.
Posted to builds@mesos.apache.org by Apache Jenkins Server <je...@builds.apache.org> on 2017/08/25 16:56:18 UTC

Build failed in Jenkins: Mesos-Buildbot » cmake,gcc,--verbose --enable-libevent --enable-ssl,GLOG_v=1 MESOS_VERBOSE=1,centos:7,(ubuntu)&&(!ubuntu-us1)&&(!ubuntu-eu2) #4157

See <https://builds.apache.org/job/Mesos-Buildbot/BUILDTOOL=cmake,COMPILER=gcc,CONFIGURATION=--verbose%20--enable-libevent%20--enable-ssl,ENVIRONMENT=GLOG_v=1%20MESOS_VERBOSE=1,OS=centos%3A7,label_exp=(ubuntu)&&(!ubuntu-us1)&&(!ubuntu-eu2)/4157/display/redirect>

------------------------------------------
[...truncated 29.87 MB...]
I0825 16:56:14.244956  6660 slave.cpp:6446] Querying resource estimator for oversubscribable resources
I0825 16:56:14.245290  6662 slave.cpp:6460] Received oversubscribable resources {} from the resource estimator
I0825 16:56:14.247433  6655 process.cpp:3933] Handling HTTP event for process 'slave(802)' with path: '/slave(802)/containers'
I0825 16:56:14.249444  6661 http.cpp:1166] HTTP GET for /slave(802)/containers from 172.17.0.4:37432
I0825 16:56:14.249529  6661 http.cpp:957] Authorizing principal 'test-principal' to GET the '/containers' endpoint
I0825 16:56:14.252758  6661 slave.cpp:859] Agent terminating
[       OK ] Endpoint/SlaveEndpointTest.AuthorizedRequest/2 (32 ms)
[ RUN      ] Endpoint/SlaveEndpointTest.UnauthorizedRequest/0
I0825 16:56:14.268975   958 containerizer.cpp:288] Using isolation { environment_secret, posix/cpu, posix/mem, filesystem/posix, network/cni }
W0825 16:56:14.269503   958 backend.cpp:76] Failed to create 'aufs' backend: AufsBackend requires root privileges
W0825 16:56:14.269608   958 backend.cpp:76] Failed to create 'bind' backend: BindBackend requires root privileges
I0825 16:56:14.269639   958 provisioner.cpp:255] Using default backend 'copy'
I0825 16:56:14.273181  6648 slave.cpp:252] Mesos agent started on (803)@172.17.0.4:59774
I0825 16:56:14.273213  6648 slave.cpp:253] Flags at startup: --acls="" --appc_simple_discovery_uri_prefix="http://" --appc_store_dir="/tmp/Endpoint_SlaveEndpointTest_UnauthorizedRequest_0_vumf2D/store/appc" --authenticate_http_executors="true" --authenticate_http_readonly="true" --authenticate_http_readwrite="true" --authenticatee="crammd5" --authentication_backoff_factor="1secs" --authorizer="local" --cgroups_cpu_enable_pids_and_tids_count="false" --cgroups_enable_cfs="false" --cgroups_hierarchy="/sys/fs/cgroup" --cgroups_limit_swap="false" --cgroups_root="mesos" --container_disk_watch_interval="15secs" --containerizers="mesos" --credential="/tmp/Endpoint_SlaveEndpointTest_UnauthorizedRequest_0_vumf2D/credential" --default_role="*" --disallow_sharing_agent_pid_namespace="false" --disk_watch_interval="1mins" --docker="docker" --docker_kill_orphans="true" --docker_registry="https://registry-1.docker.io" --docker_remove_delay="6hrs" --docker_socket="/var/run/docker.sock" --docker_stop_timeout="0ns" --docker_store_dir="/tmp/Endpoint_SlaveEndpointTest_UnauthorizedRequest_0_vumf2D/store/docker" --docker_volume_checkpoint_dir="/var/run/mesos/isolators/docker/volume" --enforce_container_disk_quota="false" --executor_registration_timeout="1mins" --executor_reregistration_timeout="2secs" --executor_secret_key="/tmp/Endpoint_SlaveEndpointTest_UnauthorizedRequest_0_vumf2D/executor_secret_key" --executor_shutdown_grace_period="5secs" --fetcher_cache_dir="/tmp/Endpoint_SlaveEndpointTest_UnauthorizedRequest_0_vumf2D/fetch" --fetcher_cache_size="2GB" --frameworks_home="" --gc_delay="1weeks" --gc_disk_headroom="0.1" --hadoop_home="" --help="false" --hostname_lookup="true" --http_command_executor="false" --http_credentials="/tmp/Endpoint_SlaveEndpointTest_UnauthorizedRequest_0_vumf2D/http_credentials" --http_heartbeat_interval="30secs" --initialize_driver_logging="true" --isolation="posix/cpu,posix/mem" --launcher="posix" --launcher_dir="/mesos/build/src" --logbufsecs="0" --logging_level="INFO" --max_completed_executors_per_framework="150" --oversubscribed_resources_interval="15secs" --perf_duration="10secs" --perf_interval="1mins" --port="5051" --qos_correction_interval_min="0ns" --quiet="false" --recover="reconnect" --recovery_timeout="15mins" --registration_backoff_factor="10ms" --resources="cpus:2;gpus:0;mem:1024;disk:1024;ports:[31000-32000]" --revocable_cpu_low_priority="true" --runtime_dir="/tmp/Endpoint_SlaveEndpointTest_UnauthorizedRequest_0_vumf2D" --sandbox_directory="/mnt/mesos/sandbox" --strict="true" --switch_user="true" --systemd_enable_support="true" --systemd_runtime_directory="/run/systemd/system" --version="false" --work_dir="/tmp/Endpoint_SlaveEndpointTest_UnauthorizedRequest_0_Di5P2m"
I0825 16:56:14.273846  6648 credentials.hpp:86] Loading credential for authentication from '/tmp/Endpoint_SlaveEndpointTest_UnauthorizedRequest_0_vumf2D/credential'
I0825 16:56:14.274070  6648 slave.cpp:285] Agent using credential for: test-principal
I0825 16:56:14.274178  6648 credentials.hpp:37] Loading credentials for authentication from '/tmp/Endpoint_SlaveEndpointTest_UnauthorizedRequest_0_vumf2D/http_credentials'
I0825 16:56:14.274507  6648 http.cpp:1026] Creating default 'basic' HTTP authenticator for realm 'mesos-agent-executor'
I0825 16:56:14.274675  6648 http.cpp:1047] Creating default 'jwt' HTTP authenticator for realm 'mesos-agent-executor'
I0825 16:56:14.274888  6648 http.cpp:1026] Creating default 'basic' HTTP authenticator for realm 'mesos-agent-readonly'
I0825 16:56:14.274972  6648 http.cpp:1047] Creating default 'jwt' HTTP authenticator for realm 'mesos-agent-readonly'
I0825 16:56:14.275184  6648 http.cpp:1026] Creating default 'basic' HTTP authenticator for realm 'mesos-agent-readwrite'
I0825 16:56:14.275271  6648 http.cpp:1047] Creating default 'jwt' HTTP authenticator for realm 'mesos-agent-readwrite'
I0825 16:56:14.276697  6648 slave.cpp:581] Agent resources: [{"name":"cpus","scalar":{"value":2.0},"type":"SCALAR"},{"name":"mem","scalar":{"value":1024.0},"type":"SCALAR"},{"name":"disk","scalar":{"value":1024.0},"type":"SCALAR"},{"name":"ports","ranges":{"range":[{"begin":31000,"end":32000}]},"type":"RANGES"}]
I0825 16:56:14.276880  6648 slave.cpp:589] Agent attributes: [  ]
I0825 16:56:14.276891  6648 slave.cpp:598] Agent hostname: 92354c3e200c
I0825 16:56:14.277039  6654 status_update_manager.cpp:177] Pausing sending status updates
I0825 16:56:14.278547  6661 state.cpp:64] Recovering state from '/tmp/Endpoint_SlaveEndpointTest_UnauthorizedRequest_0_Di5P2m/meta'
I0825 16:56:14.278882  6655 status_update_manager.cpp:203] Recovering status update manager
I0825 16:56:14.279124  6657 containerizer.cpp:643] Recovering containerizer
I0825 16:56:14.280467  6655 provisioner.cpp:416] Provisioner recovery complete
I0825 16:56:14.280776  6658 slave.cpp:6264] Finished recovery
I0825 16:56:14.281286  6658 slave.cpp:6446] Querying resource estimator for oversubscribable resources
I0825 16:56:14.281529  6648 slave.cpp:6460] Received oversubscribable resources {} from the resource estimator
I0825 16:56:14.283879  6654 process.cpp:3933] Handling HTTP event for process 'slave(803)' with path: '/slave(803)/monitor/statistics'
I0825 16:56:14.285764  6652 http.cpp:1166] HTTP GET for /slave(803)/monitor/statistics from 172.17.0.4:37433
I0825 16:56:14.285837  6652 http.cpp:957] Authorizing principal 'test-principal' to GET the '/monitor/statistics' endpoint
I0825 16:56:14.288134  6653 slave.cpp:859] Agent terminating
[       OK ] Endpoint/SlaveEndpointTest.UnauthorizedRequest/0 (32 ms)
[ RUN      ] Endpoint/SlaveEndpointTest.UnauthorizedRequest/1
I0825 16:56:14.299098   958 containerizer.cpp:288] Using isolation { environment_secret, posix/cpu, posix/mem, filesystem/posix, network/cni }
W0825 16:56:14.299537   958 backend.cpp:76] Failed to create 'aufs' backend: AufsBackend requires root privileges
W0825 16:56:14.299634   958 backend.cpp:76] Failed to create 'bind' backend: BindBackend requires root privileges
I0825 16:56:14.299669   958 provisioner.cpp:255] Using default backend 'copy'
I0825 16:56:14.302860  6652 slave.cpp:252] Mesos agent started on (804)@172.17.0.4:59774
I0825 16:56:14.302887  6652 slave.cpp:253] Flags at startup: --acls="" --appc_simple_discovery_uri_prefix="http://" --appc_store_dir="/tmp/Endpoint_SlaveEndpointTest_UnauthorizedRequest_1_z4S0hK/store/appc" --authenticate_http_executors="true" --authenticate_http_readonly="true" --authenticate_http_readwrite="true" --authenticatee="crammd5" --authentication_backoff_factor="1secs" --authorizer="local" --cgroups_cpu_enable_pids_and_tids_count="false" --cgroups_enable_cfs="false" --cgroups_hierarchy="/sys/fs/cgroup" --cgroups_limit_swap="false" --cgroups_root="mesos" --container_disk_watch_interval="15secs" --containerizers="mesos" --credential="/tmp/Endpoint_SlaveEndpointTest_UnauthorizedRequest_1_z4S0hK/credential" --default_role="*" --disallow_sharing_agent_pid_namespace="false" --disk_watch_interval="1mins" --docker="docker" --docker_kill_orphans="true" --docker_registry="https://registry-1.docker.io" --docker_remove_delay="6hrs" --docker_socket="/var/run/docker.sock" --docker_stop_timeout="0ns" --docker_store_dir="/tmp/Endpoint_SlaveEndpointTest_UnauthorizedRequest_1_z4S0hK/store/docker" --docker_volume_checkpoint_dir="/var/run/mesos/isolators/docker/volume" --enforce_container_disk_quota="false" --executor_registration_timeout="1mins" --executor_reregistration_timeout="2secs" --executor_secret_key="/tmp/Endpoint_SlaveEndpointTest_UnauthorizedRequest_1_z4S0hK/executor_secret_key" --executor_shutdown_grace_period="5secs" --fetcher_cache_dir="/tmp/Endpoint_SlaveEndpointTest_UnauthorizedRequest_1_z4S0hK/fetch" --fetcher_cache_size="2GB" --frameworks_home="" --gc_delay="1weeks" --gc_disk_headroom="0.1" --hadoop_home="" --help="false" --hostname_lookup="true" --http_command_executor="false" --http_credentials="/tmp/Endpoint_SlaveEndpointTest_UnauthorizedRequest_1_z4S0hK/http_credentials" --http_heartbeat_interval="30secs" --initialize_driver_logging="true" --isolation="posix/cpu,posix/mem" --launcher="posix" --launcher_dir="/mesos/build/src" --logbufsecs="0" --logging_level="INFO" --max_completed_executors_per_framework="150" --oversubscribed_resources_interval="15secs" --perf_duration="10secs" --perf_interval="1mins" --port="5051" --qos_correction_interval_min="0ns" --quiet="false" --recover="reconnect" --recovery_timeout="15mins" --registration_backoff_factor="10ms" --resources="cpus:2;gpus:0;mem:1024;disk:1024;ports:[31000-32000]" --revocable_cpu_low_priority="true" --runtime_dir="/tmp/Endpoint_SlaveEndpointTest_UnauthorizedRequest_1_z4S0hK" --sandbox_directory="/mnt/mesos/sandbox" --strict="true" --switch_user="true" --systemd_enable_support="true" --systemd_runtime_directory="/run/systemd/system" --version="false" --work_dir="/tmp/Endpoint_SlaveEndpointTest_UnauthorizedRequest_1_PFgmdt"
I0825 16:56:14.303344  6652 credentials.hpp:86] Loading credential for authentication from '/tmp/Endpoint_SlaveEndpointTest_UnauthorizedRequest_1_z4S0hK/credential'
I0825 16:56:14.303539  6652 slave.cpp:285] Agent using credential for: test-principal
I0825 16:56:14.303556  6652 credentials.hpp:37] Loading credentials for authentication from '/tmp/Endpoint_SlaveEndpointTest_UnauthorizedRequest_1_z4S0hK/http_credentials'
I0825 16:56:14.303840  6652 http.cpp:1026] Creating default 'basic' HTTP authenticator for realm 'mesos-agent-executor'
I0825 16:56:14.304033  6652 http.cpp:1047] Creating default 'jwt' HTTP authenticator for realm 'mesos-agent-executor'
I0825 16:56:14.304257  6652 http.cpp:1026] Creating default 'basic' HTTP authenticator for realm 'mesos-agent-readonly'
I0825 16:56:14.304352  6652 http.cpp:1047] Creating default 'jwt' HTTP authenticator for realm 'mesos-agent-readonly'
I0825 16:56:14.304518  6652 http.cpp:1026] Creating default 'basic' HTTP authenticator for realm 'mesos-agent-readwrite'
I0825 16:56:14.304611  6652 http.cpp:1047] Creating default 'jwt' HTTP authenticator for realm 'mesos-agent-readwrite'
I0825 16:56:14.305979  6652 slave.cpp:581] Agent resources: [{"name":"cpus","scalar":{"value":2.0},"type":"SCALAR"},{"name":"mem","scalar":{"value":1024.0},"type":"SCALAR"},{"name":"disk","scalar":{"value":1024.0},"type":"SCALAR"},{"name":"ports","ranges":{"range":[{"begin":31000,"end":32000}]},"type":"RANGES"}]
I0825 16:56:14.306162  6652 slave.cpp:589] Agent attributes: [  ]
I0825 16:56:14.306172  6652 slave.cpp:598] Agent hostname: 92354c3e200c
I0825 16:56:14.306332  6663 status_update_manager.cpp:177] Pausing sending status updates
I0825 16:56:14.307945  6662 state.cpp:64] Recovering state from '/tmp/Endpoint_SlaveEndpointTest_UnauthorizedRequest_1_PFgmdt/meta'
I0825 16:56:14.308328  6648 status_update_manager.cpp:203] Recovering status update manager
I0825 16:56:14.308511  6656 containerizer.cpp:643] Recovering containerizer
I0825 16:56:14.309996  6658 provisioner.cpp:416] Provisioner recovery complete
I0825 16:56:14.310359  6649 slave.cpp:6264] Finished recovery
I0825 16:56:14.310853  6649 slave.cpp:6446] Querying resource estimator for oversubscribable resources
I0825 16:56:14.311121  6662 slave.cpp:6460] Received oversubscribable resources {} from the resource estimator
I0825 16:56:14.313472  6658 process.cpp:3933] Handling HTTP event for process 'slave(804)' with path: '/slave(804)/monitor/statistics.json'
I0825 16:56:14.315265  6652 http.cpp:1166] HTTP GET for /slave(804)/monitor/statistics.json from 172.17.0.4:37434
I0825 16:56:14.315346  6652 http.cpp:957] Authorizing principal 'test-principal' to GET the '/monitor/statistics.json' endpoint
I0825 16:56:14.317406  6648 slave.cpp:859] Agent terminating
[       OK ] Endpoint/SlaveEndpointTest.UnauthorizedRequest/1 (29 ms)
[ RUN      ] Endpoint/SlaveEndpointTest.UnauthorizedRequest/2
I0825 16:56:14.329005   958 containerizer.cpp:288] Using isolation { environment_secret, posix/cpu, posix/mem, filesystem/posix, network/cni }
W0825 16:56:14.329464   958 backend.cpp:76] Failed to create 'aufs' backend: AufsBackend requires root privileges
W0825 16:56:14.329567   958 backend.cpp:76] Failed to create 'bind' backend: BindBackend requires root privileges
I0825 16:56:14.329602   958 provisioner.cpp:255] Using default backend 'copy'
I0825 16:56:14.332972  6658 slave.cpp:252] Mesos agent started on (805)@172.17.0.4:59774
I0825 16:56:14.332994  6658 slave.cpp:253] Flags at startup: --acls="" --appc_simple_discovery_uri_prefix="http://" --appc_store_dir="/tmp/Endpoint_SlaveEndpointTest_UnauthorizedRequest_2_DgQ7QQ/store/appc" --authenticate_http_executors="true" --authenticate_http_readonly="true" --authenticate_http_readwrite="true" --authenticatee="crammd5" --authentication_backoff_factor="1secs" --authorizer="local" --cgroups_cpu_enable_pids_and_tids_count="false" --cgroups_enable_cfs="false" --cgroups_hierarchy="/sys/fs/cgroup" --cgroups_limit_swap="false" --cgroups_root="mesos" --container_disk_watch_interval="15secs" --containerizers="mesos" --credential="/tmp/Endpoint_SlaveEndpointTest_UnauthorizedRequest_2_DgQ7QQ/credential" --default_role="*" --disallow_sharing_agent_pid_namespace="false" --disk_watch_interval="1mins" --docker="docker" --docker_kill_orphans="true" --docker_registry="https://registry-1.docker.io" --docker_remove_delay="6hrs" --docker_socket="/var/run/docker.sock" --docker_stop_timeout="0ns" --docker_store_dir="/tmp/Endpoint_SlaveEndpointTest_UnauthorizedRequest_2_DgQ7QQ/store/docker" --docker_volume_checkpoint_dir="/var/run/mesos/isolators/docker/volume" --enforce_container_disk_quota="false" --executor_registration_timeout="1mins" --executor_reregistration_timeout="2secs" --executor_secret_key="/tmp/Endpoint_SlaveEndpointTest_UnauthorizedRequest_2_DgQ7QQ/executor_secret_key" --executor_shutdown_grace_period="5secs" --fetcher_cache_dir="/tmp/Endpoint_SlaveEndpointTest_UnauthorizedRequest_2_DgQ7QQ/fetch" --fetcher_cache_size="2GB" --frameworks_home="" --gc_delay="1weeks" --gc_disk_headroom="0.1" --hadoop_home="" --help="false" --hostname_lookup="true" --http_command_executor="false" --http_credentials="/tmp/Endpoint_SlaveEndpointTest_UnauthorizedRequest_2_DgQ7QQ/http_credentials" --http_heartbeat_interval="30secs" --initialize_driver_logging="true" --isolation="posix/cpu,posix/mem" --launcher="posix" --launcher_dir="/mesos/build/src" --logbufsecs="0" --logging_level="INFO" --max_completed_executors_per_framework="150" --oversubscribed_resources_interval="15secs" --perf_duration="10secs" --perf_interval="1mins" --port="5051" --qos_correction_interval_min="0ns" --quiet="false" --recover="reconnect" --recovery_timeout="15mins" --registration_backoff_factor="10ms" --resources="cpus:2;gpus:0;mem:1024;disk:1024;ports:[31000-32000]" --revocable_cpu_low_priority="true" --runtime_dir="/tmp/Endpoint_SlaveEndpointTest_UnauthorizedRequest_2_DgQ7QQ" --sandbox_directory="/mnt/mesos/sandbox" --strict="true" --switch_user="true" --systemd_enable_support="true" --systemd_runtime_directory="/run/systemd/system" --version="false" --work_dir="/tmp/Endpoint_SlaveEndpointTest_UnauthorizedRequest_2_NpFCHz"
I0825 16:56:14.333396  6658 credentials.hpp:86] Loading credential for authentication from '/tmp/Endpoint_SlaveEndpointTest_UnauthorizedRequest_2_DgQ7QQ/credential'
I0825 16:56:14.333557  6658 slave.cpp:285] Agent using credential for: test-principal
I0825 16:56:14.333573  6658 credentials.hpp:37] Loading credentials for authentication from '/tmp/Endpoint_SlaveEndpointTest_UnauthorizedRequest_2_DgQ7QQ/http_credentials'
I0825 16:56:14.333817  6658 http.cpp:1026] Creating default 'basic' HTTP authenticator for realm 'mesos-agent-executor'
I0825 16:56:14.333932  6658 http.cpp:1047] Creating default 'jwt' HTTP authenticator for realm 'mesos-agent-executor'
I0825 16:56:14.334112  6658 http.cpp:1026] Creating default 'basic' HTTP authenticator for realm 'mesos-agent-readonly'
I0825 16:56:14.334198  6658 http.cpp:1047] Creating default 'jwt' HTTP authenticator for realm 'mesos-agent-readonly'
I0825 16:56:14.334369  6658 http.cpp:1026] Creating default 'basic' HTTP authenticator for realm 'mesos-agent-readwrite'
I0825 16:56:14.334466  6658 http.cpp:1047] Creating default 'jwt' HTTP authenticator for realm 'mesos-agent-readwrite'
I0825 16:56:14.335742  6658 slave.cpp:581] Agent resources: [{"name":"cpus","scalar":{"value":2.0},"type":"SCALAR"},{"name":"mem","scalar":{"value":1024.0},"type":"SCALAR"},{"name":"disk","scalar":{"value":1024.0},"type":"SCALAR"},{"name":"ports","ranges":{"range":[{"begin":31000,"end":32000}]},"type":"RANGES"}]
I0825 16:56:14.335924  6658 slave.cpp:589] Agent attributes: [  ]
I0825 16:56:14.335942  6658 slave.cpp:598] Agent hostname: 92354c3e200c
I0825 16:56:14.336130  6652 status_update_manager.cpp:177] Pausing sending status updates
I0825 16:56:14.337455  6650 state.cpp:64] Recovering state from '/tmp/Endpoint_SlaveEndpointTest_UnauthorizedRequest_2_NpFCHz/meta'
I0825 16:56:14.337751  6660 status_update_manager.cpp:203] Recovering status update manager
I0825 16:56:14.337926  6656 containerizer.cpp:643] Recovering containerizer
I0825 16:56:14.339510  6649 provisioner.cpp:416] Provisioner recovery complete
I0825 16:56:14.339851  6661 slave.cpp:6264] Finished recovery
I0825 16:56:14.340323  6661 slave.cpp:6446] Querying resource estimator for oversubscribable resources
I0825 16:56:14.340559  6659 slave.cpp:6460] Received oversubscribable resources {} from the resource estimator
I0825 16:56:14.342758  6655 process.cpp:3933] Handling HTTP event for process 'slave(805)' with path: '/slave(805)/containers'
I0825 16:56:14.344516  6650 http.cpp:1166] HTTP GET for /slave(805)/containers from 172.17.0.4:37435
I0825 16:56:14.344599  6650 http.cpp:957] Authorizing principal 'test-principal' to GET the '/containers' endpoint
I0825 16:56:14.346694  6656 slave.cpp:859] Agent terminating
[       OK ] Endpoint/SlaveEndpointTest.UnauthorizedRequest/2 (29 ms)
[ RUN      ] Endpoint/SlaveEndpointTest.NoAuthorizer/0
I0825 16:56:14.359817   958 containerizer.cpp:288] Using isolation { environment_secret, posix/cpu, posix/mem, filesystem/posix, network/cni }
W0825 16:56:14.360496   958 backend.cpp:76] Failed to create 'aufs' backend: AufsBackend requires root privileges
W0825 16:56:14.360601   958 backend.cpp:76] Failed to create 'bind' backend: BindBackend requires root privileges
I0825 16:56:14.360632   958 provisioner.cpp:255] Using default backend 'copy'
I0825 16:56:14.362320   958 cluster.cpp:448] Creating default 'local' authorizer
I0825 16:56:14.364326  6661 slave.cpp:252] Mesos agent started on (806)@172.17.0.4:59774
I0825 16:56:14.364346  6661 slave.cpp:253] Flags at startup: --acls="" --appc_simple_discovery_uri_prefix="http://" --appc_store_dir="/tmp/Endpoint_SlaveEndpointTest_NoAuthorizer_0_9c4IJX/store/appc" --authenticate_http_executors="true" --authenticate_http_readonly="true" --authenticate_http_readwrite="true" --authenticatee="crammd5" --authentication_backoff_factor="1secs" --authorizer="local" --cgroups_cpu_enable_pids_and_tids_count="false" --cgroups_enable_cfs="false" --cgroups_hierarchy="/sys/fs/cgroup" --cgroups_limit_swap="false" --cgroups_root="mesos" --container_disk_watch_interval="15secs" --containerizers="mesos" --credential="/tmp/Endpoint_SlaveEndpointTest_NoAuthorizer_0_9c4IJX/credential" --default_role="*" --disallow_sharing_agent_pid_namespace="false" --disk_watch_interval="1mins" --docker="docker" --docker_kill_orphans="true" --docker_registry="https://registry-1.docker.io" --docker_remove_delay="6hrs" --docker_socket="/var/run/docker.sock" --docker_stop_timeout="0ns" --docker_store_dir="/tmp/Endpoint_SlaveEndpointTest_NoAuthorizer_0_9c4IJX/store/docker" --docker_volume_checkpoint_dir="/var/run/mesos/isolators/docker/volume" --enforce_container_disk_quota="false" --executor_registration_timeout="1mins" --executor_reregistration_timeout="2secs" --executor_secret_key="/tmp/Endpoint_SlaveEndpointTest_NoAuthorizer_0_9c4IJX/executor_secret_key" --executor_shutdown_grace_period="5secs" --fetcher_cache_dir="/tmp/Endpoint_SlaveEndpointTest_NoAuthorizer_0_9c4IJX/fetch" --fetcher_cache_size="2GB" --frameworks_home="" --gc_delay="1weeks" --gc_disk_headroom="0.1" --hadoop_home="" --help="false" --hostname_lookup="true" --http_command_executor="false" --http_credentials="/tmp/Endpoint_SlaveEndpointTest_NoAuthorizer_0_9c4IJX/http_credentials" --http_heartbeat_interval="30secs" --initialize_driver_logging="true" --isolation="posix/cpu,posix/mem" --launcher="posix" --launcher_dir="/mesos/build/src" --logbufsecs="0" --logging_level="INFO" --max_completed_executors_per_framework="150" --oversubscribed_resources_interval="15secs" --perf_duration="10secs" --perf_interval="1mins" --port="5051" --qos_correction_interval_min="0ns" --quiet="false" --recover="reconnect" --recovery_timeout="15mins" --registration_backoff_factor="10ms" --resources="cpus:2;gpus:0;mem:1024;disk:1024;ports:[31000-32000]" --revocable_cpu_low_priority="true" --runtime_dir="/tmp/Endpoint_SlaveEndpointTest_NoAuthorizer_0_9c4IJX" --sandbox_directory="/mnt/mesos/sandbox" --strict="true" --switch_user="true" --systemd_enable_support="true" --systemd_runtime_directory="/run/systemd/system" --version="false" --work_dir="/tmp/Endpoint_SlaveEndpointTest_NoAuthorizer_0_zmwivG"
I0825 16:56:14.364745  6661 credentials.hpp:86] Loading credential for authentication from '/tmp/Endpoint_SlaveEndpointTest_NoAuthorizer_0_9c4IJX/credential'
I0825 16:56:14.364944  6661 slave.cpp:285] Agent using credential for: test-principal
I0825 16:56:14.364962  6661 credentials.hpp:37] Loading credentials for authentication from '/tmp/Endpoint_SlaveEndpointTest_NoAuthorizer_0_9c4IJX/http_credentials'
I0825 16:56:14.365241  6661 http.cpp:1026] Creating default 'basic' HTTP authenticator for realm 'mesos-agent-executor'
I0825 16:56:14.365373  6661 http.cpp:1047] Creating default 'jwt' HTTP authenticator for realm 'mesos-agent-executor'
I0825 16:56:14.365592  6661 http.cpp:1026] Creating default 'basic' HTTP authenticator for realm 'mesos-agent-readonly'
I0825 16:56:14.365696  6661 http.cpp:1047] Creating default 'jwt' HTTP authenticator for realm 'mesos-agent-readonly'
I0825 16:56:14.365871  6661 http.cpp:1026] Creating default 'basic' HTTP authenticator for realm 'mesos-agent-readwrite'
I0825 16:56:14.365967  6661 http.cpp:1047] Creating default 'jwt' HTTP authenticator for realm 'mesos-agent-readwrite'
I0825 16:56:14.367277  6661 slave.cpp:581] Agent resources: [{"name":"cpus","scalar":{"value":2.0},"type":"SCALAR"},{"name":"mem","scalar":{"value":1024.0},"type":"SCALAR"},{"name":"disk","scalar":{"value":1024.0},"type":"SCALAR"},{"name":"ports","ranges":{"range":[{"begin":31000,"end":32000}]},"type":"RANGES"}]
I0825 16:56:14.367452  6661 slave.cpp:589] Agent attributes: [  ]
I0825 16:56:14.367462  6661 slave.cpp:598] Agent hostname: 92354c3e200c
I0825 16:56:14.367588  6663 status_update_manager.cpp:177] Pausing sending status updates
I0825 16:56:14.369102  6655 state.cpp:64] Recovering state from '/tmp/Endpoint_SlaveEndpointTest_NoAuthorizer_0_zmwivG/meta'
I0825 16:56:14.369421  6655 status_update_manager.cpp:203] Recovering status update manager
I0825 16:56:14.369619  6660 containerizer.cpp:643] Recovering containerizer
I0825 16:56:14.370859  6655 provisioner.cpp:416] Provisioner recovery complete
I0825 16:56:14.371196  6659 slave.cpp:6264] Finished recovery
I0825 16:56:14.371763  6659 slave.cpp:6446] Querying resource estimator for oversubscribable resources
I0825 16:56:14.372058  6658 slave.cpp:6460] Received oversubscribable resources {} from the resource estimator
I0825 16:56:14.374691  6649 process.cpp:3933] Handling HTTP event for process 'slave(806)' with path: '/slave(806)/monitor/statistics'
I0825 16:56:14.376473  6661 http.cpp:1166] HTTP GET for /slave(806)/monitor/statistics from 172.17.0.4:37438
I0825 16:56:14.376540  6661 http.cpp:957] Authorizing principal 'test-principal' to GET the '/monitor/statistics' endpoint
I0825 16:56:14.379482  6657 slave.cpp:859] Agent terminating
[       OK ] Endpoint/SlaveEndpointTest.NoAuthorizer/0 (30 ms)
[ RUN      ] Endpoint/SlaveEndpointTest.NoAuthorizer/1
I0825 16:56:14.392163   958 containerizer.cpp:288] Using isolation { environment_secret, posix/cpu, posix/mem, filesystem/posix, network/cni }
W0825 16:56:14.392648   958 backend.cpp:76] Failed to create 'aufs' backend: AufsBackend requires root privileges
W0825 16:56:14.392748   958 backend.cpp:76] Failed to create 'bind' backend: BindBackend requires root privileges
I0825 16:56:14.392776   958 provisioner.cpp:255] Using default backend 'copy'
I0825 16:56:14.394351   958 cluster.cpp:448] Creating default 'local' authorizer
I0825 16:56:14.396759  6654 slave.cpp:252] Mesos agent started on (807)@172.17.0.4:59774
I0825 16:56:14.396777  6654 slave.cpp:253] Flags at startup: --acls="" --appc_simple_discovery_uri_prefix="http://" --appc_store_dir="/tmp/Endpoint_SlaveEndpointTest_NoAuthorizer_1_5gnFW4/store/appc" --authenticate_http_executors="true" --authenticate_http_readonly="true" --authenticate_http_readwrite="true" --authenticatee="crammd5" --authentication_backoff_factor="1secs" --authorizer="local" --cgroups_cpu_enable_pids_and_tids_count="false" --cgroups_enable_cfs="false" --cgroups_hierarchy="/sys/fs/cgroup" --cgroups_limit_swap="false" --cgroups_root="mesos" --container_disk_watch_interval="15secs" --containerizers="mesos" --credential="/tmp/Endpoint_SlaveEndpointTest_NoAuthorizer_1_5gnFW4/credential" --default_role="*" --disallow_sharing_agent_pid_namespace="false" --disk_watch_interval="1mins" --docker="docker" --docker_kill_orphans="true" --docker_registry="https://registry-1.docker.io" --docker_remove_delay="6hrs" --docker_socket="/var/run/docker.sock" --docker_stop_timeout="0ns" --docker_store_dir="/tmp/Endpoint_SlaveEndpointTest_NoAuthorizer_1_5gnFW4/store/docker" --docker_volume_checkpoint_dir="/var/run/mesos/isolators/docker/volume" --enforce_container_disk_quota="false" --executor_registration_timeout="1mins" --executor_reregistration_timeout="2secs" --executor_secret_key="/tmp/Endpoint_SlaveEndpointTest_NoAuthorizer_1_5gnFW4/executor_secret_key" --executor_shutdown_grace_period="5secs" --fetcher_cache_dir="/tmp/Endpoint_SlaveEndpointTest_NoAuthorizer_1_5gnFW4/fetch" --fetcher_cache_size="2GB" --frameworks_home="" --gc_delay="1weeks" --gc_disk_headroom="0.1" --hadoop_home="" --help="false" --hostname_lookup="true" --http_command_executor="false" --http_credentials="/tmp/Endpoint_SlaveEndpointTest_NoAuthorizer_1_5gnFW4/http_credentials" --http_heartbeat_interval="30secs" --initialize_driver_logging="true" --isolation="posix/cpu,posix/mem" --launcher="posix" --launcher_dir="/mesos/build/src" --logbufsecs="0" --logging_level="INFO" --max_completed_executors_per_framework="150" --oversubscribed_resources_interval="15secs" --perf_duration="10secs" --perf_interval="1mins" --port="5051" --qos_correction_interval_min="0ns" --quiet="false" --recover="reconnect" --recovery_timeout="15mins" --registration_backoff_factor="10ms" --resources="cpus:2;gpus:0;mem:1024;disk:1024;ports:[31000-32000]" --revocable_cpu_low_priority="true" --runtime_dir="/tmp/Endpoint_SlaveEndpointTest_NoAuthorizer_1_5gnFW4" --sandbox_directory="/mnt/mesos/sandbox" --strict="true" --switch_user="true" --systemd_enable_support="true" --systemd_runtime_directory="/run/systemd/system" --version="false" --work_dir="/tmp/Endpoint_SlaveEndpointTest_NoAuthorizer_1_BaK9CN"
I0825 16:56:14.397147  6654 credentials.hpp:86] Loading credential for authentication from '/tmp/Endpoint_SlaveEndpointTest_NoAuthorizer_1_5gnFW4/credential'
I0825 16:56:14.397300  6654 slave.cpp:285] Agent using credential for: test-principal
I0825 16:56:14.397332  6654 credentials.hpp:37] Loading credentials for authentication from '/tmp/Endpoint_SlaveEndpointTest_NoAuthorizer_1_5gnFW4/http_credentials'
I0825 16:56:14.397600  6654 http.cpp:1026] Creating default 'basic' HTTP authenticator for realm 'mesos-agent-executor'
I0825 16:56:14.397714  6654 http.cpp:1047] Creating default 'jwt' HTTP authenticator for realm 'mesos-agent-executor'
I0825 16:56:14.397938  6654 http.cpp:1026] Creating default 'basic' HTTP authenticator for realm 'mesos-agent-readonly'
I0825 16:56:14.398083  6654 http.cpp:1047] Creating default 'jwt' HTTP authenticator for realm 'mesos-agent-readonly'
I0825 16:56:14.398303  6654 http.cpp:1026] Creating default 'basic' HTTP authenticator for realm 'mesos-agent-readwrite'
I0825 16:56:14.398417  6654 http.cpp:1047] Creating default 'jwt' HTTP authenticator for realm 'mesos-agent-readwrite'
I0825 16:56:14.400154  6654 slave.cpp:581] Agent resources: [{"name":"cpus","scalar":{"value":2.0},"type":"SCALAR"},{"name":"mem","scalar":{"value":1024.0},"type":"SCALAR"},{"name":"disk","scalar":{"value":1024.0},"type":"SCALAR"},{"name":"ports","ranges":{"range":[{"begin":31000,"end":32000}]},"type":"RANGES"}]
I0825 16:56:14.400401  6654 slave.cpp:589] Agent attributes: [  ]
I0825 16:56:14.400415  6654 slave.cpp:598] Agent hostname: 92354c3e200c
I0825 16:56:14.400593  6650 status_update_manager.cpp:177] Pausing sending status updates
I0825 16:56:14.402230  6663 state.cpp:64] Recovering state from '/tmp/Endpoint_SlaveEndpointTest_NoAuthorizer_1_BaK9CN/meta'
I0825 16:56:14.402577  6663 status_update_manager.cpp:203] Recovering status update manager
I0825 16:56:14.402803  6649 containerizer.cpp:643] Recovering containerizer
I0825 16:56:14.404482  6663 provisioner.cpp:416] Provisioner recovery complete
I0825 16:56:14.404853  6650 slave.cpp:6264] Finished recovery
I0825 16:56:14.405416  6650 slave.cpp:6446] Querying resource estimator for oversubscribable resources
I0825 16:56:14.405692  6656 slave.cpp:6460] Received oversubscribable resources {} from the resource estimator
I0825 16:56:14.408576  6654 process.cpp:3933] Handling HTTP event for process 'slave(807)' with path: '/slave(807)/monitor/statistics.json'
I0825 16:56:14.410774  6661 http.cpp:1166] HTTP GET for /slave(807)/monitor/statistics.json from 172.17.0.4:37439
I0825 16:56:14.410845  6661 http.cpp:957] Authorizing principal 'test-principal' to GET the '/monitor/statistics.json' endpoint
I0825 16:56:14.414762   958 slave.cpp:859] Agent terminating
[       OK ] Endpoint/SlaveEndpointTest.NoAuthorizer/1 (35 ms)
[ RUN      ] Endpoint/SlaveEndpointTest.NoAuthorizer/2
I0825 16:56:14.426508   958 containerizer.cpp:288] Using isolation { environment_secret, posix/cpu, posix/mem, filesystem/posix, network/cni }
W0825 16:56:14.426978   958 backend.cpp:76] Failed to create 'aufs' backend: AufsBackend requires root privileges
W0825 16:56:14.427093   958 backend.cpp:76] Failed to create 'bind' backend: BindBackend requires root privileges
I0825 16:56:14.427132   958 provisioner.cpp:255] Using default backend 'copy'
I0825 16:56:14.428972   958 cluster.cpp:448] Creating default 'local' authorizer
I0825 16:56:14.431028  6656 slave.cpp:252] Mesos agent started on (808)@172.17.0.4:59774
I0825 16:56:14.431048  6656 slave.cpp:253] Flags at startup: --acls="" --appc_simple_discovery_uri_prefix="http://" --appc_store_dir="/tmp/Endpoint_SlaveEndpointTest_NoAuthorizer_2_nwhswc/store/appc" --authenticate_http_executors="true" --authenticate_http_readonly="true" --authenticate_http_readwrite="true" --authenticatee="crammd5" --authentication_backoff_factor="1secs" --authorizer="local" --cgroups_cpu_enable_pids_and_tids_count="false" --cgroups_enable_cfs="false" --cgroups_hierarchy="/sys/fs/cgroup" --cgroups_limit_swap="false" --cgroups_root="mesos" --container_disk_watch_interval="15secs" --containerizers="mesos" --credential="/tmp/Endpoint_SlaveEndpointTest_NoAuthorizer_2_nwhswc/credential" --default_role="*" --disallow_sharing_agent_pid_namespace="false" --disk_watch_interval="1mins" --docker="docker" --docker_kill_orphans="true" --docker_registry="https://registry-1.docker.io" --docker_remove_delay="6hrs" --docker_socket="/var/run/docker.sock" --docker_stop_timeout="0ns" --docker_store_dir="/tmp/Endpoint_SlaveEndpointTest_NoAuthorizer_2_nwhswc/store/docker" --docker_volume_checkpoint_dir="/var/run/mesos/isolators/docker/volume" --enforce_container_disk_quota="false" --executor_registration_timeout="1mins" --executor_reregistration_timeout="2secs" --executor_secret_key="/tmp/Endpoint_SlaveEndpointTest_NoAuthorizer_2_nwhswc/executor_secret_key" --executor_shutdown_grace_period="5secs" --fetcher_cache_dir="/tmp/Endpoint_SlaveEndpointTest_NoAuthorizer_2_nwhswc/fetch" --fetcher_cache_size="2GB" --frameworks_home="" --gc_delay="1weeks" --gc_disk_headroom="0.1" --hadoop_home="" --help="false" --hostname_lookup="true" --http_command_executor="false" --http_credentials="/tmp/Endpoint_SlaveEndpointTest_NoAuthorizer_2_nwhswc/http_credentials" --http_heartbeat_interval="30secs" --initialize_driver_logging="true" --isolation="posix/cpu,posix/mem" --launcher="posix" --launcher_dir="/mesos/build/src" --logbufsecs="0" --logging_level="INFO" --max_completed_executors_per_framework="150" --oversubscribed_resources_interval="15secs" --perf_duration="10secs" --perf_interval="1mins" --port="5051" --qos_correction_interval_min="0ns" --quiet="false" --recover="reconnect" --recovery_timeout="15mins" --registration_backoff_factor="10ms" --resources="cpus:2;gpus:0;mem:1024;disk:1024;ports:[31000-32000]" --revocable_cpu_low_priority="true" --runtime_dir="/tmp/Endpoint_SlaveEndpointTest_NoAuthorizer_2_nwhswc" --sandbox_directory="/mnt/mesos/sandbox" --strict="true" --switch_user="true" --systemd_enable_support="true" --systemd_runtime_directory="/run/systemd/system" --version="false" --work_dir="/tmp/Endpoint_SlaveEndpointTest_NoAuthorizer_2_feYa7U"
I0825 16:56:14.431440  6656 credentials.hpp:86] Loading credential for authentication from '/tmp/Endpoint_SlaveEndpointTest_NoAuthorizer_2_nwhswc/credential'
I0825 16:56:14.431655  6656 slave.cpp:285] Agent using credential for: test-principal
I0825 16:56:14.431671  6656 credentials.hpp:37] Loading credentials for authentication from '/tmp/Endpoint_SlaveEndpointTest_NoAuthorizer_2_nwhswc/http_credentials'
I0825 16:56:14.431933  6656 http.cpp:1026] Creating default 'basic' HTTP authenticator for realm 'mesos-agent-executor'
I0825 16:56:14.432061  6656 http.cpp:1047] Creating default 'jwt' HTTP authenticator for realm 'mesos-agent-executor'
I0825 16:56:14.432271  6656 http.cpp:1026] Creating default 'basic' HTTP authenticator for realm 'mesos-agent-readonly'
I0825 16:56:14.432358  6656 http.cpp:1047] Creating default 'jwt' HTTP authenticator for realm 'mesos-agent-readonly'
I0825 16:56:14.432600  6656 http.cpp:1026] Creating default 'basic' HTTP authenticator for realm 'mesos-agent-readwrite'
I0825 16:56:14.432804  6656 http.cpp:1047] Creating default 'jwt' HTTP authenticator for realm 'mesos-agent-readwrite'
I0825 16:56:14.434612  6656 slave.cpp:581] Agent resources: [{"name":"cpus","scalar":{"value":2.0},"type":"SCALAR"},{"name":"mem","scalar":{"value":1024.0},"type":"SCALAR"},{"name":"disk","scalar":{"value":1024.0},"type":"SCALAR"},{"name":"ports","ranges":{"range":[{"begin":31000,"end":32000}]},"type":"RANGES"}]
I0825 16:56:14.434893  6656 slave.cpp:589] Agent attributes: [  ]
I0825 16:56:14.434911  6656 slave.cpp:598] Agent hostname: 92354c3e200c
I0825 16:56:14.435130  6659 status_update_manager.cpp:177] Pausing sending status updates
I0825 16:56:14.437319  6655 state.cpp:64] Recovering state from '/tmp/Endpoint_SlaveEndpointTest_NoAuthorizer_2_feYa7U/meta'
I0825 16:56:14.437634  6655 status_update_manager.cpp:203] Recovering status update manager
I0825 16:56:14.437881  6652 containerizer.cpp:643] Recovering containerizer
I0825 16:56:14.439564  6655 provisioner.cpp:416] Provisioner recovery complete
I0825 16:56:14.440047  6655 slave.cpp:6264] Finished recovery
I0825 16:56:14.440618  6655 slave.cpp:6446] Querying resource estimator for oversubscribable resources
I0825 16:56:14.440943  6654 slave.cpp:6460] Received oversubscribable resources {} from the resource estimator
I0825 16:56:14.443588  6651 process.cpp:3933] Handling HTTP event for process 'slave(808)' with path: '/slave(808)/containers'
I0825 16:56:14.445487  6653 http.cpp:1166] HTTP GET for /slave(808)/containers from 172.17.0.4:37452
I0825 16:56:14.445566  6653 http.cpp:957] Authorizing principal 'test-principal' to GET the '/containers' endpoint
I0825 16:56:14.448936  6660 slave.cpp:859] Agent terminating
[       OK ] Endpoint/SlaveEndpointTest.NoAuthorizer/2 (34 ms)
[----------] 9 tests from Endpoint/SlaveEndpointTest (288 ms total)

[----------] Global test environment tear-down
[==========] 1614 tests from 176 test cases ran. (287046 ms total)
[  PASSED  ] 1613 tests.
[  FAILED  ] 1 test, listed below:
[  FAILED  ] HealthCheckTest.HealthyTaskViaHTTPWithoutType

 1 FAILED TEST
  YOU HAVE 20 DISABLED TESTS

I0825 16:56:14.522627  6664 process.cpp:1072] Failed to accept socket: future discarded
make[3]: *** [CMakeFiles/check] Error 1
make[3]: Leaving directory `/mesos/build'
make[2]: *** [CMakeFiles/check.dir/all] Error 2
make[2]: Leaving directory `/mesos/build'
make[1]: *** [CMakeFiles/check.dir/rule] Error 2
make[1]: Leaving directory `/mesos/build'
make: *** [check] Error 2
+ docker rmi mesos-1503677356-14182
Untagged: mesos-1503677356-14182:latest
Deleted: sha256:bf45a1b0b5e96fd4258d50c3f29fb36e46c86f2995b53edfcdadc1e32f06c52e
Deleted: sha256:ce9936c3a1a75d530b7b81a428b65c6a7f102a19d370f5377376b3ffa898d537
Deleted: sha256:aa62ba365248ddb353d6fb02c581cc1fd306506e3b714ab092df309301cb1817
Deleted: sha256:17db589c47603728fe02013bfef61cf3b254809161fe38f25f478c0a9015542d
Deleted: sha256:4a07d4cf45436a3d466e99639763cdc72616c942bff420ddb23f6db5fb79f25b
Deleted: sha256:754b8ecd7c0b33987b9e7f57c0c63ee0a22d3fbb227c5b5eb1748b0b35ba1a3a
Deleted: sha256:d55c0b6cc8019a32c9ac56bab3f74311aa06ebdf7ea0594e51216ef3b9d7b168
Deleted: sha256:b54fa416e1aad90e9260df76dec6b785e663e2d497b371ae9f6f0f48ae80f9b7
Deleted: sha256:c00d974038218653c7e3d223016db1f67637f0dfc72234d0f39fbc6e58677d8f
Deleted: sha256:be0ea34f0634124af7fa94a28cba296b2329bf6b0915d92d93c3e4f4d5941bab
Deleted: sha256:38aad185b36922e76933412a82f5b9b1355c68b4022095e2b3428cad25c5dee6
Deleted: sha256:6785d58b3aa7345bc410d741e81d3045323f7f1493923d5d8d5bd03449cf5f8d
Deleted: sha256:6c3aa59c1dc35ccabf8405c3c4c1222fb377a84c1c86082a7ee2b0fc5c8a5c28
Deleted: sha256:0cd7d916dc6b2ea27e56d82183ef841415e181dead823249302dbeaca186534f
Deleted: sha256:c48b568ed2b9b2efd8d65bf3238e6b730f6bdc10175057d3b1dbebcaeaea9e9b
Deleted: sha256:52d12ce1b585d46987507bedb22049ed216452399be8a8d93397777d00ab4291
Deleted: sha256:2ad1fd7a2b0c202d1178d568e4f7cd86cc47846cad04fe5b4c403afb0e85d19a
Deleted: sha256:3ce782eeb4f0db6a1016b0b3ec8e40397d4051febd7f485078f6e8ddd695a425
Deleted: sha256:7b48949024e65c631dc34b30ddac04cfadc46c9872ae518cf1dd4ed17285ff54
Deleted: sha256:a4d6582cde08ae82a41281fc11447066f84f46f78809816cdf79667ae54c4522
Deleted: sha256:2648dade50a6664225a1beae2b915dccbfc822f3b9d45b025aa08e3dbc4a1297
Deleted: sha256:f36c44c8a2e22edc859add66818262a91d2ac3c8f78e897ff94bf0af9d402243
Deleted: sha256:091900e8d9c226c0006004159fb149817288e4764b32cbe2f6112cedd453ae86
Deleted: sha256:c6d1da35ebf1829e5d6c88724e8d53ddc8d1c85d32da1ef93de9b5f91d278a87
Deleted: sha256:85bc01c2d4554fc9a2657db01500c217d6efe150636583ade602b7847830532c
Build step 'Execute shell' marked build as failure

Jenkins build is back to normal : Mesos-Buildbot » cmake,gcc,--verbose --enable-libevent --enable-ssl,GLOG_v=1 MESOS_VERBOSE=1,centos:7,(ubuntu)&&(!ubuntu-us1)&&(!ubuntu-eu2) #4158

Posted by Apache Jenkins Server <je...@builds.apache.org>.
See <https://builds.apache.org/job/Mesos-Buildbot/BUILDTOOL=cmake,COMPILER=gcc,CONFIGURATION=--verbose%20--enable-libevent%20--enable-ssl,ENVIRONMENT=GLOG_v=1%20MESOS_VERBOSE=1,OS=centos%3A7,label_exp=(ubuntu)&&(!ubuntu-us1)&&(!ubuntu-eu2)/4158/display/redirect?page=changes>