You are viewing a plain text version of this content. The canonical link for it is here.
Posted to issues@maven.apache.org by "Lukas Theussl (JIRA)" <ji...@codehaus.org> on 2006/11/07 14:52:31 UTC
[jira] Created: (MAVEN-1816) Confusing console output on test
failures
Confusing console output on test failures
-----------------------------------------
Key: MAVEN-1816
URL: http://jira.codehaus.org/browse/MAVEN-1816
Project: Maven 1.x
Issue Type: Bug
Affects Versions: 1.1-rc1
Reporter: Lukas Theussl
Fix For: 1.1-rc1
This is a consequence of the fix for MAVEN-1482: a simple test failure now leads to the following console output:
=====
BUILD FAILED
Errors stack :
>> Unable to obtain goal [test:test]
>> File...... file:/home/lukas/.maven/cache/maven-test-plugin-1.8.1-SNAPSHOT/plugin.jelly
>> Element... junit
>> Line...... 155
>> Column.... 49
>> Tests failed
You have encountered an unknown error running Maven.
Please help us to correct this problem by following these simple steps:
- read the Maven FAQ at http://maven.apache.org/maven-1.x/faq.html
- run the same command again with the '-e' parameter, eg 'maven -e jar'
- search the maven-user archives for the error at http://www.mail-archive.com/users@maven.apache.org
- post the output of maven -e to JIRA at http://jira.codehaus.org/browse/MAVEN (you must sign up first)
- run 'maven --info' and post the output as the environment to the bug above
=====
Especially the part 'You have encountered an unknown error...' is not appropriate here.
--
This message is automatically generated by JIRA.
-
If you think it was sent incorrectly contact one of the administrators: http://jira.codehaus.org/secure/Administrators.jspa
-
For more information on JIRA, see: http://www.atlassian.com/software/jira
[jira] Commented: (MAVEN-1816) Confusing console output on test
failures
Posted by "Arnaud Heritier (JIRA)" <ji...@codehaus.org>.
[ http://jira.codehaus.org/browse/MAVEN-1816?page=comments#action_79494 ]
Arnaud Heritier commented on MAVEN-1816:
----------------------------------------
that's right ;-)
I'll improve it.
I certainly made an error in the choice to display or not this error message ;-)
> Confusing console output on test failures
> -----------------------------------------
>
> Key: MAVEN-1816
> URL: http://jira.codehaus.org/browse/MAVEN-1816
> Project: Maven 1.x
> Issue Type: Bug
> Affects Versions: 1.1-rc1
> Reporter: Lukas Theussl
> Fix For: 1.1-rc1
>
>
> This is a consequence of the fix for MAVEN-1482: a simple test failure now leads to the following console output:
> =====
> BUILD FAILED
> Errors stack :
> >> Unable to obtain goal [test:test]
> >> File...... file:/home/lukas/.maven/cache/maven-test-plugin-1.8.1-SNAPSHOT/plugin.jelly
> >> Element... junit
> >> Line...... 155
> >> Column.... 49
> >> Tests failed
> You have encountered an unknown error running Maven.
> Please help us to correct this problem by following these simple steps:
> - read the Maven FAQ at http://maven.apache.org/maven-1.x/faq.html
> - run the same command again with the '-e' parameter, eg 'maven -e jar'
> - search the maven-user archives for the error at http://www.mail-archive.com/users@maven.apache.org
> - post the output of maven -e to JIRA at http://jira.codehaus.org/browse/MAVEN (you must sign up first)
> - run 'maven --info' and post the output as the environment to the bug above
> =====
> Especially the part 'You have encountered an unknown error...' is not appropriate here.
--
This message is automatically generated by JIRA.
-
If you think it was sent incorrectly contact one of the administrators: http://jira.codehaus.org/secure/Administrators.jspa
-
For more information on JIRA, see: http://www.atlassian.com/software/jira
[jira] Closed: (MAVEN-1816) Confusing console output on test
failures
Posted by "Lukas Theussl (JIRA)" <ji...@codehaus.org>.
[ http://jira.codehaus.org/browse/MAVEN-1816?page=com.atlassian.jira.plugin.system.issuetabpanels:all-tabpanel ]
Lukas Theussl closed MAVEN-1816.
--------------------------------
Assignee: Lukas Theussl
Resolution: Fixed
> Confusing console output on test failures
> -----------------------------------------
>
> Key: MAVEN-1816
> URL: http://jira.codehaus.org/browse/MAVEN-1816
> Project: Maven 1.x
> Issue Type: Bug
> Affects Versions: 1.1-rc1
> Reporter: Lukas Theussl
> Assigned To: Lukas Theussl
> Fix For: 1.1-rc1
>
>
> This is a consequence of the fix for MAVEN-1482: a simple test failure now leads to the following console output:
> =====
> BUILD FAILED
> Errors stack :
> >> Unable to obtain goal [test:test]
> >> File...... file:/home/lukas/.maven/cache/maven-test-plugin-1.8.1-SNAPSHOT/plugin.jelly
> >> Element... junit
> >> Line...... 155
> >> Column.... 49
> >> Tests failed
> You have encountered an unknown error running Maven.
> Please help us to correct this problem by following these simple steps:
> - read the Maven FAQ at http://maven.apache.org/maven-1.x/faq.html
> - run the same command again with the '-e' parameter, eg 'maven -e jar'
> - search the maven-user archives for the error at http://www.mail-archive.com/users@maven.apache.org
> - post the output of maven -e to JIRA at http://jira.codehaus.org/browse/MAVEN (you must sign up first)
> - run 'maven --info' and post the output as the environment to the bug above
> =====
> Especially the part 'You have encountered an unknown error...' is not appropriate here.
--
This message is automatically generated by JIRA.
-
If you think it was sent incorrectly contact one of the administrators: http://jira.codehaus.org/secure/Administrators.jspa
-
For more information on JIRA, see: http://www.atlassian.com/software/jira