You are viewing a plain text version of this content. The canonical link for it is here.
Posted to server-dev@james.apache.org by Apache Hudson Server <hu...@hudson.apache.org> on 2011/03/06 20:06:23 UTC
Build failed in Jenkins: mailbox-integration-tests » Apache James Mailbox Integration Tester #150
See <https://hudson.apache.org/hudson/job/mailbox-integration-tests/org.apache.james$apache-james-mailbox-integration-tester/150/>
------------------------------------------
[...truncated 47 lines...]
Downloading: http://download.java.net/maven/2/org/apache/james/apache-james-mailbox-jcr/0.2-M2-SNAPSHOT/maven-metadata.xml
Downloading: http://repository.apache.org/snapshots/org/apache/james/apache-james-mailbox-jcr/0.2-M2-SNAPSHOT/maven-metadata.xml
Downloaded: http://repository.apache.org/snapshots/org/apache/james/apache-james-mailbox-jcr/0.2-M2-SNAPSHOT/maven-metadata.xml (1014 B at 10.1 KB/sec)
Downloading: http://download.java.net/maven/2/org/apache/james/apache-james-mailbox-jcr/0.2-M2-SNAPSHOT/apache-james-mailbox-jcr-0.2-M2-20110306.155207-174.pom
Downloading: http://repository.apache.org/snapshots/org/apache/james/apache-james-mailbox-jcr/0.2-M2-SNAPSHOT/apache-james-mailbox-jcr-0.2-M2-20110306.155207-174.pom
Downloaded: http://repository.apache.org/snapshots/org/apache/james/apache-james-mailbox-jcr/0.2-M2-SNAPSHOT/apache-james-mailbox-jcr-0.2-M2-20110306.155207-174.pom (4 KB at 39.0 KB/sec)
Downloading: http://download.java.net/maven/2/org/apache/james/apache-james-mailbox-store/0.2-M2-SNAPSHOT/maven-metadata.xml
Downloading: http://repository.apache.org/snapshots/org/apache/james/apache-james-mailbox-store/0.2-M2-SNAPSHOT/maven-metadata.xml
Downloaded: http://repository.apache.org/snapshots/org/apache/james/apache-james-mailbox-store/0.2-M2-SNAPSHOT/maven-metadata.xml (1016 B at 11.0 KB/sec)
Downloading: http://download.java.net/maven/2/org/apache/james/apache-james-mailbox-jpa/0.2-M2-SNAPSHOT/maven-metadata.xml
Downloading: http://repository.apache.org/snapshots/org/apache/james/apache-james-mailbox-jpa/0.2-M2-SNAPSHOT/maven-metadata.xml
Downloaded: http://repository.apache.org/snapshots/org/apache/james/apache-james-mailbox-jpa/0.2-M2-SNAPSHOT/maven-metadata.xml (1014 B at 10.6 KB/sec)
Downloading: http://download.java.net/maven/2/org/apache/james/apache-james-mailbox-jpa/0.2-M2-SNAPSHOT/apache-james-mailbox-jpa-0.2-M2-20110306.155005-202.pom
Downloading: http://repository.apache.org/snapshots/org/apache/james/apache-james-mailbox-jpa/0.2-M2-SNAPSHOT/apache-james-mailbox-jpa-0.2-M2-20110306.155005-202.pom
Downloaded: http://repository.apache.org/snapshots/org/apache/james/apache-james-mailbox-jpa/0.2-M2-SNAPSHOT/apache-james-mailbox-jpa-0.2-M2-20110306.155005-202.pom (5 KB at 47.9 KB/sec)
Downloading: http://repository.apache.org/snapshots/org/apache/james/apache-james-mailbox-maildir/0.2-M2-SNAPSHOT/maven-metadata.xml
Downloading: http://download.java.net/maven/2/org/apache/james/apache-james-mailbox-maildir/0.2-M2-SNAPSHOT/maven-metadata.xml
Downloaded: http://repository.apache.org/snapshots/org/apache/james/apache-james-mailbox-maildir/0.2-M2-SNAPSHOT/maven-metadata.xml (1018 B at 10.0 KB/sec)
Downloading: http://download.java.net/maven/2/org/apache/james/apache-james-mailbox-maildir/0.2-M2-SNAPSHOT/apache-james-mailbox-maildir-0.2-M2-20110306.155355-159.pom
Downloading: http://repository.apache.org/snapshots/org/apache/james/apache-james-mailbox-maildir/0.2-M2-SNAPSHOT/apache-james-mailbox-maildir-0.2-M2-20110306.155355-159.pom
Downloaded: http://repository.apache.org/snapshots/org/apache/james/apache-james-mailbox-maildir/0.2-M2-SNAPSHOT/apache-james-mailbox-maildir-0.2-M2-20110306.155355-159.pom (4 KB at 36.3 KB/sec)
Downloading: http://download.java.net/maven/2/org/apache/james/apache-james-mailbox-memory/0.2-M2-SNAPSHOT/maven-metadata.xml
Downloading: http://repository.apache.org/snapshots/org/apache/james/apache-james-mailbox-memory/0.2-M2-SNAPSHOT/maven-metadata.xml
Downloaded: http://repository.apache.org/snapshots/org/apache/james/apache-james-mailbox-memory/0.2-M2-SNAPSHOT/maven-metadata.xml (1017 B at 11.4 KB/sec)
Downloading: http://download.java.net/maven/2/org/apache/james/apache-james-mailbox-memory/0.2-M2-SNAPSHOT/apache-james-mailbox-memory-0.2-M2-20110306.154854-205.pom
Downloading: http://repository.apache.org/snapshots/org/apache/james/apache-james-mailbox-memory/0.2-M2-SNAPSHOT/apache-james-mailbox-memory-0.2-M2-20110306.154854-205.pom
Downloaded: http://repository.apache.org/snapshots/org/apache/james/apache-james-mailbox-memory/0.2-M2-SNAPSHOT/apache-james-mailbox-memory-0.2-M2-20110306.154854-205.pom (3 KB at 25.5 KB/sec)
Downloading: http://repository.apache.org/snapshots/org/apache/james/apache-james-imap-api/0.2-M2-SNAPSHOT/apache-james-imap-api-0.2-M2-20110306.160014-286.jar
Downloading: http://repository.apache.org/snapshots/org/apache/james/apache-james-mailbox-api/0.2-M2-SNAPSHOT/apache-james-mailbox-api-0.2-M2-20110306.154648-227.jar
Downloading: http://repository.apache.org/snapshots/org/apache/james/apache-james-imap-message/0.2-M2-SNAPSHOT/apache-james-imap-message-0.2-M2-20110306.160104-281.jar
Downloading: http://repository.apache.org/snapshots/org/apache/james/apache-james-mailbox-store/0.2-M2-SNAPSHOT/apache-james-mailbox-store-0.2-M2-20110306.154754-226-tests.jar
Downloading: http://repository.apache.org/snapshots/org/apache/james/apache-james-imap-processor/0.2-M2-SNAPSHOT/apache-james-imap-processor-0.2-M2-20110306.160204-278.jar
Downloaded: http://repository.apache.org/snapshots/org/apache/james/apache-james-imap-api/0.2-M2-SNAPSHOT/apache-james-imap-api-0.2-M2-20110306.160014-286.jar (41 KB at 250.7 KB/sec)
Downloading: http://repository.apache.org/snapshots/org/apache/james/apache-james-mailbox-jcr/0.2-M2-SNAPSHOT/apache-james-mailbox-jcr-0.2-M2-20110306.155207-174.jar
Downloaded: http://repository.apache.org/snapshots/org/apache/james/apache-james-mailbox-store/0.2-M2-SNAPSHOT/apache-james-mailbox-store-0.2-M2-20110306.154754-226-tests.jar (38 KB at 167.0 KB/sec)
Downloading: http://repository.apache.org/snapshots/org/apache/james/apache-james-mailbox-store/0.2-M2-SNAPSHOT/apache-james-mailbox-store-0.2-M2-20110306.154754-226.jar
Downloaded: http://repository.apache.org/snapshots/org/apache/james/apache-james-mailbox-api/0.2-M2-SNAPSHOT/apache-james-mailbox-api-0.2-M2-20110306.154648-227.jar (78 KB at 297.2 KB/sec)
Downloading: http://repository.apache.org/snapshots/org/apache/james/apache-james-mailbox-jpa/0.2-M2-SNAPSHOT/apache-james-mailbox-jpa-0.2-M2-20110306.155005-202.jar
Downloaded: http://repository.apache.org/snapshots/org/apache/james/apache-james-imap-processor/0.2-M2-SNAPSHOT/apache-james-imap-processor-0.2-M2-20110306.160204-278.jar (117 KB at 399.3 KB/sec)
Downloading: http://repository.apache.org/snapshots/org/apache/james/apache-james-mailbox-maildir/0.2-M2-SNAPSHOT/apache-james-mailbox-maildir-0.2-M2-20110306.155355-159.jar
Downloaded: http://repository.apache.org/snapshots/org/apache/james/apache-james-mailbox-jcr/0.2-M2-SNAPSHOT/apache-james-mailbox-jcr-0.2-M2-20110306.155207-174.jar (57 KB at 381.6 KB/sec)
Downloading: http://repository.apache.org/snapshots/org/apache/james/apache-james-mailbox-memory/0.2-M2-SNAPSHOT/apache-james-mailbox-memory-0.2-M2-20110306.154854-205.jar
Downloaded: http://repository.apache.org/snapshots/org/apache/james/apache-james-imap-message/0.2-M2-SNAPSHOT/apache-james-imap-message-0.2-M2-20110306.160104-281.jar (160 KB at 492.8 KB/sec)
Downloaded: http://repository.apache.org/snapshots/org/apache/james/apache-james-mailbox-jpa/0.2-M2-SNAPSHOT/apache-james-mailbox-jpa-0.2-M2-20110306.155005-202.jar (74 KB at 613.7 KB/sec)
Downloaded: http://repository.apache.org/snapshots/org/apache/james/apache-james-mailbox-maildir/0.2-M2-SNAPSHOT/apache-james-mailbox-maildir-0.2-M2-20110306.155355-159.jar (64 KB at 530.0 KB/sec)
Downloaded: http://repository.apache.org/snapshots/org/apache/james/apache-james-mailbox-memory/0.2-M2-SNAPSHOT/apache-james-mailbox-memory-0.2-M2-20110306.154854-205.jar (31 KB at 251.4 KB/sec)
Downloaded: http://repository.apache.org/snapshots/org/apache/james/apache-james-mailbox-store/0.2-M2-SNAPSHOT/apache-james-mailbox-store-0.2-M2-20110306.154754-226.jar (124 KB at 538.2 KB/sec)
[INFO]
[INFO] --- maven-clean-plugin:2.3:clean (default-clean) @ apache-james-mailbox-integration-tester ---
[INFO] Deleting file set: <https://hudson.apache.org/hudson/job/mailbox-integration-tests/org.apache.james$apache-james-mailbox-integration-tester/ws/target> (included: [**], excluded: [])
[INFO]
[INFO] --- maven-remote-resources-plugin:1.1:process (default) @ apache-james-mailbox-integration-tester ---
[INFO] Setting property: classpath.resource.loader.class => 'org.codehaus.plexus.velocity.ContextClassLoaderResourceLoader'.
[INFO] Setting property: velocimacro.messages.on => 'false'.
[INFO] Setting property: resource.loader => 'classpath'.
[INFO] Setting property: resource.manager.logwhenfound => 'false'.
Downloading: http://repository.apache.org/snapshots/org/apache/james/apache-james-mailbox-api/0.2-M2-SNAPSHOT/maven-metadata.xml
Downloading: http://download.java.net/maven/2/org/apache/james/apache-james-mailbox-api/0.2-M2-SNAPSHOT/maven-metadata.xml
Downloaded: http://repository.apache.org/snapshots/org/apache/james/apache-james-mailbox-api/0.2-M2-SNAPSHOT/maven-metadata.xml (1014 B at 11.0 KB/sec)
Downloading: http://repository.apache.org/snapshots/org/apache/james/apache-james-imap-api/0.2-M2-SNAPSHOT/maven-metadata.xml
Downloading: http://download.java.net/maven/2/org/apache/james/apache-james-imap-api/0.2-M2-SNAPSHOT/maven-metadata.xml
Downloaded: http://repository.apache.org/snapshots/org/apache/james/apache-james-imap-api/0.2-M2-SNAPSHOT/maven-metadata.xml (1011 B at 11.1 KB/sec)
Downloading: http://download.java.net/maven/2/org/apache/james/apache-james-imap-message/0.2-M2-SNAPSHOT/maven-metadata.xml
Downloading: http://repository.apache.org/snapshots/org/apache/james/apache-james-imap-message/0.2-M2-SNAPSHOT/maven-metadata.xml
Downloaded: http://repository.apache.org/snapshots/org/apache/james/apache-james-imap-message/0.2-M2-SNAPSHOT/maven-metadata.xml (1015 B at 11.1 KB/sec)
Downloading: http://download.java.net/maven/2/org/apache/james/apache-james-mailbox-store/0.2-M2-SNAPSHOT/maven-metadata.xml
Downloading: http://repository.apache.org/snapshots/org/apache/james/apache-james-mailbox-store/0.2-M2-SNAPSHOT/maven-metadata.xml
Downloaded: http://repository.apache.org/snapshots/org/apache/james/apache-james-mailbox-store/0.2-M2-SNAPSHOT/maven-metadata.xml (1016 B at 11.0 KB/sec)
Downloading: http://download.java.net/maven/2/org/apache/james/apache-james-imap-processor/0.2-M2-SNAPSHOT/maven-metadata.xml
Downloading: http://repository.apache.org/snapshots/org/apache/james/apache-james-imap-processor/0.2-M2-SNAPSHOT/maven-metadata.xml
Downloaded: http://repository.apache.org/snapshots/org/apache/james/apache-james-imap-processor/0.2-M2-SNAPSHOT/maven-metadata.xml (1017 B at 11.2 KB/sec)
[INFO]
[INFO] --- maven-resources-plugin:2.4:resources (default-resources) @ apache-james-mailbox-integration-tester ---
[INFO] Using 'UTF-8' encoding to copy filtered resources.
[INFO] Copying 113 resources
[INFO] Copying 3 resources
[INFO]
[INFO] --- maven-compiler-plugin:2.3.2:compile (default-compile) @ apache-james-mailbox-integration-tester ---
[INFO] Compiling 39 source files to <https://hudson.apache.org/hudson/job/mailbox-integration-tests/org.apache.james$apache-james-mailbox-integration-tester/ws/target/classes>
[INFO]
[INFO] --- maven-bundle-plugin:2.3.4:manifest (bundle-manifest) @ apache-james-mailbox-integration-tester ---
[WARNING] Embed-Dependency: clause "*;scope=runtime" did not match any dependencies
[INFO] Using 'UTF-8' encoding to copy filtered resources.
[INFO] [INFO] Copying 4 resources
[INFO] Copying 3 resources
[INFO] --- maven-resources-plugin:2.4:testResources (default-testResources) @ apache-james-mailbox-integration-tester ---
[INFO]
[INFO] --- maven-compiler-plugin:2.3.2:testCompile (default-testCompile) @ apache-james-mailbox-integration-tester ---
[INFO] Compiling 76 source files to <https://hudson.apache.org/hudson/job/mailbox-integration-tests/org.apache.james$apache-james-mailbox-integration-tester/ws/target/test-classes>
[INFO]
[INFO] --- maven-surefire-plugin:2.7.2:test (default-test) @ apache-james-mailbox-integration-tester ---
[INFO] Surefire report directory: <https://hudson.apache.org/hudson/job/mailbox-integration-tests/org.apache.james$apache-james-mailbox-integration-tester/ws/target/surefire-reports>
-------------------------------------------------------
T E S T S
-------------------------------------------------------
Running org.apache.james.mailbox.jcr.imap.SearchTest
Tests run: 6, Failures: 0, Errors: 0, Skipped: 0, Time elapsed: 20.795 sec
Running org.apache.james.mailbox.jcr.imap.ListingTest
Tests run: 6, Failures: 0, Errors: 0, Skipped: 0, Time elapsed: 7.747 sec
Running org.apache.james.mailbox.jcr.imap.UidSearchTest
Tests run: 6, Failures: 0, Errors: 0, Skipped: 0, Time elapsed: 26.862 sec
Running org.apache.james.mailbox.jcr.imap.SecurityTest
Tests run: 21, Failures: 0, Errors: 0, Skipped: 0, Time elapsed: 10.54 sec
Running org.apache.james.mailbox.jcr.imap.RenameTest
Tests run: 9, Failures: 0, Errors: 0, Skipped: 0, Time elapsed: 21.24 sec
Running org.apache.james.mailbox.jcr.imap.FetchBodySectionTest
Tests run: 9, Failures: 0, Errors: 0, Skipped: 0, Time elapsed: 12.355 sec
Running org.apache.james.mailbox.jcr.imap.AuthenticatedStateTest
Tests run: 57, Failures: 0, Errors: 0, Skipped: 0, Time elapsed: 22.963 sec
Running org.apache.james.mailbox.jcr.imap.SelectedStateTest
Tests run: 30, Failures: 0, Errors: 0, Skipped: 0, Time elapsed: 21.64 sec
Running org.apache.james.mailbox.jcr.imap.ConcurrentSessionsTest
Tests run: 21, Failures: 0, Errors: 3, Skipped: 0, Time elapsed: 14.857 sec <<< FAILURE!
Running org.apache.james.mailbox.jcr.imap.ExpungeTest
Tests run: 3, Failures: 0, Errors: 0, Skipped: 0, Time elapsed: 10.121 sec
Running org.apache.james.mailbox.jcr.imap.SelectedInboxTest
Tests run: 42, Failures: 0, Errors: 0, Skipped: 0, Time elapsed: 19.376 sec
Running org.apache.james.mailbox.jcr.imap.SelectTest
Tests run: 3, Failures: 0, Errors: 0, Skipped: 0, Time elapsed: 6.492 sec
Running org.apache.james.mailbox.jcr.imap.NonAuthenticatedStateTest
Tests run: 21, Failures: 0, Errors: 0, Skipped: 0, Time elapsed: 9.617 sec
Running org.apache.james.mailbox.jcr.imap.FetchTest
Tests run: 24, Failures: 0, Errors: 0, Skipped: 0, Time elapsed: 20.476 sec
Running org.apache.james.mailbox.jcr.imap.FetchBodyStructureTest
Tests run: 12, Failures: 0, Errors: 0, Skipped: 0, Time elapsed: 17.49 sec
Running org.apache.james.mailbox.jcr.imap.FetchHeadersTest
Tests run: 6, Failures: 0, Errors: 0, Skipped: 0, Time elapsed: 12.805 sec
Running org.apache.james.mailbox.jcr.imap.EventTest
Tests run: 3, Failures: 0, Errors: 0, Skipped: 0, Time elapsed: 7.584 sec
Running org.apache.james.mailbox.jcr.imap.PartialFetchTest
Tests run: 12, Failures: 0, Errors: 0, Skipped: 0, Time elapsed: 14.092 sec
Running org.apache.james.mailbox.jpa.imap.SearchTest
Tests run: 6, Failures: 0, Errors: 0, Skipped: 0, Time elapsed: 11.815 sec
Running org.apache.james.mailbox.jpa.imap.ListingTest
Tests run: 6, Failures: 0, Errors: 0, Skipped: 0, Time elapsed: 2.723 sec
Running org.apache.james.mailbox.jpa.imap.UidSearchTest
Tests run: 6, Failures: 0, Errors: 0, Skipped: 0, Time elapsed: 12.905 sec
Running org.apache.james.mailbox.jpa.imap.SecurityTest
Tests run: 21, Failures: 0, Errors: 0, Skipped: 0, Time elapsed: 1.928 sec
Running org.apache.james.mailbox.jpa.imap.RenameTest
Tests run: 9, Failures: 0, Errors: 0, Skipped: 0, Time elapsed: 6.964 sec
Running org.apache.james.mailbox.jpa.imap.FetchBodySectionTest
Tests run: 9, Failures: 0, Errors: 0, Skipped: 0, Time elapsed: 4.376 sec
Running org.apache.james.mailbox.jpa.imap.AuthenticatedStateTest
Tests run: 57, Failures: 0, Errors: 0, Skipped: 0, Time elapsed: 5.143 sec
Running org.apache.james.mailbox.jpa.imap.SelectedStateTest
Tests run: 30, Failures: 0, Errors: 0, Skipped: 0, Time elapsed: 6.085 sec
Running org.apache.james.mailbox.jpa.imap.ConcurrentSessionsTest
Tests run: 21, Failures: 0, Errors: 3, Skipped: 0, Time elapsed: 4.673 sec <<< FAILURE!
Running org.apache.james.mailbox.jpa.imap.ExpungeTest
Tests run: 3, Failures: 0, Errors: 0, Skipped: 0, Time elapsed: 3.767 sec
Running org.apache.james.mailbox.jpa.imap.SelectedInboxTest
Tests run: 42, Failures: 0, Errors: 0, Skipped: 0, Time elapsed: 4.356 sec
Running org.apache.james.mailbox.jpa.imap.SelectTest
Tests run: 3, Failures: 0, Errors: 0, Skipped: 0, Time elapsed: 2.683 sec
Running org.apache.james.mailbox.jpa.imap.NonAuthenticatedStateTest
Tests run: 21, Failures: 0, Errors: 0, Skipped: 0, Time elapsed: 2.06 sec
Running org.apache.james.mailbox.jpa.imap.FetchTest
Tests run: 24, Failures: 0, Errors: 0, Skipped: 0, Time elapsed: 5.87 sec
Running org.apache.james.mailbox.jpa.imap.FetchBodyStructureTest
Tests run: 12, Failures: 0, Errors: 0, Skipped: 0, Time elapsed: 7.641 sec
Running org.apache.james.mailbox.jpa.imap.FetchHeadersTest
Tests run: 6, Failures: 0, Errors: 0, Skipped: 0, Time elapsed: 4.617 sec
Running org.apache.james.mailbox.jpa.imap.EventTest
Tests run: 3, Failures: 0, Errors: 0, Skipped: 0, Time elapsed: 2.957 sec
Running org.apache.james.mailbox.jpa.imap.PartialFetchTest
Tests run: 12, Failures: 0, Errors: 0, Skipped: 0, Time elapsed: 5.21 sec
Running org.apache.james.mailbox.maildir.imap.ListingTest
Tests run: 6, Failures: 0, Errors: 0, Skipped: 0, Time elapsed: 0.592 sec
Running org.apache.james.mailbox.maildir.imap.UidSearchTest
Tests run: 6, Failures: 0, Errors: 0, Skipped: 0, Time elapsed: 3.533 sec
Running org.apache.james.mailbox.maildir.imap.SecurityTest
Tests run: 21, Failures: 0, Errors: 0, Skipped: 0, Time elapsed: 0.33 sec
Running org.apache.james.mailbox.maildir.imap.RenameTest
Tests run: 9, Failures: 0, Errors: 0, Skipped: 0, Time elapsed: 1.962 sec
Running org.apache.james.mailbox.maildir.imap.FetchBodySectionTest
Tests run: 9, Failures: 0, Errors: 0, Skipped: 0, Time elapsed: 1.107 sec
Running org.apache.james.mailbox.maildir.imap.AuthenticatedStateTest
Tests run: 57, Failures: 0, Errors: 0, Skipped: 0, Time elapsed: 1.256 sec
Running org.apache.james.mailbox.maildir.imap.SelectedStateTest
Tests run: 30, Failures: 0, Errors: 0, Skipped: 0, Time elapsed: 1.604 sec
Running org.apache.james.mailbox.maildir.imap.ConcurrentSessionsTest
Tests run: 21, Failures: 0, Errors: 0, Skipped: 0, Time elapsed: 1.172 sec
Running org.apache.james.mailbox.maildir.imap.ExpungeTest
Tests run: 3, Failures: 0, Errors: 0, Skipped: 0, Time elapsed: 0.875 sec
Running org.apache.james.mailbox.maildir.imap.SelectedInboxTest
Tests run: 42, Failures: 0, Errors: 0, Skipped: 0, Time elapsed: 1.214 sec
Running org.apache.james.mailbox.maildir.imap.SelectTest
Tests run: 3, Failures: 0, Errors: 0, Skipped: 0, Time elapsed: 0.725 sec
Running org.apache.james.mailbox.maildir.imap.NonAuthenticatedStateTest
Tests run: 21, Failures: 0, Errors: 0, Skipped: 0, Time elapsed: 0.392 sec
Running org.apache.james.mailbox.maildir.imap.FetchTest
Tests run: 24, Failures: 0, Errors: 0, Skipped: 0, Time elapsed: 1.501 sec
Running org.apache.james.mailbox.maildir.imap.FetchBodyStructureTest
Tests run: 12, Failures: 0, Errors: 0, Skipped: 0, Time elapsed: 2.195 sec
Running org.apache.james.mailbox.maildir.imap.FetchHeadersTest
Tests run: 6, Failures: 0, Errors: 0, Skipped: 0, Time elapsed: 1.129 sec
Running org.apache.james.mailbox.maildir.imap.EventTest
Tests run: 3, Failures: 0, Errors: 0, Skipped: 0, Time elapsed: 0.713 sec
Running org.apache.james.mailbox.maildir.imap.PartialFetchTest
Tests run: 12, Failures: 0, Errors: 0, Skipped: 0, Time elapsed: 1.403 sec
Running org.apache.james.mailbox.inmemory.imap.SearchTest
Tests run: 6, Failures: 0, Errors: 0, Skipped: 0, Time elapsed: 1.867 sec
Running org.apache.james.mailbox.inmemory.imap.ListingTest
Tests run: 6, Failures: 0, Errors: 0, Skipped: 0, Time elapsed: 0.381 sec
Running org.apache.james.mailbox.inmemory.imap.UidSearchTest
Tests run: 6, Failures: 0, Errors: 0, Skipped: 0, Time elapsed: 1.987 sec
Running org.apache.james.mailbox.inmemory.imap.SecurityTest
Tests run: 21, Failures: 0, Errors: 0, Skipped: 0, Time elapsed: 0.321 sec
Running org.apache.james.mailbox.inmemory.imap.RenameTest
Tests run: 9, Failures: 0, Errors: 0, Skipped: 0, Time elapsed: 1.123 sec
Running org.apache.james.mailbox.inmemory.imap.FetchBodySectionTest
Tests run: 9, Failures: 0, Errors: 0, Skipped: 0, Time elapsed: 0.891 sec
Running org.apache.james.mailbox.inmemory.imap.AuthenticatedStateTest
Tests run: 57, Failures: 0, Errors: 0, Skipped: 0, Time elapsed: 0.953 sec
Running org.apache.james.mailbox.inmemory.imap.SelectedStateTest
Tests run: 30, Failures: 0, Errors: 0, Skipped: 0, Time elapsed: 1.05 sec
Running org.apache.james.mailbox.inmemory.imap.ConcurrentSessionsTest
Tests run: 21, Failures: 0, Errors: 0, Skipped: 0, Time elapsed: 0.815 sec
Running org.apache.james.mailbox.inmemory.imap.ExpungeTest
Tests run: 3, Failures: 0, Errors: 0, Skipped: 0, Time elapsed: 0.674 sec
Running org.apache.james.mailbox.inmemory.imap.SelectedInboxTest
Tests run: 42, Failures: 0, Errors: 0, Skipped: 0, Time elapsed: 0.934 sec
Running org.apache.james.mailbox.inmemory.imap.SelectTest
Tests run: 3, Failures: 0, Errors: 0, Skipped: 0, Time elapsed: 0.633 sec
Running org.apache.james.mailbox.inmemory.imap.NonAuthenticatedStateTest
Tests run: 21, Failures: 0, Errors: 0, Skipped: 0, Time elapsed: 0.357 sec
Running org.apache.james.mailbox.inmemory.imap.FetchTest
Tests run: 24, Failures: 0, Errors: 0, Skipped: 0, Time elapsed: 1.13 sec
Running org.apache.james.mailbox.inmemory.imap.FetchBodyStructureTest
Tests run: 12, Failures: 0, Errors: 0, Skipped: 0, Time elapsed: 1.616 sec
Running org.apache.james.mailbox.inmemory.imap.FetchHeadersTest
Tests run: 6, Failures: 0, Errors: 0, Skipped: 0, Time elapsed: 0.789 sec
Running org.apache.james.mailbox.inmemory.imap.EventTest
Tests run: 3, Failures: 0, Errors: 0, Skipped: 0, Time elapsed: 0.604 sec
Running org.apache.james.mailbox.inmemory.imap.PartialFetchTest
Tests run: 12, Failures: 0, Errors: 0, Skipped: 0, Time elapsed: 1.008 sec
Results :
Tests in error:
Tests run: 1158, Failures: 0, Errors: 6, Skipped: 0
mojoFailed org.apache.maven.plugins:maven-surefire-plugin:2.7.2(default-test)
[JENKINS] Recording test results
projectFailed org.apache.james:apache-james-mailbox-integration-tester:0.2-M2-SNAPSHOT
---------------------------------------------------------------------
To unsubscribe, e-mail: server-dev-unsubscribe@james.apache.org
For additional commands, e-mail: server-dev-help@james.apache.org
Build failed in Jenkins: mailbox-integration-tests » Apache James Mailbox Integration Tester #154
Posted by Apache Hudson Server <hu...@hudson.apache.org>.
See <https://hudson.apache.org/hudson/job/mailbox-integration-tests/org.apache.james$apache-james-mailbox-integration-tester/154/>
------------------------------------------
[...truncated 45 lines...]
Downloading: http://download.java.net/maven/2/org/apache/james/apache-james-mailbox-jcr/0.2-M2-SNAPSHOT/maven-metadata.xml
Downloading: http://repository.apache.org/snapshots/org/apache/james/apache-james-mailbox-jcr/0.2-M2-SNAPSHOT/maven-metadata.xml
Downloaded: http://repository.apache.org/snapshots/org/apache/james/apache-james-mailbox-jcr/0.2-M2-SNAPSHOT/maven-metadata.xml (1014 B at 11.5 KB/sec)
Downloading: http://download.java.net/maven/2/org/apache/james/apache-james-mailbox-jcr/0.2-M2-SNAPSHOT/apache-james-mailbox-jcr-0.2-M2-20110307.102524-177.pom
Downloading: http://repository.apache.org/snapshots/org/apache/james/apache-james-mailbox-jcr/0.2-M2-SNAPSHOT/apache-james-mailbox-jcr-0.2-M2-20110307.102524-177.pom
Downloaded: http://repository.apache.org/snapshots/org/apache/james/apache-james-mailbox-jcr/0.2-M2-SNAPSHOT/apache-james-mailbox-jcr-0.2-M2-20110307.102524-177.pom (4 KB at 40.8 KB/sec)
Downloading: http://repository.apache.org/snapshots/org/apache/james/apache-james-mailbox-store/0.2-M2-SNAPSHOT/maven-metadata.xml
Downloading: http://download.java.net/maven/2/org/apache/james/apache-james-mailbox-store/0.2-M2-SNAPSHOT/maven-metadata.xml
Downloaded: http://repository.apache.org/snapshots/org/apache/james/apache-james-mailbox-store/0.2-M2-SNAPSHOT/maven-metadata.xml (1016 B at 11.5 KB/sec)
Downloading: http://download.java.net/maven/2/org/apache/james/apache-james-mailbox-jpa/0.2-M2-SNAPSHOT/maven-metadata.xml
Downloading: http://repository.apache.org/snapshots/org/apache/james/apache-james-mailbox-jpa/0.2-M2-SNAPSHOT/maven-metadata.xml
Downloaded: http://repository.apache.org/snapshots/org/apache/james/apache-james-mailbox-jpa/0.2-M2-SNAPSHOT/maven-metadata.xml (1014 B at 10.8 KB/sec)
Downloading: http://download.java.net/maven/2/org/apache/james/apache-james-mailbox-jpa/0.2-M2-SNAPSHOT/apache-james-mailbox-jpa-0.2-M2-20110307.101642-205.pom
Downloading: http://repository.apache.org/snapshots/org/apache/james/apache-james-mailbox-jpa/0.2-M2-SNAPSHOT/apache-james-mailbox-jpa-0.2-M2-20110307.101642-205.pom
Downloaded: http://repository.apache.org/snapshots/org/apache/james/apache-james-mailbox-jpa/0.2-M2-SNAPSHOT/apache-james-mailbox-jpa-0.2-M2-20110307.101642-205.pom (5 KB at 53.3 KB/sec)
Downloading: http://download.java.net/maven/2/org/apache/james/apache-james-mailbox-maildir/0.2-M2-SNAPSHOT/maven-metadata.xml
Downloading: http://repository.apache.org/snapshots/org/apache/james/apache-james-mailbox-maildir/0.2-M2-SNAPSHOT/maven-metadata.xml
Downloaded: http://repository.apache.org/snapshots/org/apache/james/apache-james-mailbox-maildir/0.2-M2-SNAPSHOT/maven-metadata.xml (1018 B at 11.2 KB/sec)
Downloading: http://download.java.net/maven/2/org/apache/james/apache-james-mailbox-maildir/0.2-M2-SNAPSHOT/apache-james-mailbox-maildir-0.2-M2-20110307.103332-162.pom
Downloading: http://repository.apache.org/snapshots/org/apache/james/apache-james-mailbox-maildir/0.2-M2-SNAPSHOT/apache-james-mailbox-maildir-0.2-M2-20110307.103332-162.pom
Downloaded: http://repository.apache.org/snapshots/org/apache/james/apache-james-mailbox-maildir/0.2-M2-SNAPSHOT/apache-james-mailbox-maildir-0.2-M2-20110307.103332-162.pom (4 KB at 38.0 KB/sec)
Downloading: http://download.java.net/maven/2/org/apache/james/apache-james-mailbox-memory/0.2-M2-SNAPSHOT/maven-metadata.xml
Downloading: http://repository.apache.org/snapshots/org/apache/james/apache-james-mailbox-memory/0.2-M2-SNAPSHOT/maven-metadata.xml
Downloaded: http://repository.apache.org/snapshots/org/apache/james/apache-james-mailbox-memory/0.2-M2-SNAPSHOT/maven-metadata.xml (1017 B at 10.6 KB/sec)
Downloading: http://download.java.net/maven/2/org/apache/james/apache-james-mailbox-memory/0.2-M2-SNAPSHOT/apache-james-mailbox-memory-0.2-M2-20110307.100905-208.pom
Downloading: http://repository.apache.org/snapshots/org/apache/james/apache-james-mailbox-memory/0.2-M2-SNAPSHOT/apache-james-mailbox-memory-0.2-M2-20110307.100905-208.pom
Downloaded: http://repository.apache.org/snapshots/org/apache/james/apache-james-mailbox-memory/0.2-M2-SNAPSHOT/apache-james-mailbox-memory-0.2-M2-20110307.100905-208.pom (3 KB at 30.4 KB/sec)
Downloading: http://repository.apache.org/snapshots/org/apache/james/apache-james-imap-api/0.2-M2-SNAPSHOT/apache-james-imap-api-0.2-M2-20110307.105151-290.jar
Downloading: http://repository.apache.org/snapshots/org/apache/james/apache-james-mailbox-api/0.2-M2-SNAPSHOT/apache-james-mailbox-api-0.2-M2-20110307.095608-230.jar
Downloading: http://repository.apache.org/snapshots/org/apache/james/apache-james-imap-message/0.2-M2-SNAPSHOT/apache-james-imap-message-0.2-M2-20110307.105336-285.jar
Downloading: http://repository.apache.org/snapshots/org/apache/james/apache-james-imap-processor/0.2-M2-SNAPSHOT/apache-james-imap-processor-0.2-M2-20110307.105510-282.jar
Downloading: http://repository.apache.org/snapshots/org/apache/james/apache-james-mailbox-store/0.2-M2-SNAPSHOT/apache-james-mailbox-store-0.2-M2-20110307.100312-229-tests.jar
Downloaded: http://repository.apache.org/snapshots/org/apache/james/apache-james-imap-api/0.2-M2-SNAPSHOT/apache-james-imap-api-0.2-M2-20110307.105151-290.jar (41 KB at 248.5 KB/sec)
Downloading: http://repository.apache.org/snapshots/org/apache/james/apache-james-mailbox-jcr/0.2-M2-SNAPSHOT/apache-james-mailbox-jcr-0.2-M2-20110307.102524-177.jar
Downloaded: http://repository.apache.org/snapshots/org/apache/james/apache-james-mailbox-api/0.2-M2-SNAPSHOT/apache-james-mailbox-api-0.2-M2-20110307.095608-230.jar (78 KB at 300.7 KB/sec)
Downloading: http://repository.apache.org/snapshots/org/apache/james/apache-james-mailbox-store/0.2-M2-SNAPSHOT/apache-james-mailbox-store-0.2-M2-20110307.100312-229.jar
Downloaded: http://repository.apache.org/snapshots/org/apache/james/apache-james-imap-processor/0.2-M2-SNAPSHOT/apache-james-imap-processor-0.2-M2-20110307.105510-282.jar (117 KB at 394.9 KB/sec)
Downloading: http://repository.apache.org/snapshots/org/apache/james/apache-james-mailbox-jpa/0.2-M2-SNAPSHOT/apache-james-mailbox-jpa-0.2-M2-20110307.101642-205.jar
Downloaded: http://repository.apache.org/snapshots/org/apache/james/apache-james-mailbox-jcr/0.2-M2-SNAPSHOT/apache-james-mailbox-jcr-0.2-M2-20110307.102524-177.jar (57 KB at 374.1 KB/sec)
Downloading: http://repository.apache.org/snapshots/org/apache/james/apache-james-mailbox-maildir/0.2-M2-SNAPSHOT/apache-james-mailbox-maildir-0.2-M2-20110307.103332-162.jar
Downloaded: http://repository.apache.org/snapshots/org/apache/james/apache-james-imap-message/0.2-M2-SNAPSHOT/apache-james-imap-message-0.2-M2-20110307.105336-285.jar (160 KB at 497.1 KB/sec)
Downloading: http://repository.apache.org/snapshots/org/apache/james/apache-james-mailbox-memory/0.2-M2-SNAPSHOT/apache-james-mailbox-memory-0.2-M2-20110307.100905-208.jar
Downloaded: http://repository.apache.org/snapshots/org/apache/james/apache-james-mailbox-memory/0.2-M2-SNAPSHOT/apache-james-mailbox-memory-0.2-M2-20110307.100905-208.jar (31 KB at 327.1 KB/sec)
Downloaded: http://repository.apache.org/snapshots/org/apache/james/apache-james-mailbox-jpa/0.2-M2-SNAPSHOT/apache-james-mailbox-jpa-0.2-M2-20110307.101642-205.jar (74 KB at 608.7 KB/sec)
Downloaded: http://repository.apache.org/snapshots/org/apache/james/apache-james-mailbox-maildir/0.2-M2-SNAPSHOT/apache-james-mailbox-maildir-0.2-M2-20110307.103332-162.jar (64 KB at 534.5 KB/sec)
Downloaded: http://repository.apache.org/snapshots/org/apache/james/apache-james-mailbox-store/0.2-M2-SNAPSHOT/apache-james-mailbox-store-0.2-M2-20110307.100312-229.jar (124 KB at 665.5 KB/sec)
Downloaded: http://repository.apache.org/snapshots/org/apache/james/apache-james-mailbox-store/0.2-M2-SNAPSHOT/apache-james-mailbox-store-0.2-M2-20110307.100312-229-tests.jar (38 KB at 78.9 KB/sec)
[INFO]
[INFO] --- maven-clean-plugin:2.3:clean (default-clean) @ apache-james-mailbox-integration-tester ---
[INFO] Deleting file set: <https://hudson.apache.org/hudson/job/mailbox-integration-tests/org.apache.james$apache-james-mailbox-integration-tester/ws/target> (included: [**], excluded: [])
[INFO]
[INFO] --- maven-remote-resources-plugin:1.1:process (default) @ apache-james-mailbox-integration-tester ---
[INFO] Setting property: classpath.resource.loader.class => 'org.codehaus.plexus.velocity.ContextClassLoaderResourceLoader'.
[INFO] Setting property: velocimacro.messages.on => 'false'.
[INFO] Setting property: resource.loader => 'classpath'.
[INFO] Setting property: resource.manager.logwhenfound => 'false'.
Downloading: http://download.java.net/maven/2/org/apache/james/apache-james-mailbox-api/0.2-M2-SNAPSHOT/maven-metadata.xml
Downloading: http://repository.apache.org/snapshots/org/apache/james/apache-james-mailbox-api/0.2-M2-SNAPSHOT/maven-metadata.xml
Downloaded: http://repository.apache.org/snapshots/org/apache/james/apache-james-mailbox-api/0.2-M2-SNAPSHOT/maven-metadata.xml (1014 B at 11.1 KB/sec)
Downloading: http://download.java.net/maven/2/org/apache/james/apache-james-imap-api/0.2-M2-SNAPSHOT/maven-metadata.xml
Downloading: http://repository.apache.org/snapshots/org/apache/james/apache-james-imap-api/0.2-M2-SNAPSHOT/maven-metadata.xml
Downloaded: http://repository.apache.org/snapshots/org/apache/james/apache-james-imap-api/0.2-M2-SNAPSHOT/maven-metadata.xml (1011 B at 11.1 KB/sec)
Downloading: http://download.java.net/maven/2/org/apache/james/apache-james-imap-message/0.2-M2-SNAPSHOT/maven-metadata.xml
Downloading: http://repository.apache.org/snapshots/org/apache/james/apache-james-imap-message/0.2-M2-SNAPSHOT/maven-metadata.xml
Downloaded: http://repository.apache.org/snapshots/org/apache/james/apache-james-imap-message/0.2-M2-SNAPSHOT/maven-metadata.xml (1015 B at 11.4 KB/sec)
Downloading: http://download.java.net/maven/2/org/apache/james/apache-james-mailbox-store/0.2-M2-SNAPSHOT/maven-metadata.xml
Downloading: http://repository.apache.org/snapshots/org/apache/james/apache-james-mailbox-store/0.2-M2-SNAPSHOT/maven-metadata.xml
Downloaded: http://repository.apache.org/snapshots/org/apache/james/apache-james-mailbox-store/0.2-M2-SNAPSHOT/maven-metadata.xml (1016 B at 11.4 KB/sec)
Downloading: http://download.java.net/maven/2/org/apache/james/apache-james-imap-processor/0.2-M2-SNAPSHOT/maven-metadata.xml
Downloading: http://repository.apache.org/snapshots/org/apache/james/apache-james-imap-processor/0.2-M2-SNAPSHOT/maven-metadata.xml
Downloaded: http://repository.apache.org/snapshots/org/apache/james/apache-james-imap-processor/0.2-M2-SNAPSHOT/maven-metadata.xml (1017 B at 10.8 KB/sec)
[INFO] [INFO] Using 'UTF-8' encoding to copy filtered resources.
[INFO] --- maven-resources-plugin:2.4:resources (default-resources) @ apache-james-mailbox-integration-tester ---
[INFO] Copying 113 resources
[INFO] Copying 3 resources
[INFO]
[INFO] --- maven-compiler-plugin:2.3.2:compile (default-compile) @ apache-james-mailbox-integration-tester ---
[INFO] Compiling 39 source files to <https://hudson.apache.org/hudson/job/mailbox-integration-tests/org.apache.james$apache-james-mailbox-integration-tester/ws/target/classes>
[INFO]
[INFO] --- maven-bundle-plugin:2.3.4:manifest (bundle-manifest) @ apache-james-mailbox-integration-tester ---
[WARNING] Embed-Dependency: clause "*;scope=runtime" did not match any dependencies
[INFO] Using 'UTF-8' encoding to copy filtered resources.
[INFO] [INFO] Copying 4 resources
[INFO] --- maven-resources-plugin:2.4:testResources (default-testResources) @ apache-james-mailbox-integration-tester ---
[INFO] Copying 3 resources
[INFO]
[INFO] --- maven-compiler-plugin:2.3.2:testCompile (default-testCompile) @ apache-james-mailbox-integration-tester ---
[INFO] Compiling 76 source files to <https://hudson.apache.org/hudson/job/mailbox-integration-tests/org.apache.james$apache-james-mailbox-integration-tester/ws/target/test-classes>
[INFO]
[INFO] --- maven-surefire-plugin:2.7.2:test (default-test) @ apache-james-mailbox-integration-tester ---
[INFO] Surefire report directory: <https://hudson.apache.org/hudson/job/mailbox-integration-tests/org.apache.james$apache-james-mailbox-integration-tester/ws/target/surefire-reports>
-------------------------------------------------------
T E S T S
-------------------------------------------------------
Running org.apache.james.mailbox.jcr.imap.SearchTest
Tests run: 6, Failures: 0, Errors: 0, Skipped: 0, Time elapsed: 20.101 sec
Running org.apache.james.mailbox.jcr.imap.ListingTest
Tests run: 6, Failures: 0, Errors: 0, Skipped: 0, Time elapsed: 8.094 sec
Running org.apache.james.mailbox.jcr.imap.UidSearchTest
Tests run: 6, Failures: 0, Errors: 0, Skipped: 0, Time elapsed: 25.109 sec
Running org.apache.james.mailbox.jcr.imap.SecurityTest
Tests run: 21, Failures: 0, Errors: 0, Skipped: 0, Time elapsed: 9.231 sec
Running org.apache.james.mailbox.jcr.imap.RenameTest
Tests run: 9, Failures: 0, Errors: 0, Skipped: 0, Time elapsed: 21.098 sec
Running org.apache.james.mailbox.jcr.imap.FetchBodySectionTest
Tests run: 9, Failures: 0, Errors: 0, Skipped: 0, Time elapsed: 12.186 sec
Running org.apache.james.mailbox.jcr.imap.AuthenticatedStateTest
Tests run: 57, Failures: 0, Errors: 0, Skipped: 0, Time elapsed: 23.371 sec
Running org.apache.james.mailbox.jcr.imap.SelectedStateTest
Tests run: 30, Failures: 0, Errors: 0, Skipped: 0, Time elapsed: 21.309 sec
Running org.apache.james.mailbox.jcr.imap.ConcurrentSessionsTest
Tests run: 21, Failures: 0, Errors: 3, Skipped: 0, Time elapsed: 14.887 sec <<< FAILURE!
Running org.apache.james.mailbox.jcr.imap.ExpungeTest
Tests run: 3, Failures: 0, Errors: 0, Skipped: 0, Time elapsed: 9.996 sec
Running org.apache.james.mailbox.jcr.imap.SelectedInboxTest
Tests run: 42, Failures: 0, Errors: 0, Skipped: 0, Time elapsed: 18.984 sec
Running org.apache.james.mailbox.jcr.imap.SelectTest
Tests run: 3, Failures: 0, Errors: 0, Skipped: 0, Time elapsed: 6.527 sec
Running org.apache.james.mailbox.jcr.imap.NonAuthenticatedStateTest
Tests run: 21, Failures: 0, Errors: 0, Skipped: 0, Time elapsed: 9.599 sec
Running org.apache.james.mailbox.jcr.imap.FetchTest
Tests run: 24, Failures: 0, Errors: 0, Skipped: 0, Time elapsed: 19.494 sec
Running org.apache.james.mailbox.jcr.imap.FetchBodyStructureTest
Tests run: 12, Failures: 0, Errors: 0, Skipped: 0, Time elapsed: 17.035 sec
Running org.apache.james.mailbox.jcr.imap.FetchHeadersTest
Tests run: 6, Failures: 0, Errors: 0, Skipped: 0, Time elapsed: 12.594 sec
Running org.apache.james.mailbox.jcr.imap.EventTest
Tests run: 3, Failures: 0, Errors: 0, Skipped: 0, Time elapsed: 7.307 sec
Running org.apache.james.mailbox.jcr.imap.PartialFetchTest
Tests run: 12, Failures: 0, Errors: 0, Skipped: 0, Time elapsed: 14.113 sec
Running org.apache.james.mailbox.jpa.imap.SearchTest
Tests run: 6, Failures: 0, Errors: 0, Skipped: 0, Time elapsed: 11.315 sec
Running org.apache.james.mailbox.jpa.imap.ListingTest
Tests run: 6, Failures: 0, Errors: 0, Skipped: 0, Time elapsed: 2.599 sec
Running org.apache.james.mailbox.jpa.imap.UidSearchTest
Tests run: 6, Failures: 0, Errors: 0, Skipped: 0, Time elapsed: 12.351 sec
Running org.apache.james.mailbox.jpa.imap.SecurityTest
Tests run: 21, Failures: 0, Errors: 0, Skipped: 0, Time elapsed: 1.895 sec
Running org.apache.james.mailbox.jpa.imap.RenameTest
Tests run: 9, Failures: 0, Errors: 0, Skipped: 0, Time elapsed: 6.71 sec
Running org.apache.james.mailbox.jpa.imap.FetchBodySectionTest
Tests run: 9, Failures: 0, Errors: 0, Skipped: 0, Time elapsed: 4.32 sec
Running org.apache.james.mailbox.jpa.imap.AuthenticatedStateTest
Tests run: 57, Failures: 0, Errors: 0, Skipped: 0, Time elapsed: 4.787 sec
Running org.apache.james.mailbox.jpa.imap.SelectedStateTest
Tests run: 30, Failures: 0, Errors: 0, Skipped: 0, Time elapsed: 6.009 sec
Running org.apache.james.mailbox.jpa.imap.ConcurrentSessionsTest
Tests run: 21, Failures: 0, Errors: 3, Skipped: 0, Time elapsed: 4.365 sec <<< FAILURE!
Running org.apache.james.mailbox.jpa.imap.ExpungeTest
Tests run: 3, Failures: 0, Errors: 0, Skipped: 0, Time elapsed: 3.696 sec
Running org.apache.james.mailbox.jpa.imap.SelectedInboxTest
Tests run: 42, Failures: 0, Errors: 0, Skipped: 0, Time elapsed: 4.326 sec
Running org.apache.james.mailbox.jpa.imap.SelectTest
Tests run: 3, Failures: 0, Errors: 0, Skipped: 0, Time elapsed: 2.713 sec
Running org.apache.james.mailbox.jpa.imap.NonAuthenticatedStateTest
Tests run: 21, Failures: 0, Errors: 0, Skipped: 0, Time elapsed: 2.056 sec
Running org.apache.james.mailbox.jpa.imap.FetchTest
Tests run: 24, Failures: 0, Errors: 0, Skipped: 0, Time elapsed: 5.685 sec
Running org.apache.james.mailbox.jpa.imap.FetchBodyStructureTest
Tests run: 12, Failures: 0, Errors: 0, Skipped: 0, Time elapsed: 7.417 sec
Running org.apache.james.mailbox.jpa.imap.FetchHeadersTest
Tests run: 6, Failures: 0, Errors: 0, Skipped: 0, Time elapsed: 4.558 sec
Running org.apache.james.mailbox.jpa.imap.EventTest
Tests run: 3, Failures: 0, Errors: 0, Skipped: 0, Time elapsed: 2.943 sec
Running org.apache.james.mailbox.jpa.imap.PartialFetchTest
Tests run: 12, Failures: 0, Errors: 0, Skipped: 0, Time elapsed: 4.97 sec
Running org.apache.james.mailbox.maildir.imap.ListingTest
Tests run: 6, Failures: 0, Errors: 0, Skipped: 0, Time elapsed: 0.579 sec
Running org.apache.james.mailbox.maildir.imap.UidSearchTest
Tests run: 6, Failures: 0, Errors: 0, Skipped: 0, Time elapsed: 3.268 sec
Running org.apache.james.mailbox.maildir.imap.SecurityTest
Tests run: 21, Failures: 0, Errors: 0, Skipped: 0, Time elapsed: 0.323 sec
Running org.apache.james.mailbox.maildir.imap.RenameTest
Tests run: 9, Failures: 0, Errors: 0, Skipped: 0, Time elapsed: 1.835 sec
Running org.apache.james.mailbox.maildir.imap.FetchBodySectionTest
Tests run: 9, Failures: 0, Errors: 0, Skipped: 0, Time elapsed: 1.134 sec
Running org.apache.james.mailbox.maildir.imap.AuthenticatedStateTest
Tests run: 57, Failures: 0, Errors: 0, Skipped: 0, Time elapsed: 1.254 sec
Running org.apache.james.mailbox.maildir.imap.SelectedStateTest
Tests run: 30, Failures: 0, Errors: 0, Skipped: 0, Time elapsed: 1.539 sec
Running org.apache.james.mailbox.maildir.imap.ConcurrentSessionsTest
Tests run: 21, Failures: 0, Errors: 0, Skipped: 0, Time elapsed: 1.174 sec
Running org.apache.james.mailbox.maildir.imap.ExpungeTest
Tests run: 3, Failures: 0, Errors: 0, Skipped: 0, Time elapsed: 0.847 sec
Running org.apache.james.mailbox.maildir.imap.SelectedInboxTest
Tests run: 42, Failures: 0, Errors: 0, Skipped: 0, Time elapsed: 1.167 sec
Running org.apache.james.mailbox.maildir.imap.SelectTest
Tests run: 3, Failures: 0, Errors: 0, Skipped: 0, Time elapsed: 0.701 sec
Running org.apache.james.mailbox.maildir.imap.NonAuthenticatedStateTest
Tests run: 21, Failures: 0, Errors: 0, Skipped: 0, Time elapsed: 0.38 sec
Running org.apache.james.mailbox.maildir.imap.FetchTest
Tests run: 24, Failures: 0, Errors: 0, Skipped: 0, Time elapsed: 1.471 sec
Running org.apache.james.mailbox.maildir.imap.FetchBodyStructureTest
Tests run: 12, Failures: 0, Errors: 0, Skipped: 0, Time elapsed: 2.125 sec
Running org.apache.james.mailbox.maildir.imap.FetchHeadersTest
Tests run: 6, Failures: 0, Errors: 0, Skipped: 0, Time elapsed: 1.138 sec
Running org.apache.james.mailbox.maildir.imap.EventTest
Tests run: 3, Failures: 0, Errors: 0, Skipped: 0, Time elapsed: 0.69 sec
Running org.apache.james.mailbox.maildir.imap.PartialFetchTest
Tests run: 12, Failures: 0, Errors: 0, Skipped: 0, Time elapsed: 1.281 sec
Running org.apache.james.mailbox.inmemory.imap.SearchTest
Tests run: 6, Failures: 0, Errors: 0, Skipped: 0, Time elapsed: 1.811 sec
Running org.apache.james.mailbox.inmemory.imap.ListingTest
Tests run: 6, Failures: 0, Errors: 0, Skipped: 0, Time elapsed: 0.382 sec
Running org.apache.james.mailbox.inmemory.imap.UidSearchTest
Tests run: 6, Failures: 0, Errors: 0, Skipped: 0, Time elapsed: 2.027 sec
Running org.apache.james.mailbox.inmemory.imap.SecurityTest
Tests run: 21, Failures: 0, Errors: 0, Skipped: 0, Time elapsed: 0.321 sec
Running org.apache.james.mailbox.inmemory.imap.RenameTest
Tests run: 9, Failures: 0, Errors: 0, Skipped: 0, Time elapsed: 1.08 sec
Running org.apache.james.mailbox.inmemory.imap.FetchBodySectionTest
Tests run: 9, Failures: 0, Errors: 0, Skipped: 0, Time elapsed: 0.889 sec
Running org.apache.james.mailbox.inmemory.imap.AuthenticatedStateTest
Tests run: 57, Failures: 0, Errors: 0, Skipped: 0, Time elapsed: 0.944 sec
Running org.apache.james.mailbox.inmemory.imap.SelectedStateTest
Tests run: 30, Failures: 0, Errors: 0, Skipped: 0, Time elapsed: 1.004 sec
Running org.apache.james.mailbox.inmemory.imap.ConcurrentSessionsTest
Tests run: 21, Failures: 0, Errors: 0, Skipped: 0, Time elapsed: 0.833 sec
Running org.apache.james.mailbox.inmemory.imap.ExpungeTest
Tests run: 3, Failures: 0, Errors: 0, Skipped: 0, Time elapsed: 0.665 sec
Running org.apache.james.mailbox.inmemory.imap.SelectedInboxTest
Tests run: 42, Failures: 0, Errors: 0, Skipped: 0, Time elapsed: 0.885 sec
Running org.apache.james.mailbox.inmemory.imap.SelectTest
Tests run: 3, Failures: 0, Errors: 0, Skipped: 0, Time elapsed: 0.623 sec
Running org.apache.james.mailbox.inmemory.imap.NonAuthenticatedStateTest
Tests run: 21, Failures: 0, Errors: 0, Skipped: 0, Time elapsed: 0.356 sec
Running org.apache.james.mailbox.inmemory.imap.FetchTest
Tests run: 24, Failures: 0, Errors: 0, Skipped: 0, Time elapsed: 1.02 sec
Running org.apache.james.mailbox.inmemory.imap.FetchBodyStructureTest
Tests run: 12, Failures: 0, Errors: 0, Skipped: 0, Time elapsed: 1.457 sec
Running org.apache.james.mailbox.inmemory.imap.FetchHeadersTest
Tests run: 6, Failures: 0, Errors: 0, Skipped: 0, Time elapsed: 0.835 sec
Running org.apache.james.mailbox.inmemory.imap.EventTest
Tests run: 3, Failures: 0, Errors: 0, Skipped: 0, Time elapsed: 0.594 sec
Running org.apache.james.mailbox.inmemory.imap.PartialFetchTest
Tests run: 12, Failures: 0, Errors: 0, Skipped: 0, Time elapsed: 0.954 sec
Results :
Tests in error:
Tests run: 1158, Failures: 0, Errors: 6, Skipped: 0
mojoFailed org.apache.maven.plugins:maven-surefire-plugin:2.7.2(default-test)
[JENKINS] Recording test results
projectFailed org.apache.james:apache-james-mailbox-integration-tester:0.2-M2-SNAPSHOT
---------------------------------------------------------------------
To unsubscribe, e-mail: server-dev-unsubscribe@james.apache.org
For additional commands, e-mail: server-dev-help@james.apache.org
Build failed in Jenkins: mailbox-integration-tests » Apache James Mailbox Integration Tester #153
Posted by Apache Hudson Server <hu...@hudson.apache.org>.
See <https://hudson.apache.org/hudson/job/mailbox-integration-tests/org.apache.james$apache-james-mailbox-integration-tester/153/>
------------------------------------------
[...truncated 29 lines...]
Downloading: http://download.java.net/maven/2/org/apache/james/apache-james-imap-message/0.2-M2-SNAPSHOT/maven-metadata.xml
Downloading: http://repository.apache.org/snapshots/org/apache/james/apache-james-imap-message/0.2-M2-SNAPSHOT/maven-metadata.xml
Downloaded: http://repository.apache.org/snapshots/org/apache/james/apache-james-imap-message/0.2-M2-SNAPSHOT/maven-metadata.xml (1015 B at 10.2 KB/sec)
Downloading: http://download.java.net/maven/2/org/apache/james/apache-james-imap-message/0.2-M2-SNAPSHOT/apache-james-imap-message-0.2-M2-20110307.073648-284.pom
Downloading: http://repository.apache.org/snapshots/org/apache/james/apache-james-imap-message/0.2-M2-SNAPSHOT/apache-james-imap-message-0.2-M2-20110307.073648-284.pom
Downloaded: http://repository.apache.org/snapshots/org/apache/james/apache-james-imap-message/0.2-M2-SNAPSHOT/apache-james-imap-message-0.2-M2-20110307.073648-284.pom (3 KB at 27.2 KB/sec)
Downloading: http://download.java.net/maven/2/org/apache/james/apache-james-imap-processor/0.2-M2-SNAPSHOT/maven-metadata.xml
Downloading: http://repository.apache.org/snapshots/org/apache/james/apache-james-imap-processor/0.2-M2-SNAPSHOT/maven-metadata.xml
Downloaded: http://repository.apache.org/snapshots/org/apache/james/apache-james-imap-processor/0.2-M2-SNAPSHOT/maven-metadata.xml (1017 B at 10.2 KB/sec)
Downloading: http://download.java.net/maven/2/org/apache/james/apache-james-imap-processor/0.2-M2-SNAPSHOT/apache-james-imap-processor-0.2-M2-20110307.073749-281.pom
Downloading: http://repository.apache.org/snapshots/org/apache/james/apache-james-imap-processor/0.2-M2-SNAPSHOT/apache-james-imap-processor-0.2-M2-20110307.073749-281.pom
Downloaded: http://repository.apache.org/snapshots/org/apache/james/apache-james-imap-processor/0.2-M2-SNAPSHOT/apache-james-imap-processor-0.2-M2-20110307.073749-281.pom (2 KB at 22.2 KB/sec)
Downloading: http://download.java.net/maven/2/org/apache/james/apache-james-mailbox-store/0.2-M2-SNAPSHOT/maven-metadata.xml
Downloading: http://repository.apache.org/snapshots/org/apache/james/apache-james-mailbox-store/0.2-M2-SNAPSHOT/maven-metadata.xml
Downloaded: http://repository.apache.org/snapshots/org/apache/james/apache-james-mailbox-store/0.2-M2-SNAPSHOT/maven-metadata.xml (1016 B at 11.3 KB/sec)
Downloading: http://download.java.net/maven/2/org/apache/james/apache-james-mailbox-jcr/0.2-M2-SNAPSHOT/maven-metadata.xml
Downloading: http://repository.apache.org/snapshots/org/apache/james/apache-james-mailbox-jcr/0.2-M2-SNAPSHOT/maven-metadata.xml
Downloaded: http://repository.apache.org/snapshots/org/apache/james/apache-james-mailbox-jcr/0.2-M2-SNAPSHOT/maven-metadata.xml (1014 B at 9.5 KB/sec)
Downloading: http://download.java.net/maven/2/org/apache/james/apache-james-mailbox-jcr/0.2-M2-SNAPSHOT/maven-metadata.xml
Downloading: http://repository.apache.org/snapshots/org/apache/james/apache-james-mailbox-jcr/0.2-M2-SNAPSHOT/maven-metadata.xml
Downloaded: http://repository.apache.org/snapshots/org/apache/james/apache-james-mailbox-jcr/0.2-M2-SNAPSHOT/maven-metadata.xml (1014 B at 11.1 KB/sec)
Downloading: http://download.java.net/maven/2/org/apache/james/apache-james-mailbox-store/0.2-M2-SNAPSHOT/maven-metadata.xml
Downloading: http://repository.apache.org/snapshots/org/apache/james/apache-james-mailbox-store/0.2-M2-SNAPSHOT/maven-metadata.xml
Downloaded: http://repository.apache.org/snapshots/org/apache/james/apache-james-mailbox-store/0.2-M2-SNAPSHOT/maven-metadata.xml (1016 B at 10.4 KB/sec)
Downloading: http://download.java.net/maven/2/org/apache/james/apache-james-mailbox-jpa/0.2-M2-SNAPSHOT/maven-metadata.xml
Downloading: http://repository.apache.org/snapshots/org/apache/james/apache-james-mailbox-jpa/0.2-M2-SNAPSHOT/maven-metadata.xml
Downloaded: http://repository.apache.org/snapshots/org/apache/james/apache-james-mailbox-jpa/0.2-M2-SNAPSHOT/maven-metadata.xml (1014 B at 11.3 KB/sec)
Downloading: http://download.java.net/maven/2/org/apache/james/apache-james-mailbox-maildir/0.2-M2-SNAPSHOT/maven-metadata.xml
Downloading: http://repository.apache.org/snapshots/org/apache/james/apache-james-mailbox-maildir/0.2-M2-SNAPSHOT/maven-metadata.xml
Downloaded: http://repository.apache.org/snapshots/org/apache/james/apache-james-mailbox-maildir/0.2-M2-SNAPSHOT/maven-metadata.xml (1018 B at 10.9 KB/sec)
Downloading: http://download.java.net/maven/2/org/apache/james/apache-james-mailbox-memory/0.2-M2-SNAPSHOT/maven-metadata.xml
Downloading: http://repository.apache.org/snapshots/org/apache/james/apache-james-mailbox-memory/0.2-M2-SNAPSHOT/maven-metadata.xml
Downloaded: http://repository.apache.org/snapshots/org/apache/james/apache-james-mailbox-memory/0.2-M2-SNAPSHOT/maven-metadata.xml (1017 B at 11.3 KB/sec)
Downloading: http://download.java.net/maven/2/org/apache/james/apache-james-mailbox-memory/0.2-M2-SNAPSHOT/maven-metadata.xml
Downloading: http://repository.apache.org/snapshots/org/apache/james/apache-james-mailbox-memory/0.2-M2-SNAPSHOT/maven-metadata.xml
Downloaded: http://repository.apache.org/snapshots/org/apache/james/apache-james-mailbox-memory/0.2-M2-SNAPSHOT/maven-metadata.xml (1017 B at 11.7 KB/sec)
Downloading: http://repository.apache.org/snapshots/org/apache/james/apache-james-imap-api/0.2-M2-SNAPSHOT/apache-james-imap-api-0.2-M2-20110307.073540-289.jar
Downloading: http://repository.apache.org/snapshots/org/apache/james/apache-james-imap-message/0.2-M2-SNAPSHOT/apache-james-imap-message-0.2-M2-20110307.073648-284.jar
Downloading: http://repository.apache.org/snapshots/org/apache/james/apache-james-imap-processor/0.2-M2-SNAPSHOT/apache-james-imap-processor-0.2-M2-20110307.073749-281.jar
Downloading: http://repository.apache.org/snapshots/org/apache/james/apache-james-mailbox-store/0.2-M2-SNAPSHOT/apache-james-mailbox-store-0.2-M2-20110307.071758-228-tests.jar
Downloading: http://repository.apache.org/snapshots/org/apache/james/apache-james-mailbox-store/0.2-M2-SNAPSHOT/apache-james-mailbox-store-0.2-M2-20110307.071758-228.jar
Downloaded: http://repository.apache.org/snapshots/org/apache/james/apache-james-imap-api/0.2-M2-SNAPSHOT/apache-james-imap-api-0.2-M2-20110307.073540-289.jar (41 KB at 336.3 KB/sec)
Downloading: http://repository.apache.org/snapshots/org/apache/james/apache-james-mailbox-jpa/0.2-M2-SNAPSHOT/apache-james-mailbox-jpa-0.2-M2-20110307.072200-204.jar
Downloaded: http://repository.apache.org/snapshots/org/apache/james/apache-james-mailbox-store/0.2-M2-SNAPSHOT/apache-james-mailbox-store-0.2-M2-20110307.071758-228-tests.jar (38 KB at 174.0 KB/sec)
Downloading: http://repository.apache.org/snapshots/org/apache/james/apache-james-mailbox-maildir/0.2-M2-SNAPSHOT/apache-james-mailbox-maildir-0.2-M2-20110307.072829-161.jar
Downloaded: http://repository.apache.org/snapshots/org/apache/james/apache-james-mailbox-jpa/0.2-M2-SNAPSHOT/apache-james-mailbox-jpa-0.2-M2-20110307.072200-204.jar (74 KB at 480.6 KB/sec)
Downloaded: http://repository.apache.org/snapshots/org/apache/james/apache-james-imap-processor/0.2-M2-SNAPSHOT/apache-james-imap-processor-0.2-M2-20110307.073749-281.jar (117 KB at 401.7 KB/sec)
Downloaded: http://repository.apache.org/snapshots/org/apache/james/apache-james-mailbox-store/0.2-M2-SNAPSHOT/apache-james-mailbox-store-0.2-M2-20110307.071758-228.jar (124 KB at 425.4 KB/sec)
Downloaded: http://repository.apache.org/snapshots/org/apache/james/apache-james-imap-message/0.2-M2-SNAPSHOT/apache-james-imap-message-0.2-M2-20110307.073648-284.jar (160 KB at 443.2 KB/sec)
Downloaded: http://repository.apache.org/snapshots/org/apache/james/apache-james-mailbox-maildir/0.2-M2-SNAPSHOT/apache-james-mailbox-maildir-0.2-M2-20110307.072829-161.jar (64 KB at 420.5 KB/sec)
[INFO]
[INFO] --- maven-clean-plugin:2.3:clean (default-clean) @ apache-james-mailbox-integration-tester ---
[INFO] Deleting file set: <https://hudson.apache.org/hudson/job/mailbox-integration-tests/org.apache.james$apache-james-mailbox-integration-tester/ws/target> (included: [**], excluded: [])
[INFO]
[INFO] --- maven-remote-resources-plugin:1.1:process (default) @ apache-james-mailbox-integration-tester ---
[INFO] Setting property: classpath.resource.loader.class => 'org.codehaus.plexus.velocity.ContextClassLoaderResourceLoader'.
[INFO] Setting property: velocimacro.messages.on => 'false'.
[INFO] Setting property: resource.loader => 'classpath'.
[INFO] Setting property: resource.manager.logwhenfound => 'false'.
Downloading: http://download.java.net/maven/2/org/apache/james/apache-james-imap-api/0.2-M2-SNAPSHOT/maven-metadata.xml
Downloading: http://repository.apache.org/snapshots/org/apache/james/apache-james-imap-api/0.2-M2-SNAPSHOT/maven-metadata.xml
Downloaded: http://repository.apache.org/snapshots/org/apache/james/apache-james-imap-api/0.2-M2-SNAPSHOT/maven-metadata.xml (1011 B at 11.3 KB/sec)
Downloading: http://download.java.net/maven/2/org/apache/james/apache-james-imap-message/0.2-M2-SNAPSHOT/maven-metadata.xml
Downloading: http://repository.apache.org/snapshots/org/apache/james/apache-james-imap-message/0.2-M2-SNAPSHOT/maven-metadata.xml
Downloaded: http://repository.apache.org/snapshots/org/apache/james/apache-james-imap-message/0.2-M2-SNAPSHOT/maven-metadata.xml (1015 B at 10.7 KB/sec)
Downloading: http://download.java.net/maven/2/org/apache/james/apache-james-mailbox-store/0.2-M2-SNAPSHOT/maven-metadata.xml
Downloading: http://repository.apache.org/snapshots/org/apache/james/apache-james-mailbox-store/0.2-M2-SNAPSHOT/maven-metadata.xml
Downloaded: http://repository.apache.org/snapshots/org/apache/james/apache-james-mailbox-store/0.2-M2-SNAPSHOT/maven-metadata.xml (1016 B at 11.1 KB/sec)
Downloading: http://download.java.net/maven/2/org/apache/james/apache-james-imap-processor/0.2-M2-SNAPSHOT/maven-metadata.xml
Downloading: http://repository.apache.org/snapshots/org/apache/james/apache-james-imap-processor/0.2-M2-SNAPSHOT/maven-metadata.xml
Downloaded: http://repository.apache.org/snapshots/org/apache/james/apache-james-imap-processor/0.2-M2-SNAPSHOT/maven-metadata.xml (1017 B at 11.7 KB/sec)
[INFO]
[INFO] --- maven-resources-plugin:2.4:resources (default-resources) @ apache-james-mailbox-integration-tester ---
[INFO] Using 'UTF-8' encoding to copy filtered resources.
[INFO] Copying 113 resources
[INFO] Copying 3 resources
[INFO]
[INFO] --- maven-compiler-plugin:2.3.2:compile (default-compile) @ apache-james-mailbox-integration-tester ---
[INFO] Compiling 39 source files to <https://hudson.apache.org/hudson/job/mailbox-integration-tests/org.apache.james$apache-james-mailbox-integration-tester/ws/target/classes>
[INFO]
[INFO] --- maven-bundle-plugin:2.3.4:manifest (bundle-manifest) @ apache-james-mailbox-integration-tester ---
[WARNING] Embed-Dependency: clause "*;scope=runtime" did not match any dependencies
[INFO] Using 'UTF-8' encoding to copy filtered resources.
[INFO] [INFO] Copying 4 resources
[INFO] --- maven-resources-plugin:2.4:testResources (default-testResources) @ apache-james-mailbox-integration-tester ---
[INFO] Copying 3 resources
[INFO]
[INFO] --- maven-compiler-plugin:2.3.2:testCompile (default-testCompile) @ apache-james-mailbox-integration-tester ---
[INFO] Compiling 76 source files to <https://hudson.apache.org/hudson/job/mailbox-integration-tests/org.apache.james$apache-james-mailbox-integration-tester/ws/target/test-classes>
[INFO]
[INFO] --- maven-surefire-plugin:2.7.2:test (default-test) @ apache-james-mailbox-integration-tester ---
[INFO] Surefire report directory: <https://hudson.apache.org/hudson/job/mailbox-integration-tests/org.apache.james$apache-james-mailbox-integration-tester/ws/target/surefire-reports>
-------------------------------------------------------
T E S T S
-------------------------------------------------------
Running org.apache.james.mailbox.jcr.imap.SearchTest
Tests run: 6, Failures: 0, Errors: 0, Skipped: 0, Time elapsed: 20.561 sec
Running org.apache.james.mailbox.jcr.imap.ListingTest
Tests run: 6, Failures: 0, Errors: 0, Skipped: 0, Time elapsed: 7.772 sec
Running org.apache.james.mailbox.jcr.imap.UidSearchTest
Tests run: 6, Failures: 0, Errors: 0, Skipped: 0, Time elapsed: 24.889 sec
Running org.apache.james.mailbox.jcr.imap.SecurityTest
Tests run: 21, Failures: 0, Errors: 0, Skipped: 0, Time elapsed: 9.283 sec
Running org.apache.james.mailbox.jcr.imap.RenameTest
Tests run: 9, Failures: 0, Errors: 0, Skipped: 0, Time elapsed: 20.44 sec
Running org.apache.james.mailbox.jcr.imap.FetchBodySectionTest
Tests run: 9, Failures: 0, Errors: 0, Skipped: 0, Time elapsed: 11.937 sec
Running org.apache.james.mailbox.jcr.imap.AuthenticatedStateTest
Tests run: 57, Failures: 0, Errors: 0, Skipped: 0, Time elapsed: 23.607 sec
Running org.apache.james.mailbox.jcr.imap.SelectedStateTest
Tests run: 30, Failures: 0, Errors: 0, Skipped: 0, Time elapsed: 21.037 sec
Running org.apache.james.mailbox.jcr.imap.ConcurrentSessionsTest
Tests run: 21, Failures: 0, Errors: 3, Skipped: 0, Time elapsed: 15.044 sec <<< FAILURE!
Running org.apache.james.mailbox.jcr.imap.ExpungeTest
Tests run: 3, Failures: 0, Errors: 0, Skipped: 0, Time elapsed: 9.868 sec
Running org.apache.james.mailbox.jcr.imap.SelectedInboxTest
Tests run: 42, Failures: 0, Errors: 0, Skipped: 0, Time elapsed: 18.963 sec
Running org.apache.james.mailbox.jcr.imap.SelectTest
Tests run: 3, Failures: 0, Errors: 0, Skipped: 0, Time elapsed: 6.539 sec
Running org.apache.james.mailbox.jcr.imap.NonAuthenticatedStateTest
Tests run: 21, Failures: 0, Errors: 0, Skipped: 0, Time elapsed: 9.519 sec
Running org.apache.james.mailbox.jcr.imap.FetchTest
Tests run: 24, Failures: 0, Errors: 0, Skipped: 0, Time elapsed: 19.666 sec
Running org.apache.james.mailbox.jcr.imap.FetchBodyStructureTest
Tests run: 12, Failures: 0, Errors: 0, Skipped: 0, Time elapsed: 17.998 sec
Running org.apache.james.mailbox.jcr.imap.FetchHeadersTest
Tests run: 6, Failures: 0, Errors: 0, Skipped: 0, Time elapsed: 12.694 sec
Running org.apache.james.mailbox.jcr.imap.EventTest
Tests run: 3, Failures: 0, Errors: 0, Skipped: 0, Time elapsed: 7.402 sec
Running org.apache.james.mailbox.jcr.imap.PartialFetchTest
Tests run: 12, Failures: 0, Errors: 0, Skipped: 0, Time elapsed: 14.028 sec
Running org.apache.james.mailbox.jpa.imap.SearchTest
Tests run: 6, Failures: 0, Errors: 0, Skipped: 0, Time elapsed: 11.49 sec
Running org.apache.james.mailbox.jpa.imap.ListingTest
Tests run: 6, Failures: 0, Errors: 0, Skipped: 0, Time elapsed: 2.645 sec
Running org.apache.james.mailbox.jpa.imap.UidSearchTest
Tests run: 6, Failures: 0, Errors: 0, Skipped: 0, Time elapsed: 12.485 sec
Running org.apache.james.mailbox.jpa.imap.SecurityTest
Tests run: 21, Failures: 0, Errors: 0, Skipped: 0, Time elapsed: 1.868 sec
Running org.apache.james.mailbox.jpa.imap.RenameTest
Tests run: 9, Failures: 0, Errors: 0, Skipped: 0, Time elapsed: 6.886 sec
Running org.apache.james.mailbox.jpa.imap.FetchBodySectionTest
Tests run: 9, Failures: 0, Errors: 0, Skipped: 0, Time elapsed: 4.35 sec
Running org.apache.james.mailbox.jpa.imap.AuthenticatedStateTest
Tests run: 57, Failures: 0, Errors: 0, Skipped: 0, Time elapsed: 4.732 sec
Running org.apache.james.mailbox.jpa.imap.SelectedStateTest
Tests run: 30, Failures: 0, Errors: 0, Skipped: 0, Time elapsed: 5.972 sec
Running org.apache.james.mailbox.jpa.imap.ConcurrentSessionsTest
Tests run: 21, Failures: 0, Errors: 3, Skipped: 0, Time elapsed: 4.471 sec <<< FAILURE!
Running org.apache.james.mailbox.jpa.imap.ExpungeTest
Tests run: 3, Failures: 0, Errors: 0, Skipped: 0, Time elapsed: 3.777 sec
Running org.apache.james.mailbox.jpa.imap.SelectedInboxTest
Tests run: 42, Failures: 0, Errors: 0, Skipped: 0, Time elapsed: 4.23 sec
Running org.apache.james.mailbox.jpa.imap.SelectTest
Tests run: 3, Failures: 0, Errors: 0, Skipped: 0, Time elapsed: 2.674 sec
Running org.apache.james.mailbox.jpa.imap.NonAuthenticatedStateTest
Tests run: 21, Failures: 0, Errors: 0, Skipped: 0, Time elapsed: 1.967 sec
Running org.apache.james.mailbox.jpa.imap.FetchTest
Tests run: 24, Failures: 0, Errors: 0, Skipped: 0, Time elapsed: 5.806 sec
Running org.apache.james.mailbox.jpa.imap.FetchBodyStructureTest
Tests run: 12, Failures: 0, Errors: 0, Skipped: 0, Time elapsed: 7.395 sec
Running org.apache.james.mailbox.jpa.imap.FetchHeadersTest
Tests run: 6, Failures: 0, Errors: 0, Skipped: 0, Time elapsed: 4.668 sec
Running org.apache.james.mailbox.jpa.imap.EventTest
Tests run: 3, Failures: 0, Errors: 0, Skipped: 0, Time elapsed: 2.909 sec
Running org.apache.james.mailbox.jpa.imap.PartialFetchTest
Tests run: 12, Failures: 0, Errors: 0, Skipped: 0, Time elapsed: 5.034 sec
Running org.apache.james.mailbox.maildir.imap.ListingTest
Tests run: 6, Failures: 0, Errors: 0, Skipped: 0, Time elapsed: 0.55 sec
Running org.apache.james.mailbox.maildir.imap.UidSearchTest
Tests run: 6, Failures: 0, Errors: 0, Skipped: 0, Time elapsed: 3.33 sec
Running org.apache.james.mailbox.maildir.imap.SecurityTest
Tests run: 21, Failures: 0, Errors: 0, Skipped: 0, Time elapsed: 0.322 sec
Running org.apache.james.mailbox.maildir.imap.RenameTest
Tests run: 9, Failures: 0, Errors: 0, Skipped: 0, Time elapsed: 1.801 sec
Running org.apache.james.mailbox.maildir.imap.FetchBodySectionTest
Tests run: 9, Failures: 0, Errors: 0, Skipped: 0, Time elapsed: 1.132 sec
Running org.apache.james.mailbox.maildir.imap.AuthenticatedStateTest
Tests run: 57, Failures: 0, Errors: 0, Skipped: 0, Time elapsed: 1.288 sec
Running org.apache.james.mailbox.maildir.imap.SelectedStateTest
Tests run: 30, Failures: 0, Errors: 0, Skipped: 0, Time elapsed: 1.547 sec
Running org.apache.james.mailbox.maildir.imap.ConcurrentSessionsTest
Tests run: 21, Failures: 0, Errors: 0, Skipped: 0, Time elapsed: 1.161 sec
Running org.apache.james.mailbox.maildir.imap.ExpungeTest
Tests run: 3, Failures: 0, Errors: 0, Skipped: 0, Time elapsed: 0.872 sec
Running org.apache.james.mailbox.maildir.imap.SelectedInboxTest
Tests run: 42, Failures: 0, Errors: 0, Skipped: 0, Time elapsed: 1.284 sec
Running org.apache.james.mailbox.maildir.imap.SelectTest
Tests run: 3, Failures: 0, Errors: 0, Skipped: 0, Time elapsed: 0.703 sec
Running org.apache.james.mailbox.maildir.imap.NonAuthenticatedStateTest
Tests run: 21, Failures: 0, Errors: 0, Skipped: 0, Time elapsed: 0.379 sec
Running org.apache.james.mailbox.maildir.imap.FetchTest
Tests run: 24, Failures: 0, Errors: 0, Skipped: 0, Time elapsed: 1.546 sec
Running org.apache.james.mailbox.maildir.imap.FetchBodyStructureTest
Tests run: 12, Failures: 0, Errors: 0, Skipped: 0, Time elapsed: 2.11 sec
Running org.apache.james.mailbox.maildir.imap.FetchHeadersTest
Tests run: 6, Failures: 0, Errors: 0, Skipped: 0, Time elapsed: 1.079 sec
Running org.apache.james.mailbox.maildir.imap.EventTest
Tests run: 3, Failures: 0, Errors: 0, Skipped: 0, Time elapsed: 0.707 sec
Running org.apache.james.mailbox.maildir.imap.PartialFetchTest
Tests run: 12, Failures: 0, Errors: 0, Skipped: 0, Time elapsed: 1.295 sec
Running org.apache.james.mailbox.inmemory.imap.SearchTest
Tests run: 6, Failures: 0, Errors: 0, Skipped: 0, Time elapsed: 1.807 sec
Running org.apache.james.mailbox.inmemory.imap.ListingTest
Tests run: 6, Failures: 0, Errors: 0, Skipped: 0, Time elapsed: 0.37 sec
Running org.apache.james.mailbox.inmemory.imap.UidSearchTest
Tests run: 6, Failures: 0, Errors: 0, Skipped: 0, Time elapsed: 1.859 sec
Running org.apache.james.mailbox.inmemory.imap.SecurityTest
Tests run: 21, Failures: 0, Errors: 0, Skipped: 0, Time elapsed: 0.317 sec
Running org.apache.james.mailbox.inmemory.imap.RenameTest
Tests run: 9, Failures: 0, Errors: 0, Skipped: 0, Time elapsed: 1.05 sec
Running org.apache.james.mailbox.inmemory.imap.FetchBodySectionTest
Tests run: 9, Failures: 0, Errors: 0, Skipped: 0, Time elapsed: 0.903 sec
Running org.apache.james.mailbox.inmemory.imap.AuthenticatedStateTest
Tests run: 57, Failures: 0, Errors: 0, Skipped: 0, Time elapsed: 0.942 sec
Running org.apache.james.mailbox.inmemory.imap.SelectedStateTest
Tests run: 30, Failures: 0, Errors: 0, Skipped: 0, Time elapsed: 1.075 sec
Running org.apache.james.mailbox.inmemory.imap.ConcurrentSessionsTest
Tests run: 21, Failures: 0, Errors: 0, Skipped: 0, Time elapsed: 0.791 sec
Running org.apache.james.mailbox.inmemory.imap.ExpungeTest
Tests run: 3, Failures: 0, Errors: 0, Skipped: 0, Time elapsed: 0.668 sec
Running org.apache.james.mailbox.inmemory.imap.SelectedInboxTest
Tests run: 42, Failures: 0, Errors: 0, Skipped: 0, Time elapsed: 0.897 sec
Running org.apache.james.mailbox.inmemory.imap.SelectTest
Tests run: 3, Failures: 0, Errors: 0, Skipped: 0, Time elapsed: 0.624 sec
Running org.apache.james.mailbox.inmemory.imap.NonAuthenticatedStateTest
Tests run: 21, Failures: 0, Errors: 0, Skipped: 0, Time elapsed: 0.356 sec
Running org.apache.james.mailbox.inmemory.imap.FetchTest
Tests run: 24, Failures: 0, Errors: 0, Skipped: 0, Time elapsed: 1.101 sec
Running org.apache.james.mailbox.inmemory.imap.FetchBodyStructureTest
Tests run: 12, Failures: 0, Errors: 0, Skipped: 0, Time elapsed: 1.495 sec
Running org.apache.james.mailbox.inmemory.imap.FetchHeadersTest
Tests run: 6, Failures: 0, Errors: 0, Skipped: 0, Time elapsed: 0.78 sec
Running org.apache.james.mailbox.inmemory.imap.EventTest
Tests run: 3, Failures: 0, Errors: 0, Skipped: 0, Time elapsed: 0.595 sec
Running org.apache.james.mailbox.inmemory.imap.PartialFetchTest
Tests run: 12, Failures: 0, Errors: 0, Skipped: 0, Time elapsed: 0.989 sec
Results :
Tests in error:
Tests run: 1158, Failures: 0, Errors: 6, Skipped: 0
mojoFailed org.apache.maven.plugins:maven-surefire-plugin:2.7.2(default-test)
[JENKINS] Recording test results
projectFailed org.apache.james:apache-james-mailbox-integration-tester:0.2-M2-SNAPSHOT
---------------------------------------------------------------------
To unsubscribe, e-mail: server-dev-unsubscribe@james.apache.org
For additional commands, e-mail: server-dev-help@james.apache.org
Build failed in Jenkins: mailbox-integration-tests » Apache James Mailbox Integration Tester #152
Posted by Apache Hudson Server <hu...@hudson.apache.org>.
See <https://hudson.apache.org/hudson/job/mailbox-integration-tests/org.apache.james$apache-james-mailbox-integration-tester/152/>
------------------------------------------
[...truncated 47 lines...]
Downloading: http://download.java.net/maven/2/org/apache/james/apache-james-mailbox-jcr/0.2-M2-SNAPSHOT/maven-metadata.xml
Downloading: http://repository.apache.org/snapshots/org/apache/james/apache-james-mailbox-jcr/0.2-M2-SNAPSHOT/maven-metadata.xml
Downloaded: http://repository.apache.org/snapshots/org/apache/james/apache-james-mailbox-jcr/0.2-M2-SNAPSHOT/maven-metadata.xml (1014 B at 10.9 KB/sec)
Downloading: http://download.java.net/maven/2/org/apache/james/apache-james-mailbox-jcr/0.2-M2-SNAPSHOT/apache-james-mailbox-jcr-0.2-M2-20110307.041201-175.pom
Downloading: http://repository.apache.org/snapshots/org/apache/james/apache-james-mailbox-jcr/0.2-M2-SNAPSHOT/apache-james-mailbox-jcr-0.2-M2-20110307.041201-175.pom
Downloaded: http://repository.apache.org/snapshots/org/apache/james/apache-james-mailbox-jcr/0.2-M2-SNAPSHOT/apache-james-mailbox-jcr-0.2-M2-20110307.041201-175.pom (4 KB at 40.8 KB/sec)
Downloading: http://repository.apache.org/snapshots/org/apache/james/apache-james-mailbox-store/0.2-M2-SNAPSHOT/maven-metadata.xml
Downloading: http://download.java.net/maven/2/org/apache/james/apache-james-mailbox-store/0.2-M2-SNAPSHOT/maven-metadata.xml
Downloaded: http://repository.apache.org/snapshots/org/apache/james/apache-james-mailbox-store/0.2-M2-SNAPSHOT/maven-metadata.xml (1016 B at 10.8 KB/sec)
Downloading: http://download.java.net/maven/2/org/apache/james/apache-james-mailbox-jpa/0.2-M2-SNAPSHOT/maven-metadata.xml
Downloading: http://repository.apache.org/snapshots/org/apache/james/apache-james-mailbox-jpa/0.2-M2-SNAPSHOT/maven-metadata.xml
Downloaded: http://repository.apache.org/snapshots/org/apache/james/apache-james-mailbox-jpa/0.2-M2-SNAPSHOT/maven-metadata.xml (1014 B at 11.1 KB/sec)
Downloading: http://download.java.net/maven/2/org/apache/james/apache-james-mailbox-jpa/0.2-M2-SNAPSHOT/apache-james-mailbox-jpa-0.2-M2-20110307.040938-203.pom
Downloading: http://repository.apache.org/snapshots/org/apache/james/apache-james-mailbox-jpa/0.2-M2-SNAPSHOT/apache-james-mailbox-jpa-0.2-M2-20110307.040938-203.pom
Downloaded: http://repository.apache.org/snapshots/org/apache/james/apache-james-mailbox-jpa/0.2-M2-SNAPSHOT/apache-james-mailbox-jpa-0.2-M2-20110307.040938-203.pom (5 KB at 54.5 KB/sec)
Downloading: http://download.java.net/maven/2/org/apache/james/apache-james-mailbox-maildir/0.2-M2-SNAPSHOT/maven-metadata.xml
Downloading: http://repository.apache.org/snapshots/org/apache/james/apache-james-mailbox-maildir/0.2-M2-SNAPSHOT/maven-metadata.xml
Downloaded: http://repository.apache.org/snapshots/org/apache/james/apache-james-mailbox-maildir/0.2-M2-SNAPSHOT/maven-metadata.xml (1018 B at 10.2 KB/sec)
Downloading: http://download.java.net/maven/2/org/apache/james/apache-james-mailbox-maildir/0.2-M2-SNAPSHOT/apache-james-mailbox-maildir-0.2-M2-20110307.041356-160.pom
Downloading: http://repository.apache.org/snapshots/org/apache/james/apache-james-mailbox-maildir/0.2-M2-SNAPSHOT/apache-james-mailbox-maildir-0.2-M2-20110307.041356-160.pom
Downloaded: http://repository.apache.org/snapshots/org/apache/james/apache-james-mailbox-maildir/0.2-M2-SNAPSHOT/apache-james-mailbox-maildir-0.2-M2-20110307.041356-160.pom (4 KB at 37.2 KB/sec)
Downloading: http://download.java.net/maven/2/org/apache/james/apache-james-mailbox-memory/0.2-M2-SNAPSHOT/maven-metadata.xml
Downloading: http://repository.apache.org/snapshots/org/apache/james/apache-james-mailbox-memory/0.2-M2-SNAPSHOT/maven-metadata.xml
Downloaded: http://repository.apache.org/snapshots/org/apache/james/apache-james-mailbox-memory/0.2-M2-SNAPSHOT/maven-metadata.xml (1017 B at 11.0 KB/sec)
Downloading: http://download.java.net/maven/2/org/apache/james/apache-james-mailbox-memory/0.2-M2-SNAPSHOT/apache-james-mailbox-memory-0.2-M2-20110307.040832-206.pom
Downloading: http://repository.apache.org/snapshots/org/apache/james/apache-james-mailbox-memory/0.2-M2-SNAPSHOT/apache-james-mailbox-memory-0.2-M2-20110307.040832-206.pom
Downloaded: http://repository.apache.org/snapshots/org/apache/james/apache-james-mailbox-memory/0.2-M2-SNAPSHOT/apache-james-mailbox-memory-0.2-M2-20110307.040832-206.pom (3 KB at 29.0 KB/sec)
Downloading: http://repository.apache.org/snapshots/org/apache/james/apache-james-imap-api/0.2-M2-SNAPSHOT/apache-james-imap-api-0.2-M2-20110307.042036-288.jar
Downloading: http://repository.apache.org/snapshots/org/apache/james/apache-james-mailbox-api/0.2-M2-SNAPSHOT/apache-james-mailbox-api-0.2-M2-20110307.040625-228.jar
Downloading: http://repository.apache.org/snapshots/org/apache/james/apache-james-imap-message/0.2-M2-SNAPSHOT/apache-james-imap-message-0.2-M2-20110307.042140-283.jar
Downloading: http://repository.apache.org/snapshots/org/apache/james/apache-james-mailbox-store/0.2-M2-SNAPSHOT/apache-james-mailbox-store-0.2-M2-20110307.040731-227-tests.jar
Downloading: http://repository.apache.org/snapshots/org/apache/james/apache-james-imap-processor/0.2-M2-SNAPSHOT/apache-james-imap-processor-0.2-M2-20110307.042246-280.jar
Downloaded: http://repository.apache.org/snapshots/org/apache/james/apache-james-imap-api/0.2-M2-SNAPSHOT/apache-james-imap-api-0.2-M2-20110307.042036-288.jar (41 KB at 197.1 KB/sec)
Downloading: http://repository.apache.org/snapshots/org/apache/james/apache-james-mailbox-jcr/0.2-M2-SNAPSHOT/apache-james-mailbox-jcr-0.2-M2-20110307.041201-175.jar
Downloaded: http://repository.apache.org/snapshots/org/apache/james/apache-james-mailbox-store/0.2-M2-SNAPSHOT/apache-james-mailbox-store-0.2-M2-20110307.040731-227-tests.jar (38 KB at 164.8 KB/sec)
Downloading: http://repository.apache.org/snapshots/org/apache/james/apache-james-mailbox-store/0.2-M2-SNAPSHOT/apache-james-mailbox-store-0.2-M2-20110307.040731-227.jar
Downloaded: http://repository.apache.org/snapshots/org/apache/james/apache-james-mailbox-api/0.2-M2-SNAPSHOT/apache-james-mailbox-api-0.2-M2-20110307.040625-228.jar (78 KB at 252.0 KB/sec)
Downloading: http://repository.apache.org/snapshots/org/apache/james/apache-james-mailbox-jpa/0.2-M2-SNAPSHOT/apache-james-mailbox-jpa-0.2-M2-20110307.040938-203.jar
Downloaded: http://repository.apache.org/snapshots/org/apache/james/apache-james-imap-message/0.2-M2-SNAPSHOT/apache-james-imap-message-0.2-M2-20110307.042140-283.jar (160 KB at 486.5 KB/sec)
Downloading: http://repository.apache.org/snapshots/org/apache/james/apache-james-mailbox-maildir/0.2-M2-SNAPSHOT/apache-james-mailbox-maildir-0.2-M2-20110307.041356-160.jar
Downloaded: http://repository.apache.org/snapshots/org/apache/james/apache-james-imap-processor/0.2-M2-SNAPSHOT/apache-james-imap-processor-0.2-M2-20110307.042246-280.jar (117 KB at 349.8 KB/sec)
Downloading: http://repository.apache.org/snapshots/org/apache/james/apache-james-mailbox-memory/0.2-M2-SNAPSHOT/apache-james-mailbox-memory-0.2-M2-20110307.040832-206.jar
Downloaded: http://repository.apache.org/snapshots/org/apache/james/apache-james-mailbox-jcr/0.2-M2-SNAPSHOT/apache-james-mailbox-jcr-0.2-M2-20110307.041201-175.jar (57 KB at 379.1 KB/sec)
Downloaded: http://repository.apache.org/snapshots/org/apache/james/apache-james-mailbox-memory/0.2-M2-SNAPSHOT/apache-james-mailbox-memory-0.2-M2-20110307.040832-206.jar (31 KB at 304.2 KB/sec)
Downloaded: http://repository.apache.org/snapshots/org/apache/james/apache-james-mailbox-store/0.2-M2-SNAPSHOT/apache-james-mailbox-store-0.2-M2-20110307.040731-227.jar (124 KB at 567.9 KB/sec)
Downloaded: http://repository.apache.org/snapshots/org/apache/james/apache-james-mailbox-maildir/0.2-M2-SNAPSHOT/apache-james-mailbox-maildir-0.2-M2-20110307.041356-160.jar (64 KB at 525.6 KB/sec)
Downloaded: http://repository.apache.org/snapshots/org/apache/james/apache-james-mailbox-jpa/0.2-M2-SNAPSHOT/apache-james-mailbox-jpa-0.2-M2-20110307.040938-203.jar (74 KB at 427.1 KB/sec)
[INFO]
[INFO] --- maven-clean-plugin:2.3:clean (default-clean) @ apache-james-mailbox-integration-tester ---
[INFO] Deleting file set: <https://hudson.apache.org/hudson/job/mailbox-integration-tests/org.apache.james$apache-james-mailbox-integration-tester/ws/target> (included: [**], excluded: [])
[INFO]
[INFO] --- maven-remote-resources-plugin:1.1:process (default) @ apache-james-mailbox-integration-tester ---
[INFO] Setting property: classpath.resource.loader.class => 'org.codehaus.plexus.velocity.ContextClassLoaderResourceLoader'.
[INFO] Setting property: velocimacro.messages.on => 'false'.
[INFO] Setting property: resource.loader => 'classpath'.
[INFO] Setting property: resource.manager.logwhenfound => 'false'.
Downloading: http://download.java.net/maven/2/org/apache/james/apache-james-mailbox-api/0.2-M2-SNAPSHOT/maven-metadata.xml
Downloading: http://repository.apache.org/snapshots/org/apache/james/apache-james-mailbox-api/0.2-M2-SNAPSHOT/maven-metadata.xml
Downloaded: http://repository.apache.org/snapshots/org/apache/james/apache-james-mailbox-api/0.2-M2-SNAPSHOT/maven-metadata.xml (1014 B at 11.6 KB/sec)
Downloading: http://download.java.net/maven/2/org/apache/james/apache-james-imap-api/0.2-M2-SNAPSHOT/maven-metadata.xml
Downloading: http://repository.apache.org/snapshots/org/apache/james/apache-james-imap-api/0.2-M2-SNAPSHOT/maven-metadata.xml
Downloaded: http://repository.apache.org/snapshots/org/apache/james/apache-james-imap-api/0.2-M2-SNAPSHOT/maven-metadata.xml (1011 B at 11.1 KB/sec)
Downloading: http://download.java.net/maven/2/org/apache/james/apache-james-imap-message/0.2-M2-SNAPSHOT/maven-metadata.xml
Downloading: http://repository.apache.org/snapshots/org/apache/james/apache-james-imap-message/0.2-M2-SNAPSHOT/maven-metadata.xml
Downloaded: http://repository.apache.org/snapshots/org/apache/james/apache-james-imap-message/0.2-M2-SNAPSHOT/maven-metadata.xml (1015 B at 11.0 KB/sec)
Downloading: http://download.java.net/maven/2/org/apache/james/apache-james-mailbox-store/0.2-M2-SNAPSHOT/maven-metadata.xml
Downloading: http://repository.apache.org/snapshots/org/apache/james/apache-james-mailbox-store/0.2-M2-SNAPSHOT/maven-metadata.xml
Downloaded: http://repository.apache.org/snapshots/org/apache/james/apache-james-mailbox-store/0.2-M2-SNAPSHOT/maven-metadata.xml (1016 B at 10.9 KB/sec)
Downloading: http://download.java.net/maven/2/org/apache/james/apache-james-imap-processor/0.2-M2-SNAPSHOT/maven-metadata.xml
Downloading: http://repository.apache.org/snapshots/org/apache/james/apache-james-imap-processor/0.2-M2-SNAPSHOT/maven-metadata.xml
Downloaded: http://repository.apache.org/snapshots/org/apache/james/apache-james-imap-processor/0.2-M2-SNAPSHOT/maven-metadata.xml (1017 B at 11.3 KB/sec)
[INFO] [INFO] Using 'UTF-8' encoding to copy filtered resources.
[INFO] --- maven-resources-plugin:2.4:resources (default-resources) @ apache-james-mailbox-integration-tester ---
[INFO] Copying 113 resources
[INFO] Copying 3 resources
[INFO]
[INFO] --- maven-compiler-plugin:2.3.2:compile (default-compile) @ apache-james-mailbox-integration-tester ---
[INFO] Compiling 39 source files to <https://hudson.apache.org/hudson/job/mailbox-integration-tests/org.apache.james$apache-james-mailbox-integration-tester/ws/target/classes>
[INFO]
[INFO] --- maven-bundle-plugin:2.3.4:manifest (bundle-manifest) @ apache-james-mailbox-integration-tester ---
[WARNING] Embed-Dependency: clause "*;scope=runtime" did not match any dependencies
[INFO] [INFO] Using 'UTF-8' encoding to copy filtered resources.
[INFO] Copying 4 resources
[INFO] Copying 3 resources
[INFO] --- maven-resources-plugin:2.4:testResources (default-testResources) @ apache-james-mailbox-integration-tester ---
[INFO]
[INFO] --- maven-compiler-plugin:2.3.2:testCompile (default-testCompile) @ apache-james-mailbox-integration-tester ---
[INFO] Compiling 76 source files to <https://hudson.apache.org/hudson/job/mailbox-integration-tests/org.apache.james$apache-james-mailbox-integration-tester/ws/target/test-classes>
[INFO]
[INFO] --- maven-surefire-plugin:2.7.2:test (default-test) @ apache-james-mailbox-integration-tester ---
[INFO] Surefire report directory: <https://hudson.apache.org/hudson/job/mailbox-integration-tests/org.apache.james$apache-james-mailbox-integration-tester/ws/target/surefire-reports>
-------------------------------------------------------
T E S T S
-------------------------------------------------------
Running org.apache.james.mailbox.jcr.imap.SearchTest
Tests run: 6, Failures: 0, Errors: 0, Skipped: 0, Time elapsed: 20.406 sec
Running org.apache.james.mailbox.jcr.imap.ListingTest
Tests run: 6, Failures: 0, Errors: 0, Skipped: 0, Time elapsed: 7.998 sec
Running org.apache.james.mailbox.jcr.imap.UidSearchTest
Tests run: 6, Failures: 0, Errors: 0, Skipped: 0, Time elapsed: 25.312 sec
Running org.apache.james.mailbox.jcr.imap.SecurityTest
Tests run: 21, Failures: 0, Errors: 0, Skipped: 0, Time elapsed: 9.546 sec
Running org.apache.james.mailbox.jcr.imap.RenameTest
Tests run: 9, Failures: 0, Errors: 0, Skipped: 0, Time elapsed: 21.628 sec
Running org.apache.james.mailbox.jcr.imap.FetchBodySectionTest
Tests run: 9, Failures: 0, Errors: 0, Skipped: 0, Time elapsed: 12.617 sec
Running org.apache.james.mailbox.jcr.imap.AuthenticatedStateTest
Tests run: 57, Failures: 0, Errors: 0, Skipped: 0, Time elapsed: 23.855 sec
Running org.apache.james.mailbox.jcr.imap.SelectedStateTest
Tests run: 30, Failures: 0, Errors: 0, Skipped: 0, Time elapsed: 21.272 sec
Running org.apache.james.mailbox.jcr.imap.ConcurrentSessionsTest
Tests run: 21, Failures: 0, Errors: 3, Skipped: 0, Time elapsed: 15.363 sec <<< FAILURE!
Running org.apache.james.mailbox.jcr.imap.ExpungeTest
Tests run: 3, Failures: 0, Errors: 0, Skipped: 0, Time elapsed: 9.439 sec
Running org.apache.james.mailbox.jcr.imap.SelectedInboxTest
Tests run: 42, Failures: 0, Errors: 0, Skipped: 0, Time elapsed: 19.021 sec
Running org.apache.james.mailbox.jcr.imap.SelectTest
Tests run: 3, Failures: 0, Errors: 0, Skipped: 0, Time elapsed: 6.559 sec
Running org.apache.james.mailbox.jcr.imap.NonAuthenticatedStateTest
Tests run: 21, Failures: 0, Errors: 0, Skipped: 0, Time elapsed: 9.772 sec
Running org.apache.james.mailbox.jcr.imap.FetchTest
Tests run: 24, Failures: 0, Errors: 0, Skipped: 0, Time elapsed: 19.969 sec
Running org.apache.james.mailbox.jcr.imap.FetchBodyStructureTest
Tests run: 12, Failures: 0, Errors: 0, Skipped: 0, Time elapsed: 18.15 sec
Running org.apache.james.mailbox.jcr.imap.FetchHeadersTest
Tests run: 6, Failures: 0, Errors: 0, Skipped: 0, Time elapsed: 13.351 sec
Running org.apache.james.mailbox.jcr.imap.EventTest
Tests run: 3, Failures: 0, Errors: 0, Skipped: 0, Time elapsed: 7.718 sec
Running org.apache.james.mailbox.jcr.imap.PartialFetchTest
Tests run: 12, Failures: 0, Errors: 0, Skipped: 0, Time elapsed: 14.258 sec
Running org.apache.james.mailbox.jpa.imap.SearchTest
Tests run: 6, Failures: 0, Errors: 0, Skipped: 0, Time elapsed: 11.393 sec
Running org.apache.james.mailbox.jpa.imap.ListingTest
Tests run: 6, Failures: 0, Errors: 0, Skipped: 0, Time elapsed: 2.657 sec
Running org.apache.james.mailbox.jpa.imap.UidSearchTest
Tests run: 6, Failures: 0, Errors: 0, Skipped: 0, Time elapsed: 13.394 sec
Running org.apache.james.mailbox.jpa.imap.SecurityTest
Tests run: 21, Failures: 0, Errors: 0, Skipped: 0, Time elapsed: 1.949 sec
Running org.apache.james.mailbox.jpa.imap.RenameTest
Tests run: 9, Failures: 0, Errors: 0, Skipped: 0, Time elapsed: 7.144 sec
Running org.apache.james.mailbox.jpa.imap.FetchBodySectionTest
Tests run: 9, Failures: 0, Errors: 0, Skipped: 0, Time elapsed: 4.458 sec
Running org.apache.james.mailbox.jpa.imap.AuthenticatedStateTest
Tests run: 57, Failures: 0, Errors: 0, Skipped: 0, Time elapsed: 4.75 sec
Running org.apache.james.mailbox.jpa.imap.SelectedStateTest
Tests run: 30, Failures: 0, Errors: 0, Skipped: 0, Time elapsed: 6.315 sec
Running org.apache.james.mailbox.jpa.imap.ConcurrentSessionsTest
Tests run: 21, Failures: 0, Errors: 3, Skipped: 0, Time elapsed: 4.568 sec <<< FAILURE!
Running org.apache.james.mailbox.jpa.imap.ExpungeTest
Tests run: 3, Failures: 0, Errors: 0, Skipped: 0, Time elapsed: 3.986 sec
Running org.apache.james.mailbox.jpa.imap.SelectedInboxTest
Tests run: 42, Failures: 0, Errors: 0, Skipped: 0, Time elapsed: 4.442 sec
Running org.apache.james.mailbox.jpa.imap.SelectTest
Tests run: 3, Failures: 0, Errors: 0, Skipped: 0, Time elapsed: 2.82 sec
Running org.apache.james.mailbox.jpa.imap.NonAuthenticatedStateTest
Tests run: 21, Failures: 0, Errors: 0, Skipped: 0, Time elapsed: 2.106 sec
Running org.apache.james.mailbox.jpa.imap.FetchTest
Tests run: 24, Failures: 0, Errors: 0, Skipped: 0, Time elapsed: 5.727 sec
Running org.apache.james.mailbox.jpa.imap.FetchBodyStructureTest
Tests run: 12, Failures: 0, Errors: 0, Skipped: 0, Time elapsed: 7.7 sec
Running org.apache.james.mailbox.jpa.imap.FetchHeadersTest
Tests run: 6, Failures: 0, Errors: 0, Skipped: 0, Time elapsed: 4.727 sec
Running org.apache.james.mailbox.jpa.imap.EventTest
Tests run: 3, Failures: 0, Errors: 0, Skipped: 0, Time elapsed: 3.078 sec
Running org.apache.james.mailbox.jpa.imap.PartialFetchTest
Tests run: 12, Failures: 0, Errors: 0, Skipped: 0, Time elapsed: 5.373 sec
Running org.apache.james.mailbox.maildir.imap.ListingTest
Tests run: 6, Failures: 0, Errors: 0, Skipped: 0, Time elapsed: 0.594 sec
Running org.apache.james.mailbox.maildir.imap.UidSearchTest
Tests run: 6, Failures: 0, Errors: 0, Skipped: 0, Time elapsed: 3.513 sec
Running org.apache.james.mailbox.maildir.imap.SecurityTest
Tests run: 21, Failures: 0, Errors: 0, Skipped: 0, Time elapsed: 0.334 sec
Running org.apache.james.mailbox.maildir.imap.RenameTest
Tests run: 9, Failures: 0, Errors: 0, Skipped: 0, Time elapsed: 1.772 sec
Running org.apache.james.mailbox.maildir.imap.FetchBodySectionTest
Tests run: 9, Failures: 0, Errors: 0, Skipped: 0, Time elapsed: 1.148 sec
Running org.apache.james.mailbox.maildir.imap.AuthenticatedStateTest
Tests run: 57, Failures: 0, Errors: 0, Skipped: 0, Time elapsed: 1.274 sec
Running org.apache.james.mailbox.maildir.imap.SelectedStateTest
Tests run: 30, Failures: 0, Errors: 0, Skipped: 0, Time elapsed: 1.555 sec
Running org.apache.james.mailbox.maildir.imap.ConcurrentSessionsTest
Tests run: 21, Failures: 0, Errors: 0, Skipped: 0, Time elapsed: 1.205 sec
Running org.apache.james.mailbox.maildir.imap.ExpungeTest
Tests run: 3, Failures: 0, Errors: 0, Skipped: 0, Time elapsed: 0.931 sec
Running org.apache.james.mailbox.maildir.imap.SelectedInboxTest
Tests run: 42, Failures: 0, Errors: 0, Skipped: 0, Time elapsed: 1.286 sec
Running org.apache.james.mailbox.maildir.imap.SelectTest
Tests run: 3, Failures: 0, Errors: 0, Skipped: 0, Time elapsed: 0.732 sec
Running org.apache.james.mailbox.maildir.imap.NonAuthenticatedStateTest
Tests run: 21, Failures: 0, Errors: 0, Skipped: 0, Time elapsed: 0.392 sec
Running org.apache.james.mailbox.maildir.imap.FetchTest
Tests run: 24, Failures: 0, Errors: 0, Skipped: 0, Time elapsed: 1.556 sec
Running org.apache.james.mailbox.maildir.imap.FetchBodyStructureTest
Tests run: 12, Failures: 0, Errors: 0, Skipped: 0, Time elapsed: 2.205 sec
Running org.apache.james.mailbox.maildir.imap.FetchHeadersTest
Tests run: 6, Failures: 0, Errors: 0, Skipped: 0, Time elapsed: 1.192 sec
Running org.apache.james.mailbox.maildir.imap.EventTest
Tests run: 3, Failures: 0, Errors: 0, Skipped: 0, Time elapsed: 0.719 sec
Running org.apache.james.mailbox.maildir.imap.PartialFetchTest
Tests run: 12, Failures: 0, Errors: 0, Skipped: 0, Time elapsed: 1.414 sec
Running org.apache.james.mailbox.inmemory.imap.SearchTest
Tests run: 6, Failures: 0, Errors: 0, Skipped: 0, Time elapsed: 2.03 sec
Running org.apache.james.mailbox.inmemory.imap.ListingTest
Tests run: 6, Failures: 0, Errors: 0, Skipped: 0, Time elapsed: 0.37 sec
Running org.apache.james.mailbox.inmemory.imap.UidSearchTest
Tests run: 6, Failures: 0, Errors: 0, Skipped: 0, Time elapsed: 2.076 sec
Running org.apache.james.mailbox.inmemory.imap.SecurityTest
Tests run: 21, Failures: 0, Errors: 0, Skipped: 0, Time elapsed: 0.324 sec
Running org.apache.james.mailbox.inmemory.imap.RenameTest
Tests run: 9, Failures: 0, Errors: 0, Skipped: 0, Time elapsed: 1.084 sec
Running org.apache.james.mailbox.inmemory.imap.FetchBodySectionTest
Tests run: 9, Failures: 0, Errors: 0, Skipped: 0, Time elapsed: 0.911 sec
Running org.apache.james.mailbox.inmemory.imap.AuthenticatedStateTest
Tests run: 57, Failures: 0, Errors: 0, Skipped: 0, Time elapsed: 0.976 sec
Running org.apache.james.mailbox.inmemory.imap.SelectedStateTest
Tests run: 30, Failures: 0, Errors: 0, Skipped: 0, Time elapsed: 1.055 sec
Running org.apache.james.mailbox.inmemory.imap.ConcurrentSessionsTest
Tests run: 21, Failures: 0, Errors: 0, Skipped: 0, Time elapsed: 0.802 sec
Running org.apache.james.mailbox.inmemory.imap.ExpungeTest
Tests run: 3, Failures: 0, Errors: 0, Skipped: 0, Time elapsed: 0.713 sec
Running org.apache.james.mailbox.inmemory.imap.SelectedInboxTest
Tests run: 42, Failures: 0, Errors: 0, Skipped: 0, Time elapsed: 1.002 sec
Running org.apache.james.mailbox.inmemory.imap.SelectTest
Tests run: 3, Failures: 0, Errors: 0, Skipped: 0, Time elapsed: 0.626 sec
Running org.apache.james.mailbox.inmemory.imap.NonAuthenticatedStateTest
Tests run: 21, Failures: 0, Errors: 0, Skipped: 0, Time elapsed: 0.379 sec
Running org.apache.james.mailbox.inmemory.imap.FetchTest
Tests run: 24, Failures: 0, Errors: 0, Skipped: 0, Time elapsed: 1.207 sec
Running org.apache.james.mailbox.inmemory.imap.FetchBodyStructureTest
Tests run: 12, Failures: 0, Errors: 0, Skipped: 0, Time elapsed: 1.591 sec
Running org.apache.james.mailbox.inmemory.imap.FetchHeadersTest
Tests run: 6, Failures: 0, Errors: 0, Skipped: 0, Time elapsed: 0.855 sec
Running org.apache.james.mailbox.inmemory.imap.EventTest
Tests run: 3, Failures: 0, Errors: 0, Skipped: 0, Time elapsed: 0.61 sec
Running org.apache.james.mailbox.inmemory.imap.PartialFetchTest
Tests run: 12, Failures: 0, Errors: 0, Skipped: 0, Time elapsed: 1.04 sec
Results :
Tests in error:
Tests run: 1158, Failures: 0, Errors: 6, Skipped: 0
mojoFailed org.apache.maven.plugins:maven-surefire-plugin:2.7.2(default-test)
[JENKINS] Recording test results
projectFailed org.apache.james:apache-james-mailbox-integration-tester:0.2-M2-SNAPSHOT
---------------------------------------------------------------------
To unsubscribe, e-mail: server-dev-unsubscribe@james.apache.org
For additional commands, e-mail: server-dev-help@james.apache.org
Build failed in Jenkins: mailbox-integration-tests » Apache James Mailbox Integration Tester #151
Posted by Apache Hudson Server <hu...@hudson.apache.org>.
See <https://hudson.apache.org/hudson/job/mailbox-integration-tests/org.apache.james$apache-james-mailbox-integration-tester/151/>
------------------------------------------
[...truncated 17 lines...]
Downloaded: http://repository.apache.org/snapshots/org/apache/james/apache-james-imap/0.2-M2-SNAPSHOT/apache-james-imap-0.2-M2-20110307.000416-264.pom (21 KB at 128.5 KB/sec)
Downloading: http://download.java.net/maven/2/org/apache/james/apache-james-mailbox-api/0.2-M2-SNAPSHOT/maven-metadata.xml
Downloading: http://repository.apache.org/snapshots/org/apache/james/apache-james-mailbox-api/0.2-M2-SNAPSHOT/maven-metadata.xml
Downloaded: http://repository.apache.org/snapshots/org/apache/james/apache-james-mailbox-api/0.2-M2-SNAPSHOT/maven-metadata.xml (1014 B at 10.3 KB/sec)
Downloading: http://download.java.net/maven/2/org/apache/james/apache-james-mailbox/0.2-M2-SNAPSHOT/maven-metadata.xml
Downloading: http://repository.apache.org/snapshots/org/apache/james/apache-james-mailbox/0.2-M2-SNAPSHOT/maven-metadata.xml
Downloaded: http://repository.apache.org/snapshots/org/apache/james/apache-james-mailbox/0.2-M2-SNAPSHOT/maven-metadata.xml (828 B at 6.0 KB/sec)
Downloading: http://download.java.net/maven/2/org/apache/james/apache-james-imap-message/0.2-M2-SNAPSHOT/maven-metadata.xml
Downloading: http://repository.apache.org/snapshots/org/apache/james/apache-james-imap-message/0.2-M2-SNAPSHOT/maven-metadata.xml
Downloaded: http://repository.apache.org/snapshots/org/apache/james/apache-james-imap-message/0.2-M2-SNAPSHOT/maven-metadata.xml (1015 B at 7.9 KB/sec)
Downloading: http://download.java.net/maven/2/org/apache/james/apache-james-imap-message/0.2-M2-SNAPSHOT/apache-james-imap-message-0.2-M2-20110307.000637-282.pom
Downloading: http://repository.apache.org/snapshots/org/apache/james/apache-james-imap-message/0.2-M2-SNAPSHOT/apache-james-imap-message-0.2-M2-20110307.000637-282.pom
Downloaded: http://repository.apache.org/snapshots/org/apache/james/apache-james-imap-message/0.2-M2-SNAPSHOT/apache-james-imap-message-0.2-M2-20110307.000637-282.pom (3 KB at 27.5 KB/sec)
Downloading: http://download.java.net/maven/2/org/apache/james/apache-james-imap-processor/0.2-M2-SNAPSHOT/maven-metadata.xml
Downloading: http://repository.apache.org/snapshots/org/apache/james/apache-james-imap-processor/0.2-M2-SNAPSHOT/maven-metadata.xml
Downloaded: http://repository.apache.org/snapshots/org/apache/james/apache-james-imap-processor/0.2-M2-SNAPSHOT/maven-metadata.xml (1017 B at 9.1 KB/sec)
Downloading: http://download.java.net/maven/2/org/apache/james/apache-james-imap-processor/0.2-M2-SNAPSHOT/apache-james-imap-processor-0.2-M2-20110307.000736-279.pom
Downloading: http://repository.apache.org/snapshots/org/apache/james/apache-james-imap-processor/0.2-M2-SNAPSHOT/apache-james-imap-processor-0.2-M2-20110307.000736-279.pom
Downloaded: http://repository.apache.org/snapshots/org/apache/james/apache-james-imap-processor/0.2-M2-SNAPSHOT/apache-james-imap-processor-0.2-M2-20110307.000736-279.pom (2 KB at 22.5 KB/sec)
Downloading: http://download.java.net/maven/2/org/apache/james/apache-james-mailbox-store/0.2-M2-SNAPSHOT/maven-metadata.xml
Downloading: http://repository.apache.org/snapshots/org/apache/james/apache-james-mailbox-store/0.2-M2-SNAPSHOT/maven-metadata.xml
Downloaded: http://repository.apache.org/snapshots/org/apache/james/apache-james-mailbox-store/0.2-M2-SNAPSHOT/maven-metadata.xml (1016 B at 7.8 KB/sec)
Downloading: http://repository.apache.org/snapshots/org/apache/james/apache-james-mailbox-jcr/0.2-M2-SNAPSHOT/maven-metadata.xml
Downloading: http://download.java.net/maven/2/org/apache/james/apache-james-mailbox-jcr/0.2-M2-SNAPSHOT/maven-metadata.xml
Downloaded: http://repository.apache.org/snapshots/org/apache/james/apache-james-mailbox-jcr/0.2-M2-SNAPSHOT/maven-metadata.xml (1014 B at 6.2 KB/sec)
Downloading: http://download.java.net/maven/2/org/apache/james/apache-james-mailbox-store/0.2-M2-SNAPSHOT/maven-metadata.xml
Downloading: http://repository.apache.org/snapshots/org/apache/james/apache-james-mailbox-store/0.2-M2-SNAPSHOT/maven-metadata.xml
Downloaded: http://repository.apache.org/snapshots/org/apache/james/apache-james-mailbox-store/0.2-M2-SNAPSHOT/maven-metadata.xml (1016 B at 10.4 KB/sec)
Downloading: http://download.java.net/maven/2/org/apache/james/apache-james-mailbox-jpa/0.2-M2-SNAPSHOT/maven-metadata.xml
Downloading: http://repository.apache.org/snapshots/org/apache/james/apache-james-mailbox-jpa/0.2-M2-SNAPSHOT/maven-metadata.xml
Downloaded: http://repository.apache.org/snapshots/org/apache/james/apache-james-mailbox-jpa/0.2-M2-SNAPSHOT/maven-metadata.xml (1014 B at 7.0 KB/sec)
Downloading: http://download.java.net/maven/2/org/apache/james/apache-james-mailbox-maildir/0.2-M2-SNAPSHOT/maven-metadata.xml
Downloading: http://repository.apache.org/snapshots/org/apache/james/apache-james-mailbox-maildir/0.2-M2-SNAPSHOT/maven-metadata.xml
Downloaded: http://repository.apache.org/snapshots/org/apache/james/apache-james-mailbox-maildir/0.2-M2-SNAPSHOT/maven-metadata.xml (1018 B at 7.5 KB/sec)
Downloading: http://download.java.net/maven/2/org/apache/james/apache-james-mailbox-memory/0.2-M2-SNAPSHOT/maven-metadata.xml
Downloading: http://repository.apache.org/snapshots/org/apache/james/apache-james-mailbox-memory/0.2-M2-SNAPSHOT/maven-metadata.xml
Downloaded: http://repository.apache.org/snapshots/org/apache/james/apache-james-mailbox-memory/0.2-M2-SNAPSHOT/maven-metadata.xml (1017 B at 7.1 KB/sec)
Downloading: http://repository.apache.org/snapshots/org/apache/james/apache-james-imap-api/0.2-M2-SNAPSHOT/apache-james-imap-api-0.2-M2-20110307.000546-287.jar
Downloading: http://repository.apache.org/snapshots/org/apache/james/apache-james-imap-message/0.2-M2-SNAPSHOT/apache-james-imap-message-0.2-M2-20110307.000637-282.jar
Downloading: http://repository.apache.org/snapshots/org/apache/james/apache-james-imap-processor/0.2-M2-SNAPSHOT/apache-james-imap-processor-0.2-M2-20110307.000736-279.jar
Downloaded: http://repository.apache.org/snapshots/org/apache/james/apache-james-imap-api/0.2-M2-SNAPSHOT/apache-james-imap-api-0.2-M2-20110307.000546-287.jar (41 KB at 212.3 KB/sec)
Downloaded: http://repository.apache.org/snapshots/org/apache/james/apache-james-imap-message/0.2-M2-SNAPSHOT/apache-james-imap-message-0.2-M2-20110307.000637-282.jar (160 KB at 491.2 KB/sec)
Downloaded: http://repository.apache.org/snapshots/org/apache/james/apache-james-imap-processor/0.2-M2-SNAPSHOT/apache-james-imap-processor-0.2-M2-20110307.000736-279.jar (117 KB at 330.3 KB/sec)
[INFO]
[INFO] --- maven-clean-plugin:2.3:clean (default-clean) @ apache-james-mailbox-integration-tester ---
[INFO] Deleting file set: <https://hudson.apache.org/hudson/job/mailbox-integration-tests/org.apache.james$apache-james-mailbox-integration-tester/ws/target> (included: [**], excluded: [])
[INFO]
[INFO] --- maven-remote-resources-plugin:1.1:process (default) @ apache-james-mailbox-integration-tester ---
[INFO] Setting property: classpath.resource.loader.class => 'org.codehaus.plexus.velocity.ContextClassLoaderResourceLoader'.
[INFO] Setting property: velocimacro.messages.on => 'false'.
[INFO] Setting property: resource.loader => 'classpath'.
[INFO] Setting property: resource.manager.logwhenfound => 'false'.
Downloading: http://download.java.net/maven/2/org/apache/james/apache-james-mailbox-api/0.2-M2-SNAPSHOT/maven-metadata.xml
Downloading: http://repository.apache.org/snapshots/org/apache/james/apache-james-mailbox-api/0.2-M2-SNAPSHOT/maven-metadata.xml
Downloaded: http://repository.apache.org/snapshots/org/apache/james/apache-james-mailbox-api/0.2-M2-SNAPSHOT/maven-metadata.xml (1014 B at 10.8 KB/sec)
Downloading: http://download.java.net/maven/2/org/apache/james/apache-james-imap-api/0.2-M2-SNAPSHOT/maven-metadata.xml
Downloading: http://repository.apache.org/snapshots/org/apache/james/apache-james-imap-api/0.2-M2-SNAPSHOT/maven-metadata.xml
Downloaded: http://repository.apache.org/snapshots/org/apache/james/apache-james-imap-api/0.2-M2-SNAPSHOT/maven-metadata.xml (1011 B at 11.2 KB/sec)
Downloading: http://download.java.net/maven/2/org/apache/james/apache-james-imap-message/0.2-M2-SNAPSHOT/maven-metadata.xml
Downloading: http://repository.apache.org/snapshots/org/apache/james/apache-james-imap-message/0.2-M2-SNAPSHOT/maven-metadata.xml
Downloaded: http://repository.apache.org/snapshots/org/apache/james/apache-james-imap-message/0.2-M2-SNAPSHOT/maven-metadata.xml (1015 B at 11.5 KB/sec)
Downloading: http://download.java.net/maven/2/org/apache/james/apache-james-mailbox-store/0.2-M2-SNAPSHOT/maven-metadata.xml
Downloading: http://repository.apache.org/snapshots/org/apache/james/apache-james-mailbox-store/0.2-M2-SNAPSHOT/maven-metadata.xml
Downloaded: http://repository.apache.org/snapshots/org/apache/james/apache-james-mailbox-store/0.2-M2-SNAPSHOT/maven-metadata.xml (1016 B at 11.5 KB/sec)
Downloading: http://download.java.net/maven/2/org/apache/james/apache-james-imap-processor/0.2-M2-SNAPSHOT/maven-metadata.xml
Downloading: http://repository.apache.org/snapshots/org/apache/james/apache-james-imap-processor/0.2-M2-SNAPSHOT/maven-metadata.xml
Downloaded: http://repository.apache.org/snapshots/org/apache/james/apache-james-imap-processor/0.2-M2-SNAPSHOT/maven-metadata.xml (1017 B at 10.6 KB/sec)
[INFO]
[INFO] --- maven-resources-plugin:2.4:resources (default-resources) @ apache-james-mailbox-integration-tester ---
[INFO] Using 'UTF-8' encoding to copy filtered resources.
[INFO] Copying 113 resources
[INFO] Copying 3 resources
[INFO]
[INFO] --- maven-compiler-plugin:2.3.2:compile (default-compile) @ apache-james-mailbox-integration-tester ---
[INFO] Compiling 39 source files to <https://hudson.apache.org/hudson/job/mailbox-integration-tests/org.apache.james$apache-james-mailbox-integration-tester/ws/target/classes>
[INFO]
[INFO] --- maven-bundle-plugin:2.3.4:manifest (bundle-manifest) @ apache-james-mailbox-integration-tester ---
[WARNING] Embed-Dependency: clause "*;scope=runtime" did not match any dependencies
[INFO] [INFO] Using 'UTF-8' encoding to copy filtered resources.
[INFO] Copying 4 resources
[INFO] Copying 3 resources
[INFO] --- maven-resources-plugin:2.4:testResources (default-testResources) @ apache-james-mailbox-integration-tester ---
[INFO]
[INFO] Compiling 76 source files to <https://hudson.apache.org/hudson/job/mailbox-integration-tests/org.apache.james$apache-james-mailbox-integration-tester/ws/target/test-classes>
[INFO] --- maven-compiler-plugin:2.3.2:testCompile (default-testCompile) @ apache-james-mailbox-integration-tester ---
[INFO]
[INFO] --- maven-surefire-plugin:2.7.2:test (default-test) @ apache-james-mailbox-integration-tester ---
[INFO] Surefire report directory: <https://hudson.apache.org/hudson/job/mailbox-integration-tests/org.apache.james$apache-james-mailbox-integration-tester/ws/target/surefire-reports>
-------------------------------------------------------
T E S T S
-------------------------------------------------------
Running org.apache.james.mailbox.jcr.imap.SearchTest
Tests run: 6, Failures: 0, Errors: 0, Skipped: 0, Time elapsed: 20.149 sec
Running org.apache.james.mailbox.jcr.imap.ListingTest
Tests run: 6, Failures: 0, Errors: 0, Skipped: 0, Time elapsed: 7.616 sec
Running org.apache.james.mailbox.jcr.imap.UidSearchTest
Tests run: 6, Failures: 0, Errors: 0, Skipped: 0, Time elapsed: 25.819 sec
Running org.apache.james.mailbox.jcr.imap.SecurityTest
Tests run: 21, Failures: 0, Errors: 0, Skipped: 0, Time elapsed: 9.264 sec
Running org.apache.james.mailbox.jcr.imap.RenameTest
Tests run: 9, Failures: 0, Errors: 0, Skipped: 0, Time elapsed: 20.487 sec
Running org.apache.james.mailbox.jcr.imap.FetchBodySectionTest
Tests run: 9, Failures: 0, Errors: 1, Skipped: 0, Time elapsed: 12.762 sec <<< FAILURE!
Location: /org/apache/james/imap/scripts/FetchMultipartMixedComplex.test:447
LastClientMsg: A18 FETCH 1 (BODY[4.1.MIME])
Expected: '\* 1 FETCH \(BODY\[4\.1\.MIME\] \{161\}'
Actual : 'A18 NO FETCH failed. Search failed.'
Running org.apache.james.mailbox.jcr.imap.AuthenticatedStateTest
Tests run: 57, Failures: 0, Errors: 0, Skipped: 0, Time elapsed: 23.857 sec
Running org.apache.james.mailbox.jcr.imap.SelectedStateTest
Tests run: 30, Failures: 0, Errors: 0, Skipped: 0, Time elapsed: 21.68 sec
Running org.apache.james.mailbox.jcr.imap.ConcurrentSessionsTest
Tests run: 21, Failures: 0, Errors: 3, Skipped: 0, Time elapsed: 14.689 sec <<< FAILURE!
Running org.apache.james.mailbox.jcr.imap.ExpungeTest
Tests run: 3, Failures: 0, Errors: 0, Skipped: 0, Time elapsed: 9.662 sec
Running org.apache.james.mailbox.jcr.imap.SelectedInboxTest
Tests run: 42, Failures: 0, Errors: 0, Skipped: 0, Time elapsed: 19.379 sec
Running org.apache.james.mailbox.jcr.imap.SelectTest
Tests run: 3, Failures: 0, Errors: 0, Skipped: 0, Time elapsed: 6.223 sec
Running org.apache.james.mailbox.jcr.imap.NonAuthenticatedStateTest
Tests run: 21, Failures: 0, Errors: 0, Skipped: 0, Time elapsed: 9.69 sec
Running org.apache.james.mailbox.jcr.imap.FetchTest
Tests run: 24, Failures: 0, Errors: 0, Skipped: 0, Time elapsed: 19.26 sec
Running org.apache.james.mailbox.jcr.imap.FetchBodyStructureTest
Tests run: 12, Failures: 0, Errors: 0, Skipped: 0, Time elapsed: 18.215 sec
Running org.apache.james.mailbox.jcr.imap.FetchHeadersTest
Tests run: 6, Failures: 0, Errors: 0, Skipped: 0, Time elapsed: 12.836 sec
Running org.apache.james.mailbox.jcr.imap.EventTest
Tests run: 3, Failures: 0, Errors: 0, Skipped: 0, Time elapsed: 6.115 sec
Running org.apache.james.mailbox.jcr.imap.PartialFetchTest
Tests run: 12, Failures: 0, Errors: 0, Skipped: 0, Time elapsed: 14.306 sec
Running org.apache.james.mailbox.jpa.imap.SearchTest
Tests run: 6, Failures: 0, Errors: 0, Skipped: 0, Time elapsed: 11.645 sec
Running org.apache.james.mailbox.jpa.imap.ListingTest
Tests run: 6, Failures: 0, Errors: 0, Skipped: 0, Time elapsed: 2.668 sec
Running org.apache.james.mailbox.jpa.imap.UidSearchTest
Tests run: 6, Failures: 0, Errors: 0, Skipped: 0, Time elapsed: 12.689 sec
Running org.apache.james.mailbox.jpa.imap.SecurityTest
Tests run: 21, Failures: 0, Errors: 0, Skipped: 0, Time elapsed: 1.885 sec
Running org.apache.james.mailbox.jpa.imap.RenameTest
Tests run: 9, Failures: 0, Errors: 0, Skipped: 0, Time elapsed: 6.789 sec
Running org.apache.james.mailbox.jpa.imap.FetchBodySectionTest
Tests run: 9, Failures: 0, Errors: 0, Skipped: 0, Time elapsed: 4.488 sec
Running org.apache.james.mailbox.jpa.imap.AuthenticatedStateTest
Tests run: 57, Failures: 0, Errors: 0, Skipped: 0, Time elapsed: 4.752 sec
Running org.apache.james.mailbox.jpa.imap.SelectedStateTest
Tests run: 30, Failures: 0, Errors: 0, Skipped: 0, Time elapsed: 6.105 sec
Running org.apache.james.mailbox.jpa.imap.ConcurrentSessionsTest
Tests run: 21, Failures: 0, Errors: 3, Skipped: 0, Time elapsed: 4.417 sec <<< FAILURE!
Running org.apache.james.mailbox.jpa.imap.ExpungeTest
Tests run: 3, Failures: 0, Errors: 0, Skipped: 0, Time elapsed: 3.743 sec
Running org.apache.james.mailbox.jpa.imap.SelectedInboxTest
Tests run: 42, Failures: 0, Errors: 0, Skipped: 0, Time elapsed: 4.295 sec
Running org.apache.james.mailbox.jpa.imap.SelectTest
Tests run: 3, Failures: 0, Errors: 0, Skipped: 0, Time elapsed: 2.748 sec
Running org.apache.james.mailbox.jpa.imap.NonAuthenticatedStateTest
Tests run: 21, Failures: 0, Errors: 0, Skipped: 0, Time elapsed: 1.971 sec
Running org.apache.james.mailbox.jpa.imap.FetchTest
Tests run: 24, Failures: 0, Errors: 0, Skipped: 0, Time elapsed: 5.842 sec
Running org.apache.james.mailbox.jpa.imap.FetchBodyStructureTest
Tests run: 12, Failures: 0, Errors: 0, Skipped: 0, Time elapsed: 7.448 sec
Running org.apache.james.mailbox.jpa.imap.FetchHeadersTest
Tests run: 6, Failures: 0, Errors: 0, Skipped: 0, Time elapsed: 4.582 sec
Running org.apache.james.mailbox.jpa.imap.EventTest
Tests run: 3, Failures: 0, Errors: 0, Skipped: 0, Time elapsed: 2.968 sec
Running org.apache.james.mailbox.jpa.imap.PartialFetchTest
Tests run: 12, Failures: 0, Errors: 0, Skipped: 0, Time elapsed: 5.039 sec
Running org.apache.james.mailbox.maildir.imap.ListingTest
Tests run: 6, Failures: 0, Errors: 0, Skipped: 0, Time elapsed: 0.578 sec
Running org.apache.james.mailbox.maildir.imap.UidSearchTest
Tests run: 6, Failures: 0, Errors: 0, Skipped: 0, Time elapsed: 3.484 sec
Running org.apache.james.mailbox.maildir.imap.SecurityTest
Tests run: 21, Failures: 0, Errors: 0, Skipped: 0, Time elapsed: 0.324 sec
Running org.apache.james.mailbox.maildir.imap.RenameTest
Tests run: 9, Failures: 0, Errors: 0, Skipped: 0, Time elapsed: 1.721 sec
Running org.apache.james.mailbox.maildir.imap.FetchBodySectionTest
Tests run: 9, Failures: 0, Errors: 0, Skipped: 0, Time elapsed: 1.126 sec
Running org.apache.james.mailbox.maildir.imap.AuthenticatedStateTest
Tests run: 57, Failures: 0, Errors: 0, Skipped: 0, Time elapsed: 1.268 sec
Running org.apache.james.mailbox.maildir.imap.SelectedStateTest
Tests run: 30, Failures: 0, Errors: 0, Skipped: 0, Time elapsed: 1.529 sec
Running org.apache.james.mailbox.maildir.imap.ConcurrentSessionsTest
Tests run: 21, Failures: 0, Errors: 0, Skipped: 0, Time elapsed: 1.152 sec
Running org.apache.james.mailbox.maildir.imap.ExpungeTest
Tests run: 3, Failures: 0, Errors: 0, Skipped: 0, Time elapsed: 0.862 sec
Running org.apache.james.mailbox.maildir.imap.SelectedInboxTest
Tests run: 42, Failures: 0, Errors: 0, Skipped: 0, Time elapsed: 1.179 sec
Running org.apache.james.mailbox.maildir.imap.SelectTest
Tests run: 3, Failures: 0, Errors: 0, Skipped: 0, Time elapsed: 0.743 sec
Running org.apache.james.mailbox.maildir.imap.NonAuthenticatedStateTest
Tests run: 21, Failures: 0, Errors: 0, Skipped: 0, Time elapsed: 0.38 sec
Running org.apache.james.mailbox.maildir.imap.FetchTest
Tests run: 24, Failures: 0, Errors: 0, Skipped: 0, Time elapsed: 1.47 sec
Running org.apache.james.mailbox.maildir.imap.FetchBodyStructureTest
Tests run: 12, Failures: 0, Errors: 0, Skipped: 0, Time elapsed: 2.129 sec
Running org.apache.james.mailbox.maildir.imap.FetchHeadersTest
Tests run: 6, Failures: 0, Errors: 0, Skipped: 0, Time elapsed: 1.117 sec
Running org.apache.james.mailbox.maildir.imap.EventTest
Tests run: 3, Failures: 0, Errors: 0, Skipped: 0, Time elapsed: 0.7 sec
Running org.apache.james.mailbox.maildir.imap.PartialFetchTest
Tests run: 12, Failures: 0, Errors: 0, Skipped: 0, Time elapsed: 1.406 sec
Running org.apache.james.mailbox.inmemory.imap.SearchTest
Tests run: 6, Failures: 0, Errors: 0, Skipped: 0, Time elapsed: 1.81 sec
Running org.apache.james.mailbox.inmemory.imap.ListingTest
Tests run: 6, Failures: 0, Errors: 0, Skipped: 0, Time elapsed: 0.384 sec
Running org.apache.james.mailbox.inmemory.imap.UidSearchTest
Tests run: 6, Failures: 0, Errors: 0, Skipped: 0, Time elapsed: 2.006 sec
Running org.apache.james.mailbox.inmemory.imap.SecurityTest
Tests run: 21, Failures: 0, Errors: 0, Skipped: 0, Time elapsed: 0.325 sec
Running org.apache.james.mailbox.inmemory.imap.RenameTest
Tests run: 9, Failures: 0, Errors: 0, Skipped: 0, Time elapsed: 1.141 sec
Running org.apache.james.mailbox.inmemory.imap.FetchBodySectionTest
Tests run: 9, Failures: 0, Errors: 0, Skipped: 0, Time elapsed: 0.905 sec
Running org.apache.james.mailbox.inmemory.imap.AuthenticatedStateTest
Tests run: 57, Failures: 0, Errors: 0, Skipped: 0, Time elapsed: 0.928 sec
Running org.apache.james.mailbox.inmemory.imap.SelectedStateTest
Tests run: 30, Failures: 0, Errors: 0, Skipped: 0, Time elapsed: 1.037 sec
Running org.apache.james.mailbox.inmemory.imap.ConcurrentSessionsTest
Tests run: 21, Failures: 0, Errors: 0, Skipped: 0, Time elapsed: 0.785 sec
Running org.apache.james.mailbox.inmemory.imap.ExpungeTest
Tests run: 3, Failures: 0, Errors: 0, Skipped: 0, Time elapsed: 0.667 sec
Running org.apache.james.mailbox.inmemory.imap.SelectedInboxTest
Tests run: 42, Failures: 0, Errors: 0, Skipped: 0, Time elapsed: 0.929 sec
Running org.apache.james.mailbox.inmemory.imap.SelectTest
Tests run: 3, Failures: 0, Errors: 0, Skipped: 0, Time elapsed: 0.632 sec
Running org.apache.james.mailbox.inmemory.imap.NonAuthenticatedStateTest
Tests run: 21, Failures: 0, Errors: 0, Skipped: 0, Time elapsed: 0.353 sec
Running org.apache.james.mailbox.inmemory.imap.FetchTest
Tests run: 24, Failures: 0, Errors: 0, Skipped: 0, Time elapsed: 1.072 sec
Running org.apache.james.mailbox.inmemory.imap.FetchBodyStructureTest
Tests run: 12, Failures: 0, Errors: 0, Skipped: 0, Time elapsed: 1.471 sec
Running org.apache.james.mailbox.inmemory.imap.FetchHeadersTest
Tests run: 6, Failures: 0, Errors: 0, Skipped: 0, Time elapsed: 0.834 sec
Running org.apache.james.mailbox.inmemory.imap.EventTest
Tests run: 3, Failures: 0, Errors: 0, Skipped: 0, Time elapsed: 0.589 sec
Running org.apache.james.mailbox.inmemory.imap.PartialFetchTest
Tests run: 12, Failures: 0, Errors: 0, Skipped: 0, Time elapsed: 0.994 sec
Results :
Tests in error:
Tests run: 1158, Failures: 0, Errors: 7, Skipped: 0
mojoFailed org.apache.maven.plugins:maven-surefire-plugin:2.7.2(default-test)
[JENKINS] Recording test results
projectFailed org.apache.james:apache-james-mailbox-integration-tester:0.2-M2-SNAPSHOT
---------------------------------------------------------------------
To unsubscribe, e-mail: server-dev-unsubscribe@james.apache.org
For additional commands, e-mail: server-dev-help@james.apache.org