You are viewing a plain text version of this content. The canonical link for it is here.
Posted to dev@lucene.apache.org by Policeman Jenkins Server <je...@thetaphi.de> on 2016/02/18 14:10:30 UTC
[JENKINS-EA] Lucene-Solr-5.x-Linux (64bit/jdk-9-ea+105) - Build #
15611 - Failure!
Build: http://jenkins.thetaphi.de/job/Lucene-Solr-5.x-Linux/15611/
Java: 64bit/jdk-9-ea+105 -XX:+UseCompressedOops -XX:+UseConcMarkSweepGC -XX:-UseSuperWord
1 tests failed.
FAILED: org.apache.lucene.search.TestDocValuesRewriteMethod.testRegexps
Error Message:
Unequal lengths: hits1=0,hits2=5
Stack Trace:
junit.framework.AssertionFailedError: Unequal lengths: hits1=0,hits2=5
at __randomizedtesting.SeedInfo.seed([84128289752C4422:654EC398AB8613AA]:0)
at junit.framework.Assert.fail(Assert.java:50)
at org.apache.lucene.search.CheckHits.checkEqual(CheckHits.java:211)
at org.apache.lucene.search.TestDocValuesRewriteMethod.assertSame(TestDocValuesRewriteMethod.java:124)
at org.apache.lucene.search.TestDocValuesRewriteMethod.testRegexps(TestDocValuesRewriteMethod.java:109)
at sun.reflect.NativeMethodAccessorImpl.invoke0(Native Method)
at sun.reflect.NativeMethodAccessorImpl.invoke(NativeMethodAccessorImpl.java:62)
at sun.reflect.DelegatingMethodAccessorImpl.invoke(DelegatingMethodAccessorImpl.java:43)
at java.lang.reflect.Method.invoke(Method.java:520)
at com.carrotsearch.randomizedtesting.RandomizedRunner.invoke(RandomizedRunner.java:1764)
at com.carrotsearch.randomizedtesting.RandomizedRunner$8.evaluate(RandomizedRunner.java:871)
at com.carrotsearch.randomizedtesting.RandomizedRunner$9.evaluate(RandomizedRunner.java:907)
at com.carrotsearch.randomizedtesting.RandomizedRunner$10.evaluate(RandomizedRunner.java:921)
at org.apache.lucene.util.TestRuleSetupTeardownChained$1.evaluate(TestRuleSetupTeardownChained.java:49)
at org.apache.lucene.util.AbstractBeforeAfterRule$1.evaluate(AbstractBeforeAfterRule.java:45)
at org.apache.lucene.util.TestRuleThreadAndTestName$1.evaluate(TestRuleThreadAndTestName.java:48)
at org.apache.lucene.util.TestRuleIgnoreAfterMaxFailures$1.evaluate(TestRuleIgnoreAfterMaxFailures.java:64)
at org.apache.lucene.util.TestRuleMarkFailure$1.evaluate(TestRuleMarkFailure.java:47)
at com.carrotsearch.randomizedtesting.rules.StatementAdapter.evaluate(StatementAdapter.java:36)
at com.carrotsearch.randomizedtesting.ThreadLeakControl$StatementRunner.run(ThreadLeakControl.java:367)
at com.carrotsearch.randomizedtesting.ThreadLeakControl.forkTimeoutingTask(ThreadLeakControl.java:809)
at com.carrotsearch.randomizedtesting.ThreadLeakControl$3.evaluate(ThreadLeakControl.java:460)
at com.carrotsearch.randomizedtesting.RandomizedRunner.runSingleTest(RandomizedRunner.java:880)
at com.carrotsearch.randomizedtesting.RandomizedRunner$5.evaluate(RandomizedRunner.java:781)
at com.carrotsearch.randomizedtesting.RandomizedRunner$6.evaluate(RandomizedRunner.java:816)
at com.carrotsearch.randomizedtesting.RandomizedRunner$7.evaluate(RandomizedRunner.java:827)
at org.apache.lucene.util.AbstractBeforeAfterRule$1.evaluate(AbstractBeforeAfterRule.java:45)
at com.carrotsearch.randomizedtesting.rules.StatementAdapter.evaluate(StatementAdapter.java:36)
at org.apache.lucene.util.TestRuleStoreClassName$1.evaluate(TestRuleStoreClassName.java:41)
at com.carrotsearch.randomizedtesting.rules.NoShadowingOrOverridesOnMethodsRule$1.evaluate(NoShadowingOrOverridesOnMethodsRule.java:40)
at com.carrotsearch.randomizedtesting.rules.NoShadowingOrOverridesOnMethodsRule$1.evaluate(NoShadowingOrOverridesOnMethodsRule.java:40)
at com.carrotsearch.randomizedtesting.rules.StatementAdapter.evaluate(StatementAdapter.java:36)
at com.carrotsearch.randomizedtesting.rules.StatementAdapter.evaluate(StatementAdapter.java:36)
at com.carrotsearch.randomizedtesting.rules.StatementAdapter.evaluate(StatementAdapter.java:36)
at org.apache.lucene.util.TestRuleAssertionsRequired$1.evaluate(TestRuleAssertionsRequired.java:53)
at org.apache.lucene.util.TestRuleMarkFailure$1.evaluate(TestRuleMarkFailure.java:47)
at org.apache.lucene.util.TestRuleIgnoreAfterMaxFailures$1.evaluate(TestRuleIgnoreAfterMaxFailures.java:64)
at org.apache.lucene.util.TestRuleIgnoreTestSuites$1.evaluate(TestRuleIgnoreTestSuites.java:54)
at com.carrotsearch.randomizedtesting.rules.StatementAdapter.evaluate(StatementAdapter.java:36)
at com.carrotsearch.randomizedtesting.ThreadLeakControl$StatementRunner.run(ThreadLeakControl.java:367)
at java.lang.Thread.run(Thread.java:804)
Build Log:
[...truncated 711 lines...]
[junit4] Suite: org.apache.lucene.search.TestDocValuesRewriteMethod
[junit4] 2> NOTE: reproduce with: ant test -Dtestcase=TestDocValuesRewriteMethod -Dtests.method=testRegexps -Dtests.seed=84128289752C4422 -Dtests.multiplier=3 -Dtests.slow=true -Dtests.locale=en-MU -Dtests.timezone=Canada/Newfoundland -Dtests.asserts=true -Dtests.file.encoding=US-ASCII
[junit4] FAILURE 3.84s J2 | TestDocValuesRewriteMethod.testRegexps <<<
[junit4] > Throwable #1: junit.framework.AssertionFailedError: Unequal lengths: hits1=0,hits2=5
[junit4] > at __randomizedtesting.SeedInfo.seed([84128289752C4422:654EC398AB8613AA]:0)
[junit4] > at junit.framework.Assert.fail(Assert.java:50)
[junit4] > at org.apache.lucene.search.CheckHits.checkEqual(CheckHits.java:211)
[junit4] > at org.apache.lucene.search.TestDocValuesRewriteMethod.assertSame(TestDocValuesRewriteMethod.java:124)
[junit4] > at org.apache.lucene.search.TestDocValuesRewriteMethod.testRegexps(TestDocValuesRewriteMethod.java:109)
[junit4] > at java.lang.Thread.run(Thread.java:804)
[junit4] 2> NOTE: test params are: codec=Asserting(Lucene54): {=PostingsFormat(name=Direct), id=PostingsFormat(name=MockRandom)}, docValues:{=DocValuesFormat(name=Asserting)}, sim=RandomSimilarity(queryNorm=true,coord=yes): {}, locale=en-MU, timezone=Canada/Newfoundland
[junit4] 2> NOTE: Linux 3.19.0-47-generic amd64/Oracle Corporation 9-ea (64-bit)/cpus=12,threads=1,free=351761824,total=508887040
[junit4] 2> NOTE: All tests run in this JVM: [TestSimpleSearchEquivalence, TestIndexSearcher, TestAllFilesCheckIndexHeader, TestBlockPostingsFormat, TestWildcard, TestTermVectorsWriter, TestBagOfPostings, TestOmitTf, TestMultiPhraseEnum, TestDefaultSimilarity, TestStringHelper, TestIndexWriterConfig, TestCompiledAutomaton, TestCharsRef, TestSortedSetSortField, TestDirectMonotonic, TestRollingUpdates, TestConjunctions, TestSearch, TestOmitNorms, TestTopDocsCollector, TestOperations, TestIndexWriterMerging, TestSpanFirstQuery, TestLongPostings, TestSpanExplanationsOfNonMatches, TestScoreCachingWrappingScorer, TestInPlaceMergeSorter, TestInfoStream, TestMmapDirectory, TestBitDocIdSetBuilder, TestRecyclingByteBlockAllocator, TestFieldType, TestBinaryDocValuesUpdates, TestIndexWriterUnicode, TestMaxTermFrequency, TestMaxPosition, TestAutomatonQueryUnicode, TestMergedIterator, TestFuzzyQuery, TestSearchWithThreads, TestFilteredQuery, TestBufferedIndexInput, TestSpansEnum, TestIndexableField, TestCachingWrapperQuery, TestNumericRangeQuery32, TestSortRescorer, TestBytesRef, TestQueryWrapperFilter, TestConcurrentMergeScheduler, TestQueryBuilder, TestBooleanQueryVisitSubscorers, TestRateLimiter, TestPagedBytes, TestExceedMaxTermLength, MultiCollectorTest, TestMixedDocValuesUpdates, TestForUtil, TestFilteredSearch, TestPerFieldPostingsFormat, TestLucene50SegmentInfoFormat, TestAtomicUpdate, TestDocValuesRewriteMethod]
[junit4] Completed [130/421 (1!)] on J2 in 4.07s, 2 tests, 1 failure <<< FAILURES!
[...truncated 1056 lines...]
BUILD FAILED
/home/jenkins/workspace/Lucene-Solr-5.x-Linux/build.xml:750: The following error occurred while executing this line:
/home/jenkins/workspace/Lucene-Solr-5.x-Linux/build.xml:694: The following error occurred while executing this line:
/home/jenkins/workspace/Lucene-Solr-5.x-Linux/build.xml:59: The following error occurred while executing this line:
/home/jenkins/workspace/Lucene-Solr-5.x-Linux/lucene/build.xml:50: The following error occurred while executing this line:
/home/jenkins/workspace/Lucene-Solr-5.x-Linux/lucene/common-build.xml:1477: The following error occurred while executing this line:
/home/jenkins/workspace/Lucene-Solr-5.x-Linux/lucene/common-build.xml:1033: There were test failures: 421 suites (1 ignored), 3386 tests, 1 failure, 146 ignored (142 assumptions) [seed: 84128289752C4422]
Total time: 7 minutes 1 second
Build step 'Invoke Ant' marked build as failure
Archiving artifacts
[WARNINGS] Skipping publisher since build result is FAILURE
Recording test results
Email was triggered for: Failure - Any
Sending email for trigger: Failure - Any