You are viewing a plain text version of this content. The canonical link for it is here.
Posted to builds@hbase.apache.org by Apache Jenkins Server <je...@builds.apache.org> on 2018/02/18 13:42:38 UTC
Build failed in Jenkins: HBase-Trunk_matrix » JDK 1.8 (latest),(Hadoop && !H5) #4605
See <https://builds.apache.org/job/HBase-Trunk_matrix/jdk=JDK%201.8%20(latest),label=(Hadoop%20&&%20!H5)/4605/display/redirect?page=changes>
Changes:
[eshcar] HBASE-18294 Reduce global heap pressure: flush based on heap occupancy
------------------------------------------
[...truncated 1.61 MB...]
[INFO] Apache HBase - Zookeeper .......................... SUCCESS [32.025s]
[INFO] Apache HBase - Replication ........................ SUCCESS [8.786s]
[INFO] Apache HBase - Resource Bundle .................... SUCCESS [0.154s]
[INFO] Apache HBase - HTTP ............................... SUCCESS [40.425s]
[INFO] Apache HBase - Procedure .......................... SUCCESS [2:41.425s]
[INFO] Apache HBase - Server ............................. SUCCESS [1:51:59.036s]
[INFO] Apache HBase - MapReduce .......................... SUCCESS [12:38.917s]
[INFO] Apache HBase - Testing Util ....................... SUCCESS [2.766s]
[INFO] Apache HBase - Thrift ............................. SUCCESS [1:34.418s]
[INFO] Apache HBase - RSGroup ............................ SUCCESS [3:08.989s]
[INFO] Apache HBase - Shell .............................. SUCCESS [6:33.765s]
[INFO] Apache HBase - Coprocessor Endpoint ............... SUCCESS [3:16.576s]
[INFO] Apache HBase - Backup ............................. SUCCESS [11:11.603s]
[INFO] Apache HBase - Integration Tests .................. SUCCESS [26.851s]
[INFO] Apache HBase - Examples ........................... SUCCESS [1:13.974s]
[INFO] Apache HBase - Rest ............................... SUCCESS [3:08.205s]
[INFO] Apache HBase - External Block Cache ............... SUCCESS [1.842s]
[INFO] Apache HBase - Spark .............................. SUCCESS [3:44.650s]
[INFO] Apache HBase - Spark Integration Tests ............ SUCCESS [2.806s]
[INFO] Apache HBase - Assembly ........................... SUCCESS [5.102s]
[INFO] Apache HBase - Shaded ............................. SUCCESS [0.154s]
[INFO] Apache HBase - Shaded - Client .................... SUCCESS [1.305s]
[INFO] Apache HBase - Shaded - MapReduce ................. SUCCESS [2.044s]
[INFO] Apache HBase Shaded Packaging Invariants .......... SUCCESS [1.982s]
[INFO] Apache HBase - Archetypes ......................... SUCCESS [0.069s]
[INFO] Apache HBase - Exemplar for hbase-client archetype SUCCESS [36.708s]
[INFO] Apache HBase - Exemplar for hbase-shaded-client archetype SUCCESS [33.957s]
[INFO] Apache HBase - Archetype builder .................. SUCCESS [0.544s]
[INFO] ------------------------------------------------------------------------
[INFO] BUILD SUCCESS
[INFO] ------------------------------------------------------------------------
[INFO] Total time: 2:51:45.551s
[INFO] Finished at: Sun Feb 18 13:22:07 UTC 2018
[INFO] Final Memory: 257M/8417M
[INFO] ------------------------------------------------------------------------
Performing Post build task...
Match found for :.* : True
Logical operation result is TRUE
Running script : # Run zombie detector script
./dev-support/zombie-detector.sh --jenkins ${BUILD_ID}
[11c72c70] $ /bin/bash -xe /tmp/jenkins7010889763087649866.sh
+ ./dev-support/zombie-detector.sh --jenkins 4605
Sun Feb 18 13:22:10 UTC 2018 We're ok: there is no zombie test
{color:green}+1 zombies{color}. No zombie tests found running at the end of the build.
POST BUILD TASK : SUCCESS
END OF POST BUILD TASK : 0
Archiving artifacts
Recording test results
[FINDBUGS] Collecting findbugs analysis files...
[FINDBUGS] Searching for all files in <https://builds.apache.org/job/HBase-Trunk_matrix/jdk=JDK%201.8%20(latest),label=(Hadoop%20&&%20!H5)/ws/> that match the pattern **/findbugs.xml,**/findbugsXml.xml
[FINDBUGS] Parsing 50 files in <https://builds.apache.org/job/HBase-Trunk_matrix/jdk=JDK%201.8%20(latest),label=(Hadoop%20&&%20!H5)/ws/>
[FINDBUGS] Successfully parsed file <https://builds.apache.org/job/HBase-Trunk_matrix/jdk=JDK%201.8%20(latest),label=(Hadoop%20&&%20!H5)/4605/artifact/hbase-archetypes/hbase-client-project/target/findbugs.xml> with 0 unique warnings and 0 duplicates.
[FINDBUGS] Successfully parsed file <https://builds.apache.org/job/HBase-Trunk_matrix/jdk=JDK%201.8%20(latest),label=(Hadoop%20&&%20!H5)/4605/artifact/hbase-archetypes/hbase-client-project/target/findbugsXml.xml> with 0 unique warnings and 0 duplicates.
[FINDBUGS] Successfully parsed file <https://builds.apache.org/job/HBase-Trunk_matrix/jdk=JDK%201.8%20(latest),label=(Hadoop%20&&%20!H5)/4605/artifact/hbase-archetypes/hbase-shaded-client-project/target/findbugs.xml> with 0 unique warnings and 0 duplicates.
[FINDBUGS] Successfully parsed file <https://builds.apache.org/job/HBase-Trunk_matrix/jdk=JDK%201.8%20(latest),label=(Hadoop%20&&%20!H5)/4605/artifact/hbase-archetypes/hbase-shaded-client-project/target/findbugsXml.xml> with 0 unique warnings and 0 duplicates.
[FINDBUGS] Successfully parsed file <https://builds.apache.org/job/HBase-Trunk_matrix/jdk=JDK%201.8%20(latest),label=(Hadoop%20&&%20!H5)/4605/artifact/hbase-backup/target/findbugs.xml> with 0 unique warnings and 0 duplicates.
[FINDBUGS] Successfully parsed file <https://builds.apache.org/job/HBase-Trunk_matrix/jdk=JDK%201.8%20(latest),label=(Hadoop%20&&%20!H5)/4605/artifact/hbase-backup/target/findbugsXml.xml> with 1 unique warning and 0 duplicates.
[FINDBUGS] Successfully parsed file <https://builds.apache.org/job/HBase-Trunk_matrix/jdk=JDK%201.8%20(latest),label=(Hadoop%20&&%20!H5)/4605/artifact/hbase-build-support/hbase-error-prone/target/findbugs.xml> with 1 unique warning and 0 duplicates.
[FINDBUGS] Successfully parsed file <https://builds.apache.org/job/HBase-Trunk_matrix/jdk=JDK%201.8%20(latest),label=(Hadoop%20&&%20!H5)/4605/artifact/hbase-build-support/hbase-error-prone/target/findbugsXml.xml> with 1 unique warning and 0 duplicates.
[FINDBUGS] Successfully parsed file <https://builds.apache.org/job/HBase-Trunk_matrix/jdk=JDK%201.8%20(latest),label=(Hadoop%20&&%20!H5)/4605/artifact/hbase-client/target/findbugs.xml> with 1 unique warning and 0 duplicates.
[FINDBUGS] Successfully parsed file <https://builds.apache.org/job/HBase-Trunk_matrix/jdk=JDK%201.8%20(latest),label=(Hadoop%20&&%20!H5)/4605/artifact/hbase-client/target/findbugsXml.xml> with 1 unique warning and 0 duplicates.
[FINDBUGS] Successfully parsed file <https://builds.apache.org/job/HBase-Trunk_matrix/jdk=JDK%201.8%20(latest),label=(Hadoop%20&&%20!H5)/4605/artifact/hbase-common/target/findbugs.xml> with 1 unique warning and 0 duplicates.
[FINDBUGS] Successfully parsed file <https://builds.apache.org/job/HBase-Trunk_matrix/jdk=JDK%201.8%20(latest),label=(Hadoop%20&&%20!H5)/4605/artifact/hbase-common/target/findbugsXml.xml> with 3 unique warnings and 0 duplicates.
[FINDBUGS] Successfully parsed file <https://builds.apache.org/job/HBase-Trunk_matrix/jdk=JDK%201.8%20(latest),label=(Hadoop%20&&%20!H5)/4605/artifact/hbase-endpoint/target/findbugs.xml> with 3 unique warnings and 0 duplicates.
[FINDBUGS] Successfully parsed file <https://builds.apache.org/job/HBase-Trunk_matrix/jdk=JDK%201.8%20(latest),label=(Hadoop%20&&%20!H5)/4605/artifact/hbase-endpoint/target/findbugsXml.xml> with 3 unique warnings and 0 duplicates.
[FINDBUGS] Successfully parsed file <https://builds.apache.org/job/HBase-Trunk_matrix/jdk=JDK%201.8%20(latest),label=(Hadoop%20&&%20!H5)/4605/artifact/hbase-examples/target/findbugs.xml> with 3 unique warnings and 0 duplicates.
[FINDBUGS] Successfully parsed file <https://builds.apache.org/job/HBase-Trunk_matrix/jdk=JDK%201.8%20(latest),label=(Hadoop%20&&%20!H5)/4605/artifact/hbase-examples/target/findbugsXml.xml> with 3 unique warnings and 0 duplicates.
[FINDBUGS] Successfully parsed file <https://builds.apache.org/job/HBase-Trunk_matrix/jdk=JDK%201.8%20(latest),label=(Hadoop%20&&%20!H5)/4605/artifact/hbase-external-blockcache/target/findbugs.xml> with 3 unique warnings and 0 duplicates.
[FINDBUGS] Successfully parsed file <https://builds.apache.org/job/HBase-Trunk_matrix/jdk=JDK%201.8%20(latest),label=(Hadoop%20&&%20!H5)/4605/artifact/hbase-external-blockcache/target/findbugsXml.xml> with 3 unique warnings and 0 duplicates.
[FINDBUGS] Successfully parsed file <https://builds.apache.org/job/HBase-Trunk_matrix/jdk=JDK%201.8%20(latest),label=(Hadoop%20&&%20!H5)/4605/artifact/hbase-hadoop-compat/target/findbugs.xml> with 3 unique warnings and 0 duplicates.
[FINDBUGS] Successfully parsed file <https://builds.apache.org/job/HBase-Trunk_matrix/jdk=JDK%201.8%20(latest),label=(Hadoop%20&&%20!H5)/4605/artifact/hbase-hadoop-compat/target/findbugsXml.xml> with 3 unique warnings and 0 duplicates.
[FINDBUGS] Successfully parsed file <https://builds.apache.org/job/HBase-Trunk_matrix/jdk=JDK%201.8%20(latest),label=(Hadoop%20&&%20!H5)/4605/artifact/hbase-hadoop2-compat/target/findbugs.xml> with 3 unique warnings and 0 duplicates.
[FINDBUGS] Successfully parsed file <https://builds.apache.org/job/HBase-Trunk_matrix/jdk=JDK%201.8%20(latest),label=(Hadoop%20&&%20!H5)/4605/artifact/hbase-hadoop2-compat/target/findbugsXml.xml> with 3 unique warnings and 0 duplicates.
[FINDBUGS] Successfully parsed file <https://builds.apache.org/job/HBase-Trunk_matrix/jdk=JDK%201.8%20(latest),label=(Hadoop%20&&%20!H5)/4605/artifact/hbase-http/target/findbugs.xml> with 3 unique warnings and 0 duplicates.
[FINDBUGS] Successfully parsed file <https://builds.apache.org/job/HBase-Trunk_matrix/jdk=JDK%201.8%20(latest),label=(Hadoop%20&&%20!H5)/4605/artifact/hbase-http/target/findbugsXml.xml> with 3 unique warnings and 0 duplicates.
[FINDBUGS] Successfully parsed file <https://builds.apache.org/job/HBase-Trunk_matrix/jdk=JDK%201.8%20(latest),label=(Hadoop%20&&%20!H5)/4605/artifact/hbase-mapreduce/target/findbugs.xml> with 3 unique warnings and 0 duplicates.
[FINDBUGS] Successfully parsed file <https://builds.apache.org/job/HBase-Trunk_matrix/jdk=JDK%201.8%20(latest),label=(Hadoop%20&&%20!H5)/4605/artifact/hbase-mapreduce/target/findbugsXml.xml> with 4 unique warnings and 0 duplicates.
[FINDBUGS] Successfully parsed file <https://builds.apache.org/job/HBase-Trunk_matrix/jdk=JDK%201.8%20(latest),label=(Hadoop%20&&%20!H5)/4605/artifact/hbase-metrics-api/target/findbugs.xml> with 4 unique warnings and 0 duplicates.
[FINDBUGS] Successfully parsed file <https://builds.apache.org/job/HBase-Trunk_matrix/jdk=JDK%201.8%20(latest),label=(Hadoop%20&&%20!H5)/4605/artifact/hbase-metrics-api/target/findbugsXml.xml> with 4 unique warnings and 0 duplicates.
[FINDBUGS] Successfully parsed file <https://builds.apache.org/job/HBase-Trunk_matrix/jdk=JDK%201.8%20(latest),label=(Hadoop%20&&%20!H5)/4605/artifact/hbase-metrics/target/findbugs.xml> with 4 unique warnings and 0 duplicates.
[FINDBUGS] Successfully parsed file <https://builds.apache.org/job/HBase-Trunk_matrix/jdk=JDK%201.8%20(latest),label=(Hadoop%20&&%20!H5)/4605/artifact/hbase-metrics/target/findbugsXml.xml> with 4 unique warnings and 0 duplicates.
[FINDBUGS] Successfully parsed file <https://builds.apache.org/job/HBase-Trunk_matrix/jdk=JDK%201.8%20(latest),label=(Hadoop%20&&%20!H5)/4605/artifact/hbase-procedure/target/findbugs.xml> with 4 unique warnings and 0 duplicates.
[FINDBUGS] Successfully parsed file <https://builds.apache.org/job/HBase-Trunk_matrix/jdk=JDK%201.8%20(latest),label=(Hadoop%20&&%20!H5)/4605/artifact/hbase-procedure/target/findbugsXml.xml> with 5 unique warnings and 0 duplicates.
[FINDBUGS] Successfully parsed file <https://builds.apache.org/job/HBase-Trunk_matrix/jdk=JDK%201.8%20(latest),label=(Hadoop%20&&%20!H5)/4605/artifact/hbase-protocol-shaded/target/findbugs.xml> with 5 unique warnings and 0 duplicates.
[FINDBUGS] Successfully parsed file <https://builds.apache.org/job/HBase-Trunk_matrix/jdk=JDK%201.8%20(latest),label=(Hadoop%20&&%20!H5)/4605/artifact/hbase-protocol-shaded/target/findbugsXml.xml> with 5 unique warnings and 0 duplicates.
[FINDBUGS] Successfully parsed file <https://builds.apache.org/job/HBase-Trunk_matrix/jdk=JDK%201.8%20(latest),label=(Hadoop%20&&%20!H5)/4605/artifact/hbase-protocol/target/findbugs.xml> with 5 unique warnings and 0 duplicates.
[FINDBUGS] Successfully parsed file <https://builds.apache.org/job/HBase-Trunk_matrix/jdk=JDK%201.8%20(latest),label=(Hadoop%20&&%20!H5)/4605/artifact/hbase-protocol/target/findbugsXml.xml> with 5 unique warnings and 0 duplicates.
[FINDBUGS] Successfully parsed file <https://builds.apache.org/job/HBase-Trunk_matrix/jdk=JDK%201.8%20(latest),label=(Hadoop%20&&%20!H5)/4605/artifact/hbase-replication/target/findbugs.xml> with 5 unique warnings and 0 duplicates.
[FINDBUGS] Successfully parsed file <https://builds.apache.org/job/HBase-Trunk_matrix/jdk=JDK%201.8%20(latest),label=(Hadoop%20&&%20!H5)/4605/artifact/hbase-replication/target/findbugsXml.xml> with 5 unique warnings and 0 duplicates.
[FINDBUGS] Successfully parsed file <https://builds.apache.org/job/HBase-Trunk_matrix/jdk=JDK%201.8%20(latest),label=(Hadoop%20&&%20!H5)/4605/artifact/hbase-rest/target/findbugs.xml> with 5 unique warnings and 0 duplicates.
[FINDBUGS] Successfully parsed file <https://builds.apache.org/job/HBase-Trunk_matrix/jdk=JDK%201.8%20(latest),label=(Hadoop%20&&%20!H5)/4605/artifact/hbase-rest/target/findbugsXml.xml> with 5 unique warnings and 0 duplicates.
[FINDBUGS] Successfully parsed file <https://builds.apache.org/job/HBase-Trunk_matrix/jdk=JDK%201.8%20(latest),label=(Hadoop%20&&%20!H5)/4605/artifact/hbase-rsgroup/target/findbugs.xml> with 5 unique warnings and 0 duplicates.
[FINDBUGS] Successfully parsed file <https://builds.apache.org/job/HBase-Trunk_matrix/jdk=JDK%201.8%20(latest),label=(Hadoop%20&&%20!H5)/4605/artifact/hbase-rsgroup/target/findbugsXml.xml> with 5 unique warnings and 0 duplicates.
[FINDBUGS] Successfully parsed file <https://builds.apache.org/job/HBase-Trunk_matrix/jdk=JDK%201.8%20(latest),label=(Hadoop%20&&%20!H5)/4605/artifact/hbase-server/target/findbugs.xml> with 5 unique warnings and 0 duplicates.
[FINDBUGS] Successfully parsed file <https://builds.apache.org/job/HBase-Trunk_matrix/jdk=JDK%201.8%20(latest),label=(Hadoop%20&&%20!H5)/4605/artifact/hbase-server/target/findbugsXml.xml> with 30 unique warnings and 0 duplicates.
[FINDBUGS] Successfully parsed file <https://builds.apache.org/job/HBase-Trunk_matrix/jdk=JDK%201.8%20(latest),label=(Hadoop%20&&%20!H5)/4605/artifact/hbase-spark/target/findbugs.xml> with 30 unique warnings and 0 duplicates.
[FINDBUGS] Successfully parsed file <https://builds.apache.org/job/HBase-Trunk_matrix/jdk=JDK%201.8%20(latest),label=(Hadoop%20&&%20!H5)/4605/artifact/hbase-spark/target/findbugsXml.xml> with 30 unique warnings and 0 duplicates.
[FINDBUGS] Successfully parsed file <https://builds.apache.org/job/HBase-Trunk_matrix/jdk=JDK%201.8%20(latest),label=(Hadoop%20&&%20!H5)/4605/artifact/hbase-thrift/target/findbugs.xml> with 30 unique warnings and 0 duplicates.
[FINDBUGS] Successfully parsed file <https://builds.apache.org/job/HBase-Trunk_matrix/jdk=JDK%201.8%20(latest),label=(Hadoop%20&&%20!H5)/4605/artifact/hbase-thrift/target/findbugsXml.xml> with 30 unique warnings and 0 duplicates.
[FINDBUGS] Successfully parsed file <https://builds.apache.org/job/HBase-Trunk_matrix/jdk=JDK%201.8%20(latest),label=(Hadoop%20&&%20!H5)/4605/artifact/hbase-zookeeper/target/findbugs.xml> with 30 unique warnings and 0 duplicates.
[FINDBUGS] Successfully parsed file <https://builds.apache.org/job/HBase-Trunk_matrix/jdk=JDK%201.8%20(latest),label=(Hadoop%20&&%20!H5)/4605/artifact/hbase-zookeeper/target/findbugsXml.xml> with 33 unique warnings and 0 duplicates.
<Git Blamer> Using GitBlamer to create author and commit information for all warnings.
<Git Blamer> GIT_COMMIT=f3bb9b9613beaefbee0a53be1fb66b94fde1ce19, workspace=<https://builds.apache.org/job/HBase-Trunk_matrix/jdk=JDK%201.8%20(latest),label=(Hadoop%20&&%20!H5)/ws/>
> git rev-parse f3bb9b9613beaefbee0a53be1fb66b94fde1ce19^{commit} # timeout=10
[FINDBUGS] Computing warning deltas based on reference build #4436
[CHECKSTYLE] Collecting checkstyle analysis files...
[CHECKSTYLE] Searching for all files in <https://builds.apache.org/job/HBase-Trunk_matrix/jdk=JDK%201.8%20(latest),label=(Hadoop%20&&%20!H5)/ws/> that match the pattern **/checkstyle-result.xml
[CHECKSTYLE] Parsing 42 files in <https://builds.apache.org/job/HBase-Trunk_matrix/jdk=JDK%201.8%20(latest),label=(Hadoop%20&&%20!H5)/ws/>
[CHECKSTYLE] Successfully parsed file <https://builds.apache.org/job/HBase-Trunk_matrix/jdk=JDK%201.8%20(latest),label=(Hadoop%20&&%20!H5)/4605/artifact/hbase-annotations/target/checkstyle-result.xml> with 0 unique warnings and 0 duplicates.
[CHECKSTYLE] Successfully parsed file <https://builds.apache.org/job/HBase-Trunk_matrix/jdk=JDK%201.8%20(latest),label=(Hadoop%20&&%20!H5)/4605/artifact/hbase-archetypes/hbase-archetype-builder/target/checkstyle-result.xml> with 0 unique warnings and 0 duplicates.
[CHECKSTYLE] Successfully parsed file <https://builds.apache.org/job/HBase-Trunk_matrix/jdk=JDK%201.8%20(latest),label=(Hadoop%20&&%20!H5)/4605/artifact/hbase-archetypes/hbase-client-project/target/checkstyle-result.xml> with 0 unique warnings and 0 duplicates.
[CHECKSTYLE] Successfully parsed file <https://builds.apache.org/job/HBase-Trunk_matrix/jdk=JDK%201.8%20(latest),label=(Hadoop%20&&%20!H5)/4605/artifact/hbase-archetypes/hbase-shaded-client-project/target/checkstyle-result.xml> with 0 unique warnings and 0 duplicates.
[CHECKSTYLE] Successfully parsed file <https://builds.apache.org/job/HBase-Trunk_matrix/jdk=JDK%201.8%20(latest),label=(Hadoop%20&&%20!H5)/4605/artifact/hbase-archetypes/target/checkstyle-result.xml> with 0 unique warnings and 0 duplicates.
[CHECKSTYLE] Successfully parsed file <https://builds.apache.org/job/HBase-Trunk_matrix/jdk=JDK%201.8%20(latest),label=(Hadoop%20&&%20!H5)/4605/artifact/hbase-assembly/target/checkstyle-result.xml> with 0 unique warnings and 0 duplicates.
[CHECKSTYLE] Successfully parsed file <https://builds.apache.org/job/HBase-Trunk_matrix/jdk=JDK%201.8%20(latest),label=(Hadoop%20&&%20!H5)/4605/artifact/hbase-backup/target/checkstyle-result.xml> with 0 unique warnings and 0 duplicates.
[CHECKSTYLE] Successfully parsed file <https://builds.apache.org/job/HBase-Trunk_matrix/jdk=JDK%201.8%20(latest),label=(Hadoop%20&&%20!H5)/4605/artifact/hbase-build-configuration/target/checkstyle-result.xml> with 0 unique warnings and 0 duplicates.
[CHECKSTYLE] Successfully parsed file <https://builds.apache.org/job/HBase-Trunk_matrix/jdk=JDK%201.8%20(latest),label=(Hadoop%20&&%20!H5)/4605/artifact/hbase-build-support/hbase-error-prone/target/checkstyle-result.xml> with 0 unique warnings and 0 duplicates.
[CHECKSTYLE] Successfully parsed file <https://builds.apache.org/job/HBase-Trunk_matrix/jdk=JDK%201.8%20(latest),label=(Hadoop%20&&%20!H5)/4605/artifact/hbase-build-support/target/checkstyle-result.xml> with 0 unique warnings and 0 duplicates.
[CHECKSTYLE] Successfully parsed file <https://builds.apache.org/job/HBase-Trunk_matrix/jdk=JDK%201.8%20(latest),label=(Hadoop%20&&%20!H5)/4605/artifact/hbase-checkstyle/target/checkstyle-result.xml> with 0 unique warnings and 0 duplicates.
[CHECKSTYLE] Successfully parsed file <https://builds.apache.org/job/HBase-Trunk_matrix/jdk=JDK%201.8%20(latest),label=(Hadoop%20&&%20!H5)/4605/artifact/hbase-client/target/checkstyle-result.xml> with 3078 unique warnings and 0 duplicates.
[CHECKSTYLE] Successfully parsed file <https://builds.apache.org/job/HBase-Trunk_matrix/jdk=JDK%201.8%20(latest),label=(Hadoop%20&&%20!H5)/4605/artifact/hbase-common/target/checkstyle-result.xml> with 4386 unique warnings and 0 duplicates.
[CHECKSTYLE] Successfully parsed file <https://builds.apache.org/job/HBase-Trunk_matrix/jdk=JDK%201.8%20(latest),label=(Hadoop%20&&%20!H5)/4605/artifact/hbase-endpoint/target/checkstyle-result.xml> with 4596 unique warnings and 0 duplicates.
[CHECKSTYLE] Successfully parsed file <https://builds.apache.org/job/HBase-Trunk_matrix/jdk=JDK%201.8%20(latest),label=(Hadoop%20&&%20!H5)/4605/artifact/hbase-examples/target/checkstyle-result.xml> with 4888 unique warnings and 0 duplicates.
[CHECKSTYLE] Successfully parsed file <https://builds.apache.org/job/HBase-Trunk_matrix/jdk=JDK%201.8%20(latest),label=(Hadoop%20&&%20!H5)/4605/artifact/hbase-external-blockcache/target/checkstyle-result.xml> with 4888 unique warnings and 0 duplicates.
[CHECKSTYLE] Successfully parsed file <https://builds.apache.org/job/HBase-Trunk_matrix/jdk=JDK%201.8%20(latest),label=(Hadoop%20&&%20!H5)/4605/artifact/hbase-hadoop-compat/target/checkstyle-result.xml> with 4888 unique warnings and 0 duplicates.
[CHECKSTYLE] Successfully parsed file <https://builds.apache.org/job/HBase-Trunk_matrix/jdk=JDK%201.8%20(latest),label=(Hadoop%20&&%20!H5)/4605/artifact/hbase-hadoop2-compat/target/checkstyle-result.xml> with 5042 unique warnings and 0 duplicates.
[CHECKSTYLE] Successfully parsed file <https://builds.apache.org/job/HBase-Trunk_matrix/jdk=JDK%201.8%20(latest),label=(Hadoop%20&&%20!H5)/4605/artifact/hbase-http/target/checkstyle-result.xml> with 5195 unique warnings and 0 duplicates.
[CHECKSTYLE] Successfully parsed file <https://builds.apache.org/job/HBase-Trunk_matrix/jdk=JDK%201.8%20(latest),label=(Hadoop%20&&%20!H5)/4605/artifact/hbase-it/target/checkstyle-result.xml> with 5638 unique warnings and 0 duplicates.
[CHECKSTYLE] Successfully parsed file <https://builds.apache.org/job/HBase-Trunk_matrix/jdk=JDK%201.8%20(latest),label=(Hadoop%20&&%20!H5)/4605/artifact/hbase-mapreduce/target/checkstyle-result.xml> with 6572 unique warnings and 0 duplicates.
[CHECKSTYLE] Successfully parsed file <https://builds.apache.org/job/HBase-Trunk_matrix/jdk=JDK%201.8%20(latest),label=(Hadoop%20&&%20!H5)/4605/artifact/hbase-metrics-api/target/checkstyle-result.xml> with 6572 unique warnings and 0 duplicates.
[CHECKSTYLE] Successfully parsed file <https://builds.apache.org/job/HBase-Trunk_matrix/jdk=JDK%201.8%20(latest),label=(Hadoop%20&&%20!H5)/4605/artifact/hbase-metrics/target/checkstyle-result.xml> with 6572 unique warnings and 0 duplicates.
[CHECKSTYLE] Successfully parsed file <https://builds.apache.org/job/HBase-Trunk_matrix/jdk=JDK%201.8%20(latest),label=(Hadoop%20&&%20!H5)/4605/artifact/hbase-procedure/target/checkstyle-result.xml> with 6747 unique warnings and 0 duplicates.
[CHECKSTYLE] Successfully parsed file <https://builds.apache.org/job/HBase-Trunk_matrix/jdk=JDK%201.8%20(latest),label=(Hadoop%20&&%20!H5)/4605/artifact/hbase-protocol-shaded/target/checkstyle-result.xml> with 6747 unique warnings and 0 duplicates.
[CHECKSTYLE] Successfully parsed file <https://builds.apache.org/job/HBase-Trunk_matrix/jdk=JDK%201.8%20(latest),label=(Hadoop%20&&%20!H5)/4605/artifact/hbase-protocol/target/checkstyle-result.xml> with 6747 unique warnings and 0 duplicates.
[CHECKSTYLE] Successfully parsed file <https://builds.apache.org/job/HBase-Trunk_matrix/jdk=JDK%201.8%20(latest),label=(Hadoop%20&&%20!H5)/4605/artifact/hbase-replication/target/checkstyle-result.xml> with 6747 unique warnings and 0 duplicates.
[CHECKSTYLE] Successfully parsed file <https://builds.apache.org/job/HBase-Trunk_matrix/jdk=JDK%201.8%20(latest),label=(Hadoop%20&&%20!H5)/4605/artifact/hbase-resource-bundle/target/checkstyle-result.xml> with 6747 unique warnings and 0 duplicates.
[CHECKSTYLE] Successfully parsed file <https://builds.apache.org/job/HBase-Trunk_matrix/jdk=JDK%201.8%20(latest),label=(Hadoop%20&&%20!H5)/4605/artifact/hbase-rest/target/checkstyle-result.xml> with 7585 unique warnings and 0 duplicates.
[CHECKSTYLE] Successfully parsed file <https://builds.apache.org/job/HBase-Trunk_matrix/jdk=JDK%201.8%20(latest),label=(Hadoop%20&&%20!H5)/4605/artifact/hbase-rsgroup/target/checkstyle-result.xml> with 7585 unique warnings and 0 duplicates.
[CHECKSTYLE] Successfully parsed file <https://builds.apache.org/job/HBase-Trunk_matrix/jdk=JDK%201.8%20(latest),label=(Hadoop%20&&%20!H5)/4605/artifact/hbase-server/target/checkstyle-result.xml> with 16525 unique warnings and 0 duplicates.
[CHECKSTYLE] Successfully parsed file <https://builds.apache.org/job/HBase-Trunk_matrix/jdk=JDK%201.8%20(latest),label=(Hadoop%20&&%20!H5)/4605/artifact/hbase-shaded/hbase-shaded-check-invariants/target/checkstyle-result.xml> with 16525 unique warnings and 0 duplicates.
[CHECKSTYLE] Successfully parsed file <https://builds.apache.org/job/HBase-Trunk_matrix/jdk=JDK%201.8%20(latest),label=(Hadoop%20&&%20!H5)/4605/artifact/hbase-shaded/hbase-shaded-client/target/checkstyle-result.xml> with 16525 unique warnings and 0 duplicates.
[CHECKSTYLE] Successfully parsed file <https://builds.apache.org/job/HBase-Trunk_matrix/jdk=JDK%201.8%20(latest),label=(Hadoop%20&&%20!H5)/4605/artifact/hbase-shaded/hbase-shaded-mapreduce/target/checkstyle-result.xml> with 16525 unique warnings and 0 duplicates.
[CHECKSTYLE] Successfully parsed file <https://builds.apache.org/job/HBase-Trunk_matrix/jdk=JDK%201.8%20(latest),label=(Hadoop%20&&%20!H5)/4605/artifact/hbase-shaded/target/checkstyle-result.xml> with 16525 unique warnings and 0 duplicates.
[CHECKSTYLE] Successfully parsed file <https://builds.apache.org/job/HBase-Trunk_matrix/jdk=JDK%201.8%20(latest),label=(Hadoop%20&&%20!H5)/4605/artifact/hbase-shell/target/checkstyle-result.xml> with 16525 unique warnings and 0 duplicates.
[CHECKSTYLE] Successfully parsed file <https://builds.apache.org/job/HBase-Trunk_matrix/jdk=JDK%201.8%20(latest),label=(Hadoop%20&&%20!H5)/4605/artifact/hbase-spark-it/target/checkstyle-result.xml> with 16525 unique warnings and 0 duplicates.
[CHECKSTYLE] Successfully parsed file <https://builds.apache.org/job/HBase-Trunk_matrix/jdk=JDK%201.8%20(latest),label=(Hadoop%20&&%20!H5)/4605/artifact/hbase-spark/target/checkstyle-result.xml> with 16525 unique warnings and 0 duplicates.
[CHECKSTYLE] Successfully parsed file <https://builds.apache.org/job/HBase-Trunk_matrix/jdk=JDK%201.8%20(latest),label=(Hadoop%20&&%20!H5)/4605/artifact/hbase-testing-util/target/checkstyle-result.xml> with 16525 unique warnings and 0 duplicates.
[CHECKSTYLE] Successfully parsed file <https://builds.apache.org/job/HBase-Trunk_matrix/jdk=JDK%201.8%20(latest),label=(Hadoop%20&&%20!H5)/4605/artifact/hbase-thrift/target/checkstyle-result.xml> with 16525 unique warnings and 0 duplicates.
[CHECKSTYLE] Successfully parsed file <https://builds.apache.org/job/HBase-Trunk_matrix/jdk=JDK%201.8%20(latest),label=(Hadoop%20&&%20!H5)/4605/artifact/hbase-zookeeper/target/checkstyle-result.xml> with 16538 unique warnings and 0 duplicates.
[CHECKSTYLE] Successfully parsed file <https://builds.apache.org/job/HBase-Trunk_matrix/jdk=JDK%201.8%20(latest),label=(Hadoop%20&&%20!H5)/4605/artifact/target/checkstyle-result.xml> with 16538 unique warnings and 0 duplicates.
<Git Blamer> Using GitBlamer to create author and commit information for all warnings.
<Git Blamer> GIT_COMMIT=f3bb9b9613beaefbee0a53be1fb66b94fde1ce19, workspace=<https://builds.apache.org/job/HBase-Trunk_matrix/jdk=JDK%201.8%20(latest),label=(Hadoop%20&&%20!H5)/ws/>
> git rev-parse f3bb9b9613beaefbee0a53be1fb66b94fde1ce19^{commit} # timeout=10
<Git Blamer> No blame results for request <hbase-common/target/generated-sources/java/org/apache/hadoop/hbase/Version.java - [8, 14]>.
ERROR: Build step failed with exception
java.lang.OutOfMemoryError: GC overhead limit exceeded
at org.eclipse.jgit.internal.storage.file.PackFile.load(PackFile.java:878)
at org.eclipse.jgit.internal.storage.file.PackFile.get(PackFile.java:273)
at org.eclipse.jgit.internal.storage.file.ObjectDirectory.openPackedObject(ObjectDirectory.java:421)
at org.eclipse.jgit.internal.storage.file.ObjectDirectory.openPackedFromSelfOrAlternate(ObjectDirectory.java:390)
at org.eclipse.jgit.internal.storage.file.ObjectDirectory.openObject(ObjectDirectory.java:382)
at org.eclipse.jgit.internal.storage.file.WindowCursor.open(WindowCursor.java:154)
at org.eclipse.jgit.treewalk.CanonicalTreeParser.reset(CanonicalTreeParser.java:214)
at org.eclipse.jgit.treewalk.CanonicalTreeParser.createSubtreeIterator0(CanonicalTreeParser.java:248)
at org.eclipse.jgit.treewalk.CanonicalTreeParser.createSubtreeIterator(CanonicalTreeParser.java:226)
at org.eclipse.jgit.treewalk.CanonicalTreeParser.createSubtreeIterator(CanonicalTreeParser.java:70)
at org.eclipse.jgit.treewalk.TreeWalk.enterSubtree(TreeWalk.java:1210)
at org.eclipse.jgit.treewalk.TreeWalk.next(TreeWalk.java:828)
at org.eclipse.jgit.blame.BlameGenerator.find(BlameGenerator.java:955)
at org.eclipse.jgit.blame.BlameGenerator.processOne(BlameGenerator.java:603)
at org.eclipse.jgit.blame.BlameGenerator.next(BlameGenerator.java:496)
at org.eclipse.jgit.blame.BlameResult.computeAll(BlameResult.java:239)
at org.eclipse.jgit.blame.BlameGenerator.computeBlameResult(BlameGenerator.java:450)
at org.eclipse.jgit.api.BlameCommand.call(BlameCommand.java:230)
at hudson.plugins.analysis.util.GitBlamer$BlameCallback.invoke(GitBlamer.java:130)
at hudson.plugins.analysis.util.GitBlamer$BlameCallback.invoke(GitBlamer.java:104)
at org.jenkinsci.plugins.gitclient.AbstractGitAPIImpl.withRepository(AbstractGitAPIImpl.java:29)
at org.jenkinsci.plugins.gitclient.CliGitAPIImpl.withRepository(CliGitAPIImpl.java:72)
at hudson.plugins.analysis.util.GitBlamer.loadBlameResultsForFiles(GitBlamer.java:61)
at hudson.plugins.analysis.util.GitBlamer.blame(GitBlamer.java:54)
at hudson.plugins.analysis.util.AbstractBlamer$1.invoke(AbstractBlamer.java:62)
at hudson.plugins.analysis.util.AbstractBlamer$1.invoke(AbstractBlamer.java:59)
at hudson.FilePath$FileCallableWrapper.call(FilePath.java:2760)
at hudson.remoting.UserRequest.perform(UserRequest.java:207)
at hudson.remoting.UserRequest.perform(UserRequest.java:53)
at hudson.remoting.Request$2.run(Request.java:358)
at hudson.remoting.InterceptingExecutorService$1.call(InterceptingExecutorService.java:72)
at java.util.concurrent.FutureTask.run(FutureTask.java:266)
Also: hudson.remoting.Channel$CallSiteStackTrace: Remote call to H12
at hudson.remoting.Channel.attachCallSiteStackTrace(Channel.java:1693)
at hudson.remoting.UserResponse.retrieve(UserRequest.java:310)
at hudson.remoting.Channel.call(Channel.java:908)
at hudson.FilePath.act(FilePath.java:986)
at hudson.FilePath.act(FilePath.java:975)
at hudson.plugins.analysis.util.AbstractBlamer.invokeBlamer(AbstractBlamer.java:59)
at hudson.plugins.analysis.util.AbstractBlamer.blame(AbstractBlamer.java:45)
at hudson.plugins.analysis.core.HealthAwarePublisher.blame(HealthAwarePublisher.java:109)
at hudson.plugins.checkstyle.CheckStylePublisher.perform(CheckStylePublisher.java:81)
at hudson.plugins.analysis.core.HealthAwarePublisher.perform(HealthAwarePublisher.java:69)
at hudson.plugins.analysis.core.HealthAwareRecorder.perform(HealthAwareRecorder.java:298)
at hudson.tasks.BuildStepCompatibilityLayer.perform(BuildStepCompatibilityLayer.java:81)
at hudson.tasks.BuildStepMonitor$1.perform(BuildStepMonitor.java:20)
at hudson.model.AbstractBuild$AbstractBuildExecution.perform(AbstractBuild.java:744)
at hudson.model.AbstractBuild$AbstractBuildExecution.performAllBuildSteps(AbstractBuild.java:690)
at hudson.model.Build$BuildExecution.post2(Build.java:186)
at hudson.model.AbstractBuild$AbstractBuildExecution.post(AbstractBuild.java:635)
at hudson.model.Run.execute(Run.java:1749)
at hudson.matrix.MatrixRun.run(MatrixRun.java:146)
at hudson.model.ResourceController.execute(ResourceController.java:97)
at hudson.model.Executor.run(Executor.java:429)
Caused: org.eclipse.jgit.errors.LargeObjectException$OutOfMemory: Out of memory loading unknown object
at org.eclipse.jgit.internal.storage.file.PackFile.load(PackFile.java:881)
at org.eclipse.jgit.internal.storage.file.PackFile.get(PackFile.java:273)
at org.eclipse.jgit.internal.storage.file.ObjectDirectory.openPackedObject(ObjectDirectory.java:421)
at org.eclipse.jgit.internal.storage.file.ObjectDirectory.openPackedFromSelfOrAlternate(ObjectDirectory.java:390)
at org.eclipse.jgit.internal.storage.file.ObjectDirectory.openObject(ObjectDirectory.java:382)
at org.eclipse.jgit.internal.storage.file.WindowCursor.open(WindowCursor.java:154)
at org.eclipse.jgit.treewalk.CanonicalTreeParser.reset(CanonicalTreeParser.java:214)
at org.eclipse.jgit.treewalk.CanonicalTreeParser.createSubtreeIterator0(CanonicalTreeParser.java:248)
at org.eclipse.jgit.treewalk.CanonicalTreeParser.createSubtreeIterator(CanonicalTreeParser.java:226)
at org.eclipse.jgit.treewalk.CanonicalTreeParser.createSubtreeIterator(CanonicalTreeParser.java:70)
at org.eclipse.jgit.treewalk.TreeWalk.enterSubtree(TreeWalk.java:1210)
at org.eclipse.jgit.treewalk.TreeWalk.next(TreeWalk.java:828)
at org.eclipse.jgit.blame.BlameGenerator.find(BlameGenerator.java:955)
at org.eclipse.jgit.blame.BlameGenerator.processOne(BlameGenerator.java:603)
at org.eclipse.jgit.blame.BlameGenerator.next(BlameGenerator.java:496)
at org.eclipse.jgit.blame.BlameResult.computeAll(BlameResult.java:239)
at org.eclipse.jgit.blame.BlameGenerator.computeBlameResult(BlameGenerator.java:450)
at org.eclipse.jgit.api.BlameCommand.call(BlameCommand.java:230)
at hudson.plugins.analysis.util.GitBlamer$BlameCallback.invoke(GitBlamer.java:130)
at hudson.plugins.analysis.util.GitBlamer$BlameCallback.invoke(GitBlamer.java:104)
at org.jenkinsci.plugins.gitclient.AbstractGitAPIImpl.withRepository(AbstractGitAPIImpl.java:29)
at org.jenkinsci.plugins.gitclient.CliGitAPIImpl.withRepository(CliGitAPIImpl.java:72)
at hudson.plugins.analysis.util.GitBlamer.loadBlameResultsForFiles(GitBlamer.java:61)
at hudson.plugins.analysis.util.GitBlamer.blame(GitBlamer.java:54)
at hudson.plugins.analysis.util.AbstractBlamer$1.invoke(AbstractBlamer.java:62)
at hudson.plugins.analysis.util.AbstractBlamer$1.invoke(AbstractBlamer.java:59)
at hudson.FilePath$FileCallableWrapper.call(FilePath.java:2760)
at hudson.remoting.UserRequest.perform(UserRequest.java:207)
at hudson.remoting.UserRequest.perform(UserRequest.java:53)
at hudson.remoting.Request$2.run(Request.java:358)
at hudson.remoting.InterceptingExecutorService$1.call(InterceptingExecutorService.java:72)
at java.util.concurrent.FutureTask.run(FutureTask.java:266)
at java.util.concurrent.ThreadPoolExecutor.runWorker(ThreadPoolExecutor.java:1142)
at java.util.concurrent.ThreadPoolExecutor$Worker.run(ThreadPoolExecutor.java:617)
at java.lang.Thread.run(Thread.java:748)
Build step 'Publish Checkstyle analysis results' marked build as failure
Jenkins build is back to normal : HBase-Trunk_matrix » JDK 1.8 (latest),(Hadoop && !H5) #4611
Posted by Apache Jenkins Server <je...@builds.apache.org>.
See <https://builds.apache.org/job/HBase-Trunk_matrix/jdk=JDK%201.8%20(latest),label=(Hadoop%20&&%20!H5)/4611/display/redirect>
Build failed in Jenkins: HBase-Trunk_matrix » JDK 1.8 (latest),(Hadoop && !H5) #4610
Posted by Apache Jenkins Server <je...@builds.apache.org>.
See <https://builds.apache.org/job/HBase-Trunk_matrix/jdk=JDK%201.8%20(latest),label=(Hadoop%20&&%20!H5)/4610/display/redirect>
------------------------------------------
[...truncated 1.38 MB...]
[INFO]
[INFO] --- maven-enforcer-plugin:3.0.0-M1:enforce (hadoop-profile-min-maven-min-java-banned-xerces) @ hbase-shaded-client ---
[INFO]
[INFO] --- maven-enforcer-plugin:3.0.0-M1:enforce (banned-jsr305) @ hbase-shaded-client ---
[INFO]
[INFO] --- maven-enforcer-plugin:3.0.0-M1:enforce (banned-scala) @ hbase-shaded-client ---
[INFO]
[INFO] --- maven-enforcer-plugin:3.0.0-M1:enforce (banned-hbase-spark) @ hbase-shaded-client ---
[INFO]
[INFO] --- buildnumber-maven-plugin:1.4:create-timestamp (default) @ hbase-shaded-client ---
[INFO]
[INFO] --- maven-remote-resources-plugin:1.5:process (process-resource-bundles) @ hbase-shaded-client ---
[INFO]
[INFO] --- maven-remote-resources-plugin:1.5:process (aggregate-licenses) @ hbase-shaded-client ---
[INFO]
[INFO] --- maven-resources-plugin:2.7:resources (default-resources) @ hbase-shaded-client ---
[INFO] Using 'UTF-8' encoding to copy filtered resources.
[INFO] skip non existing resourceDirectory <https://builds.apache.org/job/HBase-Trunk_matrix/jdk=JDK%201.8%20(latest),label=(Hadoop%20&&%20!H5)/ws/hbase-shaded/hbase-shaded-client/src/main/resources>
[INFO] Copying 3 resources
[INFO] Copying 3 resources
[INFO]
[INFO] --- maven-enforcer-plugin:3.0.0-M1:enforce (check-aggregate-license) @ hbase-shaded-client ---
[INFO]
[INFO] --- maven-compiler-plugin:3.6.1:compile (default-compile) @ hbase-shaded-client ---
[INFO] No sources to compile
[INFO]
[INFO] --- maven-resources-plugin:2.7:testResources (default-testResources) @ hbase-shaded-client ---
[INFO] Not copying test resources
[INFO]
[INFO] --- maven-compiler-plugin:3.6.1:testCompile (default-testCompile) @ hbase-shaded-client ---
[INFO] Not compiling test sources
[INFO]
[INFO] --- maven-surefire-plugin:2.20.1:test (default-test) @ hbase-shaded-client ---
[INFO] No tests to run.
[INFO]
[INFO] --- maven-surefire-plugin:2.20.1:test (secondPartTestsExecution) @ hbase-shaded-client ---
[INFO] No tests to run.
[INFO]
[INFO] --- maven-jar-plugin:3.0.0:test-jar (default) @ hbase-shaded-client ---
[INFO] Skipping packaging of the test-jar
[INFO]
[INFO] --- maven-jar-plugin:3.0.0:jar (default-jar) @ hbase-shaded-client ---
[INFO] Building jar: <https://builds.apache.org/job/HBase-Trunk_matrix/jdk=JDK%201.8%20(latest),label=(Hadoop%20&&%20!H5)/ws/hbase-shaded/hbase-shaded-client/target/hbase-shaded-client-3.0.0-SNAPSHOT.jar>
[INFO]
[INFO] --- maven-install-plugin:2.5.2:install (default-install) @ hbase-shaded-client ---
[INFO] Installing <https://builds.apache.org/job/HBase-Trunk_matrix/jdk=JDK%201.8%20(latest),label=(Hadoop%20&&%20!H5)/ws/hbase-shaded/hbase-shaded-client/target/hbase-shaded-client-3.0.0-SNAPSHOT.jar> to /home/jenkins/.m2/repository/org/apache/hbase/hbase-shaded-client/3.0.0-SNAPSHOT/hbase-shaded-client-3.0.0-SNAPSHOT.jar
[INFO] Installing <https://builds.apache.org/job/HBase-Trunk_matrix/jdk=JDK%201.8%20(latest),label=(Hadoop%20&&%20!H5)/4610/artifact/hbase-shaded/hbase-shaded-client/pom.xml> to /home/jenkins/.m2/repository/org/apache/hbase/hbase-shaded-client/3.0.0-SNAPSHOT/hbase-shaded-client-3.0.0-SNAPSHOT.pom
[INFO]
[INFO] ------------------------------------------------------------------------
[INFO] Skipping Apache HBase - Shaded - MapReduce
[INFO] This project has been banned from the build due to previous failures.
[INFO] ------------------------------------------------------------------------
[INFO]
[INFO] ------------------------------------------------------------------------
[INFO] Skipping Apache HBase Shaded Packaging Invariants
[INFO] This project has been banned from the build due to previous failures.
[INFO] ------------------------------------------------------------------------
[INFO]
[INFO] ------------------------------------------------------------------------
[INFO] Building Apache HBase - Archetypes 3.0.0-SNAPSHOT
[INFO] ------------------------------------------------------------------------
[INFO]
[INFO] --- build-helper-maven-plugin:3.0.0:bsh-property (negate-license-bundles-property) @ hbase-archetypes ---
[INFO]
[INFO] --- maven-enforcer-plugin:3.0.0-M1:enforce (hadoop-profile-min-maven-min-java-banned-xerces) @ hbase-archetypes ---
[INFO]
[INFO] --- maven-enforcer-plugin:3.0.0-M1:enforce (banned-jsr305) @ hbase-archetypes ---
[INFO]
[INFO] --- maven-enforcer-plugin:3.0.0-M1:enforce (banned-scala) @ hbase-archetypes ---
[INFO]
[INFO] --- maven-enforcer-plugin:3.0.0-M1:enforce (banned-hbase-spark) @ hbase-archetypes ---
[INFO]
[INFO] --- buildnumber-maven-plugin:1.4:create-timestamp (default) @ hbase-archetypes ---
[INFO]
[INFO] --- maven-remote-resources-plugin:1.5:process (process-resource-bundles) @ hbase-archetypes ---
[INFO]
[INFO] --- maven-enforcer-plugin:3.0.0-M1:enforce (check-aggregate-license) @ hbase-archetypes ---
[INFO] Skipping Rule Enforcement.
[INFO]
[INFO] --- findbugs-maven-plugin:3.0.0:findbugs (default) @ hbase-archetypes ---
[INFO]
[INFO] --- maven-install-plugin:2.5.2:install (default-install) @ hbase-archetypes ---
[INFO] Installing <https://builds.apache.org/job/HBase-Trunk_matrix/jdk=JDK%201.8%20(latest),label=(Hadoop%20&&%20!H5)/4610/artifact/hbase-archetypes/pom.xml> to /home/jenkins/.m2/repository/org/apache/hbase/hbase-archetypes/3.0.0-SNAPSHOT/hbase-archetypes-3.0.0-SNAPSHOT.pom
[INFO]
[INFO] ------------------------------------------------------------------------
[INFO] Skipping Apache HBase - Exemplar for hbase-client archetype
[INFO] This project has been banned from the build due to previous failures.
[INFO] ------------------------------------------------------------------------
[INFO]
[INFO] ------------------------------------------------------------------------
[INFO] Skipping Apache HBase - Exemplar for hbase-shaded-client archetype
[INFO] This project has been banned from the build due to previous failures.
[INFO] ------------------------------------------------------------------------
[INFO]
[INFO] ------------------------------------------------------------------------
[INFO] Building Apache HBase - Archetype builder 3.0.0-SNAPSHOT
[INFO] ------------------------------------------------------------------------
[INFO]
[INFO] --- build-helper-maven-plugin:3.0.0:bsh-property (negate-license-bundles-property) @ hbase-archetype-builder ---
[INFO]
[INFO] --- maven-enforcer-plugin:3.0.0-M1:enforce (hadoop-profile-min-maven-min-java-banned-xerces) @ hbase-archetype-builder ---
[INFO]
[INFO] --- maven-enforcer-plugin:3.0.0-M1:enforce (banned-jsr305) @ hbase-archetype-builder ---
[INFO]
[INFO] --- maven-enforcer-plugin:3.0.0-M1:enforce (banned-scala) @ hbase-archetype-builder ---
[INFO]
[INFO] --- maven-enforcer-plugin:3.0.0-M1:enforce (banned-hbase-spark) @ hbase-archetype-builder ---
[INFO]
[INFO] --- buildnumber-maven-plugin:1.4:create-timestamp (default) @ hbase-archetype-builder ---
[INFO]
[INFO] --- maven-remote-resources-plugin:1.5:process (process-resource-bundles) @ hbase-archetype-builder ---
[INFO]
[INFO] --- maven-resources-plugin:2.7:copy-resources (hbase-client__copy-src-to-build-archetype-subdir) @ hbase-archetype-builder ---
[INFO] Using 'UTF-8' encoding to copy filtered resources.
[INFO] Copying 4 resources
[INFO]
[INFO] --- maven-resources-plugin:2.7:copy-resources (hbase-client__copy-pom-to-temp-for-xslt-processing) @ hbase-archetype-builder ---
[INFO] Using 'UTF-8' encoding to copy filtered resources.
[INFO] Copying 1 resource
[INFO]
[INFO] --- maven-resources-plugin:2.7:copy-resources (hbase-shaded-client__copy-src-to-build-archetype-subdir) @ hbase-archetype-builder ---
[INFO] Using 'UTF-8' encoding to copy filtered resources.
[INFO] Copying 4 resources
[INFO]
[INFO] --- maven-resources-plugin:2.7:copy-resources (hbase-shaded-client__copy-pom-to-temp-for-xslt-processing) @ hbase-archetype-builder ---
[INFO] Using 'UTF-8' encoding to copy filtered resources.
[INFO] Copying 1 resource
[INFO]
[INFO] --- maven-enforcer-plugin:3.0.0-M1:enforce (check-aggregate-license) @ hbase-archetype-builder ---
[INFO] Skipping Rule Enforcement.
[INFO]
[INFO] --- xml-maven-plugin:1.0.1:transform (modify-exemplar-pom-files-via-xslt) @ hbase-archetype-builder ---
Warning: org.apache.xerces.parsers.SAXParser: Feature 'http://javax.xml.XMLConstants/feature/secure-processing' is not recognized.
Warning: org.apache.xerces.parsers.SAXParser: Property 'http://javax.xml.XMLConstants/property/accessExternalDTD' is not recognized.
Warning: org.apache.xerces.parsers.SAXParser: Property 'http://www.oracle.com/xml/jaxp/properties/entityExpansionLimit' is not recognized.
[INFO] Transforming file: <https://builds.apache.org/job/HBase-Trunk_matrix/jdk=JDK%201.8%20(latest),label=(Hadoop%20&&%20!H5)/4610/artifact/hbase-archetypes/hbase-archetype-builder/../hbase-client-project/target/temp/pom.xml>
[INFO] Transformed 1 file(s).
[INFO] Transforming file: <https://builds.apache.org/job/HBase-Trunk_matrix/jdk=JDK%201.8%20(latest),label=(Hadoop%20&&%20!H5)/4610/artifact/hbase-archetypes/hbase-archetype-builder/../hbase-shaded-client-project/target/temp/pom.xml>
[INFO] Transformed 1 file(s).
[INFO]
[INFO] --- maven-antrun-plugin:1.8:run (make-scripts-executable) @ hbase-archetype-builder ---
[INFO] No Ant target defined - SKIPPED
[INFO]
[INFO] --- maven-antrun-plugin:1.8:run (run-createArchetypes-script) @ hbase-archetype-builder ---
[INFO] No Ant target defined - SKIPPED
[INFO]
[INFO] --- maven-resources-plugin:2.7:copy-resources (hbase-client-ARCHETYPE__copy-pom-to-temp-for-xslt-processing) @ hbase-archetype-builder ---
[INFO] Using 'UTF-8' encoding to copy filtered resources.
[INFO] skip non existing resourceDirectory <https://builds.apache.org/job/HBase-Trunk_matrix/jdk=JDK%201.8%20(latest),label=(Hadoop%20&&%20!H5)/ws/hbase-archetypes/hbase-archetype-builder/../hbase-client-project/target/build-archetype/target/generated-sources/archetype>
[INFO]
[INFO] --- maven-resources-plugin:2.7:copy-resources (hbase-shaded-client-ARCHETYPE__copy-pom-to-temp-for-xslt-processing) @ hbase-archetype-builder ---
[INFO] Using 'UTF-8' encoding to copy filtered resources.
[INFO] skip non existing resourceDirectory <https://builds.apache.org/job/HBase-Trunk_matrix/jdk=JDK%201.8%20(latest),label=(Hadoop%20&&%20!H5)/ws/hbase-archetypes/hbase-archetype-builder/../hbase-shaded-client-project/target/build-archetype/target/generated-sources/archetype>
[INFO]
[INFO] --- xml-maven-plugin:1.0.1:transform (modify-archetype-pom-files-via-xslt) @ hbase-archetype-builder ---
[WARNING] The directory <https://builds.apache.org/job/HBase-Trunk_matrix/jdk=JDK%201.8%20(latest),label=(Hadoop%20&&%20!H5)/ws/hbase-archetypes/hbase-archetype-builder/../hbase-client-project/target/temp-arch,> which is a base directory of a ValidationSet or TransformationSet, does not exist.
[WARNING] No files found for transformation by stylesheet modify_archetype_pom.xsl
[WARNING] The directory <https://builds.apache.org/job/HBase-Trunk_matrix/jdk=JDK%201.8%20(latest),label=(Hadoop%20&&%20!H5)/ws/hbase-archetypes/hbase-archetype-builder/../hbase-shaded-client-project/target/temp-arch,> which is a base directory of a ValidationSet or TransformationSet, does not exist.
[WARNING] No files found for transformation by stylesheet modify_archetype_pom.xsl
[INFO]
[INFO] --- maven-install-plugin:2.5.2:install (default-install) @ hbase-archetype-builder ---
[INFO] Installing <https://builds.apache.org/job/HBase-Trunk_matrix/jdk=JDK%201.8%20(latest),label=(Hadoop%20&&%20!H5)/4610/artifact/hbase-archetypes/hbase-archetype-builder/pom.xml> to /home/jenkins/.m2/repository/org/apache/hbase/hbase-archetype-builder/3.0.0-SNAPSHOT/hbase-archetype-builder-3.0.0-SNAPSHOT.pom
[INFO]
[INFO] --- maven-antrun-plugin:1.8:run (run-installArchetypes-script) @ hbase-archetype-builder ---
[INFO] No Ant target defined - SKIPPED
[INFO] ------------------------------------------------------------------------
[INFO] Reactor Summary:
[INFO]
[INFO] Apache HBase ...................................... SUCCESS [2.156s]
[INFO] Apache HBase - Checkstyle ......................... SUCCESS [0.551s]
[INFO] Apache HBase - Build Support ...................... SUCCESS [0.055s]
[INFO] Apache HBase - Error Prone Rules .................. SUCCESS [0.198s]
[INFO] Apache HBase - Annotations ........................ SUCCESS [0.445s]
[INFO] Apache HBase - Build Configuration ................ SUCCESS [0.075s]
[INFO] Apache HBase - Shaded Protocol .................... SUCCESS [23.036s]
[INFO] Apache HBase - Common ............................. SUCCESS [2:11.842s]
[INFO] Apache HBase - Metrics API ........................ SUCCESS [2.105s]
[INFO] Apache HBase - Hadoop Compatibility ............... SUCCESS [13.659s]
[INFO] Apache HBase - Metrics Implementation ............. SUCCESS [9.212s]
[INFO] Apache HBase - Hadoop Two Compatibility ........... SUCCESS [16.207s]
[INFO] Apache HBase - Protocol ........................... SUCCESS [6.542s]
[INFO] Apache HBase - Client ............................. SUCCESS [2:57.982s]
[INFO] Apache HBase - Zookeeper .......................... SUCCESS [29.965s]
[INFO] Apache HBase - Replication ........................ SUCCESS [9.785s]
[INFO] Apache HBase - Resource Bundle .................... SUCCESS [0.165s]
[INFO] Apache HBase - HTTP ............................... SUCCESS [34.454s]
[INFO] Apache HBase - Procedure .......................... SUCCESS [2:25.029s]
[INFO] Apache HBase - Server ............................. FAILURE [3:01:27.526s]
[INFO] Apache HBase - MapReduce .......................... SKIPPED
[INFO] Apache HBase - Testing Util ....................... SKIPPED
[INFO] Apache HBase - Thrift ............................. SKIPPED
[INFO] Apache HBase - RSGroup ............................ SKIPPED
[INFO] Apache HBase - Shell .............................. SKIPPED
[INFO] Apache HBase - Coprocessor Endpoint ............... SKIPPED
[INFO] Apache HBase - Backup ............................. SKIPPED
[INFO] Apache HBase - Integration Tests .................. SKIPPED
[INFO] Apache HBase - Examples ........................... SKIPPED
[INFO] Apache HBase - Rest ............................... SKIPPED
[INFO] Apache HBase - External Block Cache ............... SKIPPED
[INFO] Apache HBase - Spark .............................. SKIPPED
[INFO] Apache HBase - Spark Integration Tests ............ SKIPPED
[INFO] Apache HBase - Assembly ........................... SKIPPED
[INFO] Apache HBase - Shaded ............................. SUCCESS [0.250s]
[INFO] Apache HBase - Shaded - Client .................... SUCCESS [1.241s]
[INFO] Apache HBase - Shaded - MapReduce ................. SKIPPED
[INFO] Apache HBase Shaded Packaging Invariants .......... SKIPPED
[INFO] Apache HBase - Archetypes ......................... SUCCESS [0.055s]
[INFO] Apache HBase - Exemplar for hbase-client archetype SKIPPED
[INFO] Apache HBase - Exemplar for hbase-shaded-client archetype SKIPPED
[INFO] Apache HBase - Archetype builder .................. SUCCESS [0.488s]
[INFO] ------------------------------------------------------------------------
[INFO] BUILD FAILURE
[INFO] ------------------------------------------------------------------------
[INFO] Total time: 3:11:34.517s
[INFO] Finished at: Mon Feb 19 08:57:56 UTC 2018
[INFO] Final Memory: 99M/8330M
[INFO] ------------------------------------------------------------------------
[ERROR] Failed to execute goal org.apache.maven.plugins:maven-surefire-plugin:2.20.1:test (secondPartTestsExecution) on project hbase-server: There are test failures.
[ERROR]
[ERROR] Please refer to <https://builds.apache.org/job/HBase-Trunk_matrix/jdk=JDK%201.8%20(latest),label=(Hadoop%20&&%20!H5)/ws/hbase-server/target/surefire-reports> for the individual test results.
[ERROR] Please refer to dump files (if any exist) [date]-jvmRun[N].dump, [date].dumpstream and [date]-jvmRun[N].dumpstream.
[ERROR] -> [Help 1]
[ERROR]
[ERROR] To see the full stack trace of the errors, re-run Maven with the -e switch.
[ERROR] Re-run Maven using the -X switch to enable full debug logging.
[ERROR]
[ERROR] For more information about the errors and possible solutions, please read the following articles:
[ERROR] [Help 1] http://cwiki.apache.org/confluence/display/MAVEN/MojoFailureException
[ERROR]
[ERROR] After correcting the problems, you can resume the build with the command
[ERROR] mvn <goals> -rf :hbase-server
Build step 'Invoke top-level Maven targets' marked build as failure
Performing Post build task...
Match found for :.* : True
Logical operation result is TRUE
Running script : # Run zombie detector script
./dev-support/zombie-detector.sh --jenkins ${BUILD_ID}
[11c72c70] $ /bin/bash -xe /tmp/jenkins9107184306270559408.sh
+ ./dev-support/zombie-detector.sh --jenkins 4610
Mon Feb 19 08:57:59 UTC 2018 We're ok: there is no zombie test
{color:green}+1 zombies{color}. No zombie tests found running at the end of the build.
POST BUILD TASK : SUCCESS
END OF POST BUILD TASK : 0
Archiving artifacts
Recording test results
[FINDBUGS] Skipping publisher since build result is FAILURE
[CHECKSTYLE] Skipping publisher since build result is FAILURE
Build failed in Jenkins: HBase-Trunk_matrix » JDK 1.8 (latest),(Hadoop && !H5) #4609
Posted by Apache Jenkins Server <je...@builds.apache.org>.
See <https://builds.apache.org/job/HBase-Trunk_matrix/jdk=JDK%201.8%20(latest),label=(Hadoop%20&&%20!H5)/4609/display/redirect>
------------------------------------------
[...truncated 1.38 MB...]
[INFO]
[INFO] --- maven-enforcer-plugin:3.0.0-M1:enforce (hadoop-profile-min-maven-min-java-banned-xerces) @ hbase-shaded-client ---
[INFO]
[INFO] --- maven-enforcer-plugin:3.0.0-M1:enforce (banned-jsr305) @ hbase-shaded-client ---
[INFO]
[INFO] --- maven-enforcer-plugin:3.0.0-M1:enforce (banned-scala) @ hbase-shaded-client ---
[INFO]
[INFO] --- maven-enforcer-plugin:3.0.0-M1:enforce (banned-hbase-spark) @ hbase-shaded-client ---
[INFO]
[INFO] --- buildnumber-maven-plugin:1.4:create-timestamp (default) @ hbase-shaded-client ---
[INFO]
[INFO] --- maven-remote-resources-plugin:1.5:process (process-resource-bundles) @ hbase-shaded-client ---
[INFO]
[INFO] --- maven-remote-resources-plugin:1.5:process (aggregate-licenses) @ hbase-shaded-client ---
[INFO]
[INFO] --- maven-resources-plugin:2.7:resources (default-resources) @ hbase-shaded-client ---
[INFO] Using 'UTF-8' encoding to copy filtered resources.
[INFO] skip non existing resourceDirectory <https://builds.apache.org/job/HBase-Trunk_matrix/jdk=JDK%201.8%20(latest),label=(Hadoop%20&&%20!H5)/ws/hbase-shaded/hbase-shaded-client/src/main/resources>
[INFO] Copying 3 resources
[INFO] Copying 3 resources
[INFO]
[INFO] --- maven-enforcer-plugin:3.0.0-M1:enforce (check-aggregate-license) @ hbase-shaded-client ---
[INFO]
[INFO] --- maven-compiler-plugin:3.6.1:compile (default-compile) @ hbase-shaded-client ---
[INFO] No sources to compile
[INFO]
[INFO] --- maven-resources-plugin:2.7:testResources (default-testResources) @ hbase-shaded-client ---
[INFO] Not copying test resources
[INFO]
[INFO] --- maven-compiler-plugin:3.6.1:testCompile (default-testCompile) @ hbase-shaded-client ---
[INFO] Not compiling test sources
[INFO]
[INFO] --- maven-surefire-plugin:2.20.1:test (default-test) @ hbase-shaded-client ---
[INFO] No tests to run.
[INFO]
[INFO] --- maven-surefire-plugin:2.20.1:test (secondPartTestsExecution) @ hbase-shaded-client ---
[INFO] No tests to run.
[INFO]
[INFO] --- maven-jar-plugin:3.0.0:test-jar (default) @ hbase-shaded-client ---
[INFO] Skipping packaging of the test-jar
[INFO]
[INFO] --- maven-jar-plugin:3.0.0:jar (default-jar) @ hbase-shaded-client ---
[INFO] Building jar: <https://builds.apache.org/job/HBase-Trunk_matrix/jdk=JDK%201.8%20(latest),label=(Hadoop%20&&%20!H5)/ws/hbase-shaded/hbase-shaded-client/target/hbase-shaded-client-3.0.0-SNAPSHOT.jar>
[INFO]
[INFO] --- maven-install-plugin:2.5.2:install (default-install) @ hbase-shaded-client ---
[INFO] Installing <https://builds.apache.org/job/HBase-Trunk_matrix/jdk=JDK%201.8%20(latest),label=(Hadoop%20&&%20!H5)/ws/hbase-shaded/hbase-shaded-client/target/hbase-shaded-client-3.0.0-SNAPSHOT.jar> to /home/jenkins/.m2/repository/org/apache/hbase/hbase-shaded-client/3.0.0-SNAPSHOT/hbase-shaded-client-3.0.0-SNAPSHOT.jar
[INFO] Installing <https://builds.apache.org/job/HBase-Trunk_matrix/jdk=JDK%201.8%20(latest),label=(Hadoop%20&&%20!H5)/4609/artifact/hbase-shaded/hbase-shaded-client/pom.xml> to /home/jenkins/.m2/repository/org/apache/hbase/hbase-shaded-client/3.0.0-SNAPSHOT/hbase-shaded-client-3.0.0-SNAPSHOT.pom
[INFO]
[INFO] ------------------------------------------------------------------------
[INFO] Skipping Apache HBase - Shaded - MapReduce
[INFO] This project has been banned from the build due to previous failures.
[INFO] ------------------------------------------------------------------------
[INFO]
[INFO] ------------------------------------------------------------------------
[INFO] Skipping Apache HBase Shaded Packaging Invariants
[INFO] This project has been banned from the build due to previous failures.
[INFO] ------------------------------------------------------------------------
[INFO]
[INFO] ------------------------------------------------------------------------
[INFO] Building Apache HBase - Archetypes 3.0.0-SNAPSHOT
[INFO] ------------------------------------------------------------------------
[INFO]
[INFO] --- build-helper-maven-plugin:3.0.0:bsh-property (negate-license-bundles-property) @ hbase-archetypes ---
[INFO]
[INFO] --- maven-enforcer-plugin:3.0.0-M1:enforce (hadoop-profile-min-maven-min-java-banned-xerces) @ hbase-archetypes ---
[INFO]
[INFO] --- maven-enforcer-plugin:3.0.0-M1:enforce (banned-jsr305) @ hbase-archetypes ---
[INFO]
[INFO] --- maven-enforcer-plugin:3.0.0-M1:enforce (banned-scala) @ hbase-archetypes ---
[INFO]
[INFO] --- maven-enforcer-plugin:3.0.0-M1:enforce (banned-hbase-spark) @ hbase-archetypes ---
[INFO]
[INFO] --- buildnumber-maven-plugin:1.4:create-timestamp (default) @ hbase-archetypes ---
[INFO]
[INFO] --- maven-remote-resources-plugin:1.5:process (process-resource-bundles) @ hbase-archetypes ---
[INFO]
[INFO] --- maven-enforcer-plugin:3.0.0-M1:enforce (check-aggregate-license) @ hbase-archetypes ---
[INFO] Skipping Rule Enforcement.
[INFO]
[INFO] --- findbugs-maven-plugin:3.0.0:findbugs (default) @ hbase-archetypes ---
[INFO]
[INFO] --- maven-install-plugin:2.5.2:install (default-install) @ hbase-archetypes ---
[INFO] Installing <https://builds.apache.org/job/HBase-Trunk_matrix/jdk=JDK%201.8%20(latest),label=(Hadoop%20&&%20!H5)/4609/artifact/hbase-archetypes/pom.xml> to /home/jenkins/.m2/repository/org/apache/hbase/hbase-archetypes/3.0.0-SNAPSHOT/hbase-archetypes-3.0.0-SNAPSHOT.pom
[INFO]
[INFO] ------------------------------------------------------------------------
[INFO] Skipping Apache HBase - Exemplar for hbase-client archetype
[INFO] This project has been banned from the build due to previous failures.
[INFO] ------------------------------------------------------------------------
[INFO]
[INFO] ------------------------------------------------------------------------
[INFO] Skipping Apache HBase - Exemplar for hbase-shaded-client archetype
[INFO] This project has been banned from the build due to previous failures.
[INFO] ------------------------------------------------------------------------
[INFO]
[INFO] ------------------------------------------------------------------------
[INFO] Building Apache HBase - Archetype builder 3.0.0-SNAPSHOT
[INFO] ------------------------------------------------------------------------
[INFO]
[INFO] --- build-helper-maven-plugin:3.0.0:bsh-property (negate-license-bundles-property) @ hbase-archetype-builder ---
[INFO]
[INFO] --- maven-enforcer-plugin:3.0.0-M1:enforce (hadoop-profile-min-maven-min-java-banned-xerces) @ hbase-archetype-builder ---
[INFO]
[INFO] --- maven-enforcer-plugin:3.0.0-M1:enforce (banned-jsr305) @ hbase-archetype-builder ---
[INFO]
[INFO] --- maven-enforcer-plugin:3.0.0-M1:enforce (banned-scala) @ hbase-archetype-builder ---
[INFO]
[INFO] --- maven-enforcer-plugin:3.0.0-M1:enforce (banned-hbase-spark) @ hbase-archetype-builder ---
[INFO]
[INFO] --- buildnumber-maven-plugin:1.4:create-timestamp (default) @ hbase-archetype-builder ---
[INFO]
[INFO] --- maven-remote-resources-plugin:1.5:process (process-resource-bundles) @ hbase-archetype-builder ---
[INFO]
[INFO] --- maven-resources-plugin:2.7:copy-resources (hbase-client__copy-src-to-build-archetype-subdir) @ hbase-archetype-builder ---
[INFO] Using 'UTF-8' encoding to copy filtered resources.
[INFO] Copying 4 resources
[INFO]
[INFO] --- maven-resources-plugin:2.7:copy-resources (hbase-client__copy-pom-to-temp-for-xslt-processing) @ hbase-archetype-builder ---
[INFO] Using 'UTF-8' encoding to copy filtered resources.
[INFO] Copying 1 resource
[INFO]
[INFO] --- maven-resources-plugin:2.7:copy-resources (hbase-shaded-client__copy-src-to-build-archetype-subdir) @ hbase-archetype-builder ---
[INFO] Using 'UTF-8' encoding to copy filtered resources.
[INFO] Copying 4 resources
[INFO]
[INFO] --- maven-resources-plugin:2.7:copy-resources (hbase-shaded-client__copy-pom-to-temp-for-xslt-processing) @ hbase-archetype-builder ---
[INFO] Using 'UTF-8' encoding to copy filtered resources.
[INFO] Copying 1 resource
[INFO]
[INFO] --- maven-enforcer-plugin:3.0.0-M1:enforce (check-aggregate-license) @ hbase-archetype-builder ---
[INFO] Skipping Rule Enforcement.
[INFO]
[INFO] --- xml-maven-plugin:1.0.1:transform (modify-exemplar-pom-files-via-xslt) @ hbase-archetype-builder ---
Warning: org.apache.xerces.parsers.SAXParser: Feature 'http://javax.xml.XMLConstants/feature/secure-processing' is not recognized.
Warning: org.apache.xerces.parsers.SAXParser: Property 'http://javax.xml.XMLConstants/property/accessExternalDTD' is not recognized.
Warning: org.apache.xerces.parsers.SAXParser: Property 'http://www.oracle.com/xml/jaxp/properties/entityExpansionLimit' is not recognized.
[INFO] Transforming file: <https://builds.apache.org/job/HBase-Trunk_matrix/jdk=JDK%201.8%20(latest),label=(Hadoop%20&&%20!H5)/4609/artifact/hbase-archetypes/hbase-archetype-builder/../hbase-client-project/target/temp/pom.xml>
[INFO] Transformed 1 file(s).
[INFO] Transforming file: <https://builds.apache.org/job/HBase-Trunk_matrix/jdk=JDK%201.8%20(latest),label=(Hadoop%20&&%20!H5)/4609/artifact/hbase-archetypes/hbase-archetype-builder/../hbase-shaded-client-project/target/temp/pom.xml>
[INFO] Transformed 1 file(s).
[INFO]
[INFO] --- maven-antrun-plugin:1.8:run (make-scripts-executable) @ hbase-archetype-builder ---
[INFO] No Ant target defined - SKIPPED
[INFO]
[INFO] --- maven-antrun-plugin:1.8:run (run-createArchetypes-script) @ hbase-archetype-builder ---
[INFO] No Ant target defined - SKIPPED
[INFO]
[INFO] --- maven-resources-plugin:2.7:copy-resources (hbase-client-ARCHETYPE__copy-pom-to-temp-for-xslt-processing) @ hbase-archetype-builder ---
[INFO] Using 'UTF-8' encoding to copy filtered resources.
[INFO] skip non existing resourceDirectory <https://builds.apache.org/job/HBase-Trunk_matrix/jdk=JDK%201.8%20(latest),label=(Hadoop%20&&%20!H5)/ws/hbase-archetypes/hbase-archetype-builder/../hbase-client-project/target/build-archetype/target/generated-sources/archetype>
[INFO]
[INFO] --- maven-resources-plugin:2.7:copy-resources (hbase-shaded-client-ARCHETYPE__copy-pom-to-temp-for-xslt-processing) @ hbase-archetype-builder ---
[INFO] Using 'UTF-8' encoding to copy filtered resources.
[INFO] skip non existing resourceDirectory <https://builds.apache.org/job/HBase-Trunk_matrix/jdk=JDK%201.8%20(latest),label=(Hadoop%20&&%20!H5)/ws/hbase-archetypes/hbase-archetype-builder/../hbase-shaded-client-project/target/build-archetype/target/generated-sources/archetype>
[INFO]
[INFO] --- xml-maven-plugin:1.0.1:transform (modify-archetype-pom-files-via-xslt) @ hbase-archetype-builder ---
[WARNING] The directory <https://builds.apache.org/job/HBase-Trunk_matrix/jdk=JDK%201.8%20(latest),label=(Hadoop%20&&%20!H5)/ws/hbase-archetypes/hbase-archetype-builder/../hbase-client-project/target/temp-arch,> which is a base directory of a ValidationSet or TransformationSet, does not exist.
[WARNING] No files found for transformation by stylesheet modify_archetype_pom.xsl
[WARNING] The directory <https://builds.apache.org/job/HBase-Trunk_matrix/jdk=JDK%201.8%20(latest),label=(Hadoop%20&&%20!H5)/ws/hbase-archetypes/hbase-archetype-builder/../hbase-shaded-client-project/target/temp-arch,> which is a base directory of a ValidationSet or TransformationSet, does not exist.
[WARNING] No files found for transformation by stylesheet modify_archetype_pom.xsl
[INFO]
[INFO] --- maven-install-plugin:2.5.2:install (default-install) @ hbase-archetype-builder ---
[INFO] Installing <https://builds.apache.org/job/HBase-Trunk_matrix/jdk=JDK%201.8%20(latest),label=(Hadoop%20&&%20!H5)/4609/artifact/hbase-archetypes/hbase-archetype-builder/pom.xml> to /home/jenkins/.m2/repository/org/apache/hbase/hbase-archetype-builder/3.0.0-SNAPSHOT/hbase-archetype-builder-3.0.0-SNAPSHOT.pom
[INFO]
[INFO] --- maven-antrun-plugin:1.8:run (run-installArchetypes-script) @ hbase-archetype-builder ---
[INFO] No Ant target defined - SKIPPED
[INFO] ------------------------------------------------------------------------
[INFO] Reactor Summary:
[INFO]
[INFO] Apache HBase ...................................... SUCCESS [1.903s]
[INFO] Apache HBase - Checkstyle ......................... SUCCESS [0.509s]
[INFO] Apache HBase - Build Support ...................... SUCCESS [0.068s]
[INFO] Apache HBase - Error Prone Rules .................. SUCCESS [0.197s]
[INFO] Apache HBase - Annotations ........................ SUCCESS [0.429s]
[INFO] Apache HBase - Build Configuration ................ SUCCESS [0.070s]
[INFO] Apache HBase - Shaded Protocol .................... SUCCESS [23.066s]
[INFO] Apache HBase - Common ............................. SUCCESS [2:23.339s]
[INFO] Apache HBase - Metrics API ........................ SUCCESS [2.310s]
[INFO] Apache HBase - Hadoop Compatibility ............... SUCCESS [14.360s]
[INFO] Apache HBase - Metrics Implementation ............. SUCCESS [10.334s]
[INFO] Apache HBase - Hadoop Two Compatibility ........... SUCCESS [18.605s]
[INFO] Apache HBase - Protocol ........................... SUCCESS [7.430s]
[INFO] Apache HBase - Client ............................. SUCCESS [2:55.024s]
[INFO] Apache HBase - Zookeeper .......................... SUCCESS [28.915s]
[INFO] Apache HBase - Replication ........................ SUCCESS [6.702s]
[INFO] Apache HBase - Resource Bundle .................... SUCCESS [0.432s]
[INFO] Apache HBase - HTTP ............................... SUCCESS [36.663s]
[INFO] Apache HBase - Procedure .......................... SUCCESS [2:27.832s]
[INFO] Apache HBase - Server ............................. FAILURE [1:46:38.454s]
[INFO] Apache HBase - MapReduce .......................... SKIPPED
[INFO] Apache HBase - Testing Util ....................... SKIPPED
[INFO] Apache HBase - Thrift ............................. SKIPPED
[INFO] Apache HBase - RSGroup ............................ SKIPPED
[INFO] Apache HBase - Shell .............................. SKIPPED
[INFO] Apache HBase - Coprocessor Endpoint ............... SKIPPED
[INFO] Apache HBase - Backup ............................. SKIPPED
[INFO] Apache HBase - Integration Tests .................. SKIPPED
[INFO] Apache HBase - Examples ........................... SKIPPED
[INFO] Apache HBase - Rest ............................... SKIPPED
[INFO] Apache HBase - External Block Cache ............... SKIPPED
[INFO] Apache HBase - Spark .............................. SKIPPED
[INFO] Apache HBase - Spark Integration Tests ............ SKIPPED
[INFO] Apache HBase - Assembly ........................... SKIPPED
[INFO] Apache HBase - Shaded ............................. SUCCESS [0.253s]
[INFO] Apache HBase - Shaded - Client .................... SUCCESS [1.178s]
[INFO] Apache HBase - Shaded - MapReduce ................. SKIPPED
[INFO] Apache HBase Shaded Packaging Invariants .......... SKIPPED
[INFO] Apache HBase - Archetypes ......................... SUCCESS [0.055s]
[INFO] Apache HBase - Exemplar for hbase-client archetype SKIPPED
[INFO] Apache HBase - Exemplar for hbase-shaded-client archetype SKIPPED
[INFO] Apache HBase - Archetype builder .................. SUCCESS [0.393s]
[INFO] ------------------------------------------------------------------------
[INFO] BUILD FAILURE
[INFO] ------------------------------------------------------------------------
[INFO] Total time: 1:56:59.847s
[INFO] Finished at: Mon Feb 19 03:42:28 UTC 2018
[INFO] Final Memory: 104M/8362M
[INFO] ------------------------------------------------------------------------
[ERROR] Failed to execute goal org.apache.maven.plugins:maven-surefire-plugin:2.20.1:test (secondPartTestsExecution) on project hbase-server: There are test failures.
[ERROR]
[ERROR] Please refer to <https://builds.apache.org/job/HBase-Trunk_matrix/jdk=JDK%201.8%20(latest),label=(Hadoop%20&&%20!H5)/ws/hbase-server/target/surefire-reports> for the individual test results.
[ERROR] Please refer to dump files (if any exist) [date]-jvmRun[N].dump, [date].dumpstream and [date]-jvmRun[N].dumpstream.
[ERROR] -> [Help 1]
[ERROR]
[ERROR] To see the full stack trace of the errors, re-run Maven with the -e switch.
[ERROR] Re-run Maven using the -X switch to enable full debug logging.
[ERROR]
[ERROR] For more information about the errors and possible solutions, please read the following articles:
[ERROR] [Help 1] http://cwiki.apache.org/confluence/display/MAVEN/MojoFailureException
[ERROR]
[ERROR] After correcting the problems, you can resume the build with the command
[ERROR] mvn <goals> -rf :hbase-server
Build step 'Invoke top-level Maven targets' marked build as failure
Performing Post build task...
Match found for :.* : True
Logical operation result is TRUE
Running script : # Run zombie detector script
./dev-support/zombie-detector.sh --jenkins ${BUILD_ID}
[11c72c70] $ /bin/bash -xe /tmp/jenkins3227202814305745868.sh
+ ./dev-support/zombie-detector.sh --jenkins 4609
Mon Feb 19 03:42:31 UTC 2018 We're ok: there is no zombie test
{color:green}+1 zombies{color}. No zombie tests found running at the end of the build.
POST BUILD TASK : SUCCESS
END OF POST BUILD TASK : 0
Archiving artifacts
Recording test results
[FINDBUGS] Skipping publisher since build result is FAILURE
[CHECKSTYLE] Skipping publisher since build result is FAILURE
Build failed in Jenkins: HBase-Trunk_matrix » JDK 1.8 (latest),(Hadoop && !H5) #4608
Posted by Apache Jenkins Server <je...@builds.apache.org>.
See <https://builds.apache.org/job/HBase-Trunk_matrix/jdk=JDK%201.8%20(latest),label=(Hadoop%20&&%20!H5)/4608/display/redirect>
------------------------------------------
[...truncated 1.38 MB...]
[INFO]
[INFO] --- maven-enforcer-plugin:3.0.0-M1:enforce (hadoop-profile-min-maven-min-java-banned-xerces) @ hbase-shaded-client ---
[INFO]
[INFO] --- maven-enforcer-plugin:3.0.0-M1:enforce (banned-jsr305) @ hbase-shaded-client ---
[INFO]
[INFO] --- maven-enforcer-plugin:3.0.0-M1:enforce (banned-scala) @ hbase-shaded-client ---
[INFO]
[INFO] --- maven-enforcer-plugin:3.0.0-M1:enforce (banned-hbase-spark) @ hbase-shaded-client ---
[INFO]
[INFO] --- buildnumber-maven-plugin:1.4:create-timestamp (default) @ hbase-shaded-client ---
[INFO]
[INFO] --- maven-remote-resources-plugin:1.5:process (process-resource-bundles) @ hbase-shaded-client ---
[INFO]
[INFO] --- maven-remote-resources-plugin:1.5:process (aggregate-licenses) @ hbase-shaded-client ---
[INFO]
[INFO] --- maven-resources-plugin:2.7:resources (default-resources) @ hbase-shaded-client ---
[INFO] Using 'UTF-8' encoding to copy filtered resources.
[INFO] skip non existing resourceDirectory <https://builds.apache.org/job/HBase-Trunk_matrix/jdk=JDK%201.8%20(latest),label=(Hadoop%20&&%20!H5)/ws/hbase-shaded/hbase-shaded-client/src/main/resources>
[INFO] Copying 3 resources
[INFO] Copying 3 resources
[INFO]
[INFO] --- maven-enforcer-plugin:3.0.0-M1:enforce (check-aggregate-license) @ hbase-shaded-client ---
[INFO]
[INFO] --- maven-compiler-plugin:3.6.1:compile (default-compile) @ hbase-shaded-client ---
[INFO] No sources to compile
[INFO]
[INFO] --- maven-resources-plugin:2.7:testResources (default-testResources) @ hbase-shaded-client ---
[INFO] Not copying test resources
[INFO]
[INFO] --- maven-compiler-plugin:3.6.1:testCompile (default-testCompile) @ hbase-shaded-client ---
[INFO] Not compiling test sources
[INFO]
[INFO] --- maven-surefire-plugin:2.20.1:test (default-test) @ hbase-shaded-client ---
[INFO] No tests to run.
[INFO]
[INFO] --- maven-surefire-plugin:2.20.1:test (secondPartTestsExecution) @ hbase-shaded-client ---
[INFO] No tests to run.
[INFO]
[INFO] --- maven-jar-plugin:3.0.0:test-jar (default) @ hbase-shaded-client ---
[INFO] Skipping packaging of the test-jar
[INFO]
[INFO] --- maven-jar-plugin:3.0.0:jar (default-jar) @ hbase-shaded-client ---
[INFO] Building jar: <https://builds.apache.org/job/HBase-Trunk_matrix/jdk=JDK%201.8%20(latest),label=(Hadoop%20&&%20!H5)/ws/hbase-shaded/hbase-shaded-client/target/hbase-shaded-client-3.0.0-SNAPSHOT.jar>
[INFO]
[INFO] --- maven-install-plugin:2.5.2:install (default-install) @ hbase-shaded-client ---
[INFO] Installing <https://builds.apache.org/job/HBase-Trunk_matrix/jdk=JDK%201.8%20(latest),label=(Hadoop%20&&%20!H5)/ws/hbase-shaded/hbase-shaded-client/target/hbase-shaded-client-3.0.0-SNAPSHOT.jar> to /home/jenkins/.m2/repository/org/apache/hbase/hbase-shaded-client/3.0.0-SNAPSHOT/hbase-shaded-client-3.0.0-SNAPSHOT.jar
[INFO] Installing <https://builds.apache.org/job/HBase-Trunk_matrix/jdk=JDK%201.8%20(latest),label=(Hadoop%20&&%20!H5)/4608/artifact/hbase-shaded/hbase-shaded-client/pom.xml> to /home/jenkins/.m2/repository/org/apache/hbase/hbase-shaded-client/3.0.0-SNAPSHOT/hbase-shaded-client-3.0.0-SNAPSHOT.pom
[INFO]
[INFO] ------------------------------------------------------------------------
[INFO] Skipping Apache HBase - Shaded - MapReduce
[INFO] This project has been banned from the build due to previous failures.
[INFO] ------------------------------------------------------------------------
[INFO]
[INFO] ------------------------------------------------------------------------
[INFO] Skipping Apache HBase Shaded Packaging Invariants
[INFO] This project has been banned from the build due to previous failures.
[INFO] ------------------------------------------------------------------------
[INFO]
[INFO] ------------------------------------------------------------------------
[INFO] Building Apache HBase - Archetypes 3.0.0-SNAPSHOT
[INFO] ------------------------------------------------------------------------
[INFO]
[INFO] --- build-helper-maven-plugin:3.0.0:bsh-property (negate-license-bundles-property) @ hbase-archetypes ---
[INFO]
[INFO] --- maven-enforcer-plugin:3.0.0-M1:enforce (hadoop-profile-min-maven-min-java-banned-xerces) @ hbase-archetypes ---
[INFO]
[INFO] --- maven-enforcer-plugin:3.0.0-M1:enforce (banned-jsr305) @ hbase-archetypes ---
[INFO]
[INFO] --- maven-enforcer-plugin:3.0.0-M1:enforce (banned-scala) @ hbase-archetypes ---
[INFO]
[INFO] --- maven-enforcer-plugin:3.0.0-M1:enforce (banned-hbase-spark) @ hbase-archetypes ---
[INFO]
[INFO] --- buildnumber-maven-plugin:1.4:create-timestamp (default) @ hbase-archetypes ---
[INFO]
[INFO] --- maven-remote-resources-plugin:1.5:process (process-resource-bundles) @ hbase-archetypes ---
[INFO]
[INFO] --- maven-enforcer-plugin:3.0.0-M1:enforce (check-aggregate-license) @ hbase-archetypes ---
[INFO] Skipping Rule Enforcement.
[INFO]
[INFO] --- findbugs-maven-plugin:3.0.0:findbugs (default) @ hbase-archetypes ---
[INFO]
[INFO] --- maven-install-plugin:2.5.2:install (default-install) @ hbase-archetypes ---
[INFO] Installing <https://builds.apache.org/job/HBase-Trunk_matrix/jdk=JDK%201.8%20(latest),label=(Hadoop%20&&%20!H5)/4608/artifact/hbase-archetypes/pom.xml> to /home/jenkins/.m2/repository/org/apache/hbase/hbase-archetypes/3.0.0-SNAPSHOT/hbase-archetypes-3.0.0-SNAPSHOT.pom
[INFO]
[INFO] ------------------------------------------------------------------------
[INFO] Skipping Apache HBase - Exemplar for hbase-client archetype
[INFO] This project has been banned from the build due to previous failures.
[INFO] ------------------------------------------------------------------------
[INFO]
[INFO] ------------------------------------------------------------------------
[INFO] Skipping Apache HBase - Exemplar for hbase-shaded-client archetype
[INFO] This project has been banned from the build due to previous failures.
[INFO] ------------------------------------------------------------------------
[INFO]
[INFO] ------------------------------------------------------------------------
[INFO] Building Apache HBase - Archetype builder 3.0.0-SNAPSHOT
[INFO] ------------------------------------------------------------------------
[INFO]
[INFO] --- build-helper-maven-plugin:3.0.0:bsh-property (negate-license-bundles-property) @ hbase-archetype-builder ---
[INFO]
[INFO] --- maven-enforcer-plugin:3.0.0-M1:enforce (hadoop-profile-min-maven-min-java-banned-xerces) @ hbase-archetype-builder ---
[INFO]
[INFO] --- maven-enforcer-plugin:3.0.0-M1:enforce (banned-jsr305) @ hbase-archetype-builder ---
[INFO]
[INFO] --- maven-enforcer-plugin:3.0.0-M1:enforce (banned-scala) @ hbase-archetype-builder ---
[INFO]
[INFO] --- maven-enforcer-plugin:3.0.0-M1:enforce (banned-hbase-spark) @ hbase-archetype-builder ---
[INFO]
[INFO] --- buildnumber-maven-plugin:1.4:create-timestamp (default) @ hbase-archetype-builder ---
[INFO]
[INFO] --- maven-remote-resources-plugin:1.5:process (process-resource-bundles) @ hbase-archetype-builder ---
[INFO]
[INFO] --- maven-resources-plugin:2.7:copy-resources (hbase-client__copy-src-to-build-archetype-subdir) @ hbase-archetype-builder ---
[INFO] Using 'UTF-8' encoding to copy filtered resources.
[INFO] Copying 4 resources
[INFO]
[INFO] --- maven-resources-plugin:2.7:copy-resources (hbase-client__copy-pom-to-temp-for-xslt-processing) @ hbase-archetype-builder ---
[INFO] Using 'UTF-8' encoding to copy filtered resources.
[INFO] Copying 1 resource
[INFO]
[INFO] --- maven-resources-plugin:2.7:copy-resources (hbase-shaded-client__copy-src-to-build-archetype-subdir) @ hbase-archetype-builder ---
[INFO] Using 'UTF-8' encoding to copy filtered resources.
[INFO] Copying 4 resources
[INFO]
[INFO] --- maven-resources-plugin:2.7:copy-resources (hbase-shaded-client__copy-pom-to-temp-for-xslt-processing) @ hbase-archetype-builder ---
[INFO] Using 'UTF-8' encoding to copy filtered resources.
[INFO] Copying 1 resource
[INFO]
[INFO] --- maven-enforcer-plugin:3.0.0-M1:enforce (check-aggregate-license) @ hbase-archetype-builder ---
[INFO] Skipping Rule Enforcement.
[INFO]
[INFO] --- xml-maven-plugin:1.0.1:transform (modify-exemplar-pom-files-via-xslt) @ hbase-archetype-builder ---
Warning: org.apache.xerces.parsers.SAXParser: Feature 'http://javax.xml.XMLConstants/feature/secure-processing' is not recognized.
Warning: org.apache.xerces.parsers.SAXParser: Property 'http://javax.xml.XMLConstants/property/accessExternalDTD' is not recognized.
Warning: org.apache.xerces.parsers.SAXParser: Property 'http://www.oracle.com/xml/jaxp/properties/entityExpansionLimit' is not recognized.
[INFO] Transforming file: <https://builds.apache.org/job/HBase-Trunk_matrix/jdk=JDK%201.8%20(latest),label=(Hadoop%20&&%20!H5)/4608/artifact/hbase-archetypes/hbase-archetype-builder/../hbase-client-project/target/temp/pom.xml>
[INFO] Transformed 1 file(s).
[INFO] Transforming file: <https://builds.apache.org/job/HBase-Trunk_matrix/jdk=JDK%201.8%20(latest),label=(Hadoop%20&&%20!H5)/4608/artifact/hbase-archetypes/hbase-archetype-builder/../hbase-shaded-client-project/target/temp/pom.xml>
[INFO] Transformed 1 file(s).
[INFO]
[INFO] --- maven-antrun-plugin:1.8:run (make-scripts-executable) @ hbase-archetype-builder ---
[INFO] No Ant target defined - SKIPPED
[INFO]
[INFO] --- maven-antrun-plugin:1.8:run (run-createArchetypes-script) @ hbase-archetype-builder ---
[INFO] No Ant target defined - SKIPPED
[INFO]
[INFO] --- maven-resources-plugin:2.7:copy-resources (hbase-client-ARCHETYPE__copy-pom-to-temp-for-xslt-processing) @ hbase-archetype-builder ---
[INFO] Using 'UTF-8' encoding to copy filtered resources.
[INFO] skip non existing resourceDirectory <https://builds.apache.org/job/HBase-Trunk_matrix/jdk=JDK%201.8%20(latest),label=(Hadoop%20&&%20!H5)/ws/hbase-archetypes/hbase-archetype-builder/../hbase-client-project/target/build-archetype/target/generated-sources/archetype>
[INFO]
[INFO] --- maven-resources-plugin:2.7:copy-resources (hbase-shaded-client-ARCHETYPE__copy-pom-to-temp-for-xslt-processing) @ hbase-archetype-builder ---
[INFO] Using 'UTF-8' encoding to copy filtered resources.
[INFO] skip non existing resourceDirectory <https://builds.apache.org/job/HBase-Trunk_matrix/jdk=JDK%201.8%20(latest),label=(Hadoop%20&&%20!H5)/ws/hbase-archetypes/hbase-archetype-builder/../hbase-shaded-client-project/target/build-archetype/target/generated-sources/archetype>
[INFO]
[INFO] --- xml-maven-plugin:1.0.1:transform (modify-archetype-pom-files-via-xslt) @ hbase-archetype-builder ---
[WARNING] The directory <https://builds.apache.org/job/HBase-Trunk_matrix/jdk=JDK%201.8%20(latest),label=(Hadoop%20&&%20!H5)/ws/hbase-archetypes/hbase-archetype-builder/../hbase-client-project/target/temp-arch,> which is a base directory of a ValidationSet or TransformationSet, does not exist.
[WARNING] No files found for transformation by stylesheet modify_archetype_pom.xsl
[WARNING] The directory <https://builds.apache.org/job/HBase-Trunk_matrix/jdk=JDK%201.8%20(latest),label=(Hadoop%20&&%20!H5)/ws/hbase-archetypes/hbase-archetype-builder/../hbase-shaded-client-project/target/temp-arch,> which is a base directory of a ValidationSet or TransformationSet, does not exist.
[WARNING] No files found for transformation by stylesheet modify_archetype_pom.xsl
[INFO]
[INFO] --- maven-install-plugin:2.5.2:install (default-install) @ hbase-archetype-builder ---
[INFO] Installing <https://builds.apache.org/job/HBase-Trunk_matrix/jdk=JDK%201.8%20(latest),label=(Hadoop%20&&%20!H5)/4608/artifact/hbase-archetypes/hbase-archetype-builder/pom.xml> to /home/jenkins/.m2/repository/org/apache/hbase/hbase-archetype-builder/3.0.0-SNAPSHOT/hbase-archetype-builder-3.0.0-SNAPSHOT.pom
[INFO]
[INFO] --- maven-antrun-plugin:1.8:run (run-installArchetypes-script) @ hbase-archetype-builder ---
[INFO] No Ant target defined - SKIPPED
[INFO] ------------------------------------------------------------------------
[INFO] Reactor Summary:
[INFO]
[INFO] Apache HBase ...................................... SUCCESS [1.896s]
[INFO] Apache HBase - Checkstyle ......................... SUCCESS [0.471s]
[INFO] Apache HBase - Build Support ...................... SUCCESS [0.049s]
[INFO] Apache HBase - Error Prone Rules .................. SUCCESS [0.200s]
[INFO] Apache HBase - Annotations ........................ SUCCESS [0.447s]
[INFO] Apache HBase - Build Configuration ................ SUCCESS [0.068s]
[INFO] Apache HBase - Shaded Protocol .................... SUCCESS [23.306s]
[INFO] Apache HBase - Common ............................. SUCCESS [2:19.819s]
[INFO] Apache HBase - Metrics API ........................ SUCCESS [2.415s]
[INFO] Apache HBase - Hadoop Compatibility ............... SUCCESS [14.221s]
[INFO] Apache HBase - Metrics Implementation ............. SUCCESS [10.305s]
[INFO] Apache HBase - Hadoop Two Compatibility ........... SUCCESS [17.844s]
[INFO] Apache HBase - Protocol ........................... SUCCESS [6.696s]
[INFO] Apache HBase - Client ............................. SUCCESS [2:53.708s]
[INFO] Apache HBase - Zookeeper .......................... SUCCESS [29.540s]
[INFO] Apache HBase - Replication ........................ SUCCESS [8.067s]
[INFO] Apache HBase - Resource Bundle .................... SUCCESS [0.163s]
[INFO] Apache HBase - HTTP ............................... SUCCESS [34.834s]
[INFO] Apache HBase - Procedure .......................... SUCCESS [2:33.122s]
[INFO] Apache HBase - Server ............................. FAILURE [2:29:23.449s]
[INFO] Apache HBase - MapReduce .......................... SKIPPED
[INFO] Apache HBase - Testing Util ....................... SKIPPED
[INFO] Apache HBase - Thrift ............................. SKIPPED
[INFO] Apache HBase - RSGroup ............................ SKIPPED
[INFO] Apache HBase - Shell .............................. SKIPPED
[INFO] Apache HBase - Coprocessor Endpoint ............... SKIPPED
[INFO] Apache HBase - Backup ............................. SKIPPED
[INFO] Apache HBase - Integration Tests .................. SKIPPED
[INFO] Apache HBase - Examples ........................... SKIPPED
[INFO] Apache HBase - Rest ............................... SKIPPED
[INFO] Apache HBase - External Block Cache ............... SKIPPED
[INFO] Apache HBase - Spark .............................. SKIPPED
[INFO] Apache HBase - Spark Integration Tests ............ SKIPPED
[INFO] Apache HBase - Assembly ........................... SKIPPED
[INFO] Apache HBase - Shaded ............................. SUCCESS [0.265s]
[INFO] Apache HBase - Shaded - Client .................... SUCCESS [1.194s]
[INFO] Apache HBase - Shaded - MapReduce ................. SKIPPED
[INFO] Apache HBase Shaded Packaging Invariants .......... SKIPPED
[INFO] Apache HBase - Archetypes ......................... SUCCESS [0.056s]
[INFO] Apache HBase - Exemplar for hbase-client archetype SKIPPED
[INFO] Apache HBase - Exemplar for hbase-shaded-client archetype SKIPPED
[INFO] Apache HBase - Archetype builder .................. SUCCESS [0.417s]
[INFO] ------------------------------------------------------------------------
[INFO] BUILD FAILURE
[INFO] ------------------------------------------------------------------------
[INFO] Total time: 2:39:44.034s
[INFO] Finished at: Mon Feb 19 00:27:52 UTC 2018
[INFO] Final Memory: 106M/7101M
[INFO] ------------------------------------------------------------------------
[ERROR] Failed to execute goal org.apache.maven.plugins:maven-surefire-plugin:2.20.1:test (secondPartTestsExecution) on project hbase-server: There are test failures.
[ERROR]
[ERROR] Please refer to <https://builds.apache.org/job/HBase-Trunk_matrix/jdk=JDK%201.8%20(latest),label=(Hadoop%20&&%20!H5)/ws/hbase-server/target/surefire-reports> for the individual test results.
[ERROR] Please refer to dump files (if any exist) [date]-jvmRun[N].dump, [date].dumpstream and [date]-jvmRun[N].dumpstream.
[ERROR] -> [Help 1]
[ERROR]
[ERROR] To see the full stack trace of the errors, re-run Maven with the -e switch.
[ERROR] Re-run Maven using the -X switch to enable full debug logging.
[ERROR]
[ERROR] For more information about the errors and possible solutions, please read the following articles:
[ERROR] [Help 1] http://cwiki.apache.org/confluence/display/MAVEN/MojoFailureException
[ERROR]
[ERROR] After correcting the problems, you can resume the build with the command
[ERROR] mvn <goals> -rf :hbase-server
Build step 'Invoke top-level Maven targets' marked build as failure
Performing Post build task...
Match found for :.* : True
Logical operation result is TRUE
Running script : # Run zombie detector script
./dev-support/zombie-detector.sh --jenkins ${BUILD_ID}
[11c72c70] $ /bin/bash -xe /tmp/jenkins363132136008294641.sh
+ ./dev-support/zombie-detector.sh --jenkins 4608
Mon Feb 19 00:27:54 UTC 2018 We're ok: there is no zombie test
{color:green}+1 zombies{color}. No zombie tests found running at the end of the build.
POST BUILD TASK : SUCCESS
END OF POST BUILD TASK : 0
Archiving artifacts
Recording test results
[FINDBUGS] Skipping publisher since build result is FAILURE
[CHECKSTYLE] Skipping publisher since build result is FAILURE
Build failed in Jenkins: HBase-Trunk_matrix » JDK 1.8 (latest),(Hadoop && !H5) #4607
Posted by Apache Jenkins Server <je...@builds.apache.org>.
See <https://builds.apache.org/job/HBase-Trunk_matrix/jdk=JDK%201.8%20(latest),label=(Hadoop%20&&%20!H5)/4607/display/redirect>
------------------------------------------
[...truncated 1.38 MB...]
[INFO]
[INFO] --- maven-enforcer-plugin:3.0.0-M1:enforce (hadoop-profile-min-maven-min-java-banned-xerces) @ hbase-shaded-client ---
[INFO]
[INFO] --- maven-enforcer-plugin:3.0.0-M1:enforce (banned-jsr305) @ hbase-shaded-client ---
[INFO]
[INFO] --- maven-enforcer-plugin:3.0.0-M1:enforce (banned-scala) @ hbase-shaded-client ---
[INFO]
[INFO] --- maven-enforcer-plugin:3.0.0-M1:enforce (banned-hbase-spark) @ hbase-shaded-client ---
[INFO]
[INFO] --- buildnumber-maven-plugin:1.4:create-timestamp (default) @ hbase-shaded-client ---
[INFO]
[INFO] --- maven-remote-resources-plugin:1.5:process (process-resource-bundles) @ hbase-shaded-client ---
[INFO]
[INFO] --- maven-remote-resources-plugin:1.5:process (aggregate-licenses) @ hbase-shaded-client ---
[INFO]
[INFO] --- maven-resources-plugin:2.7:resources (default-resources) @ hbase-shaded-client ---
[INFO] Using 'UTF-8' encoding to copy filtered resources.
[INFO] skip non existing resourceDirectory <https://builds.apache.org/job/HBase-Trunk_matrix/jdk=JDK%201.8%20(latest),label=(Hadoop%20&&%20!H5)/ws/hbase-shaded/hbase-shaded-client/src/main/resources>
[INFO] Copying 3 resources
[INFO] Copying 3 resources
[INFO]
[INFO] --- maven-enforcer-plugin:3.0.0-M1:enforce (check-aggregate-license) @ hbase-shaded-client ---
[INFO]
[INFO] --- maven-compiler-plugin:3.6.1:compile (default-compile) @ hbase-shaded-client ---
[INFO] No sources to compile
[INFO]
[INFO] --- maven-resources-plugin:2.7:testResources (default-testResources) @ hbase-shaded-client ---
[INFO] Not copying test resources
[INFO]
[INFO] --- maven-compiler-plugin:3.6.1:testCompile (default-testCompile) @ hbase-shaded-client ---
[INFO] Not compiling test sources
[INFO]
[INFO] --- maven-surefire-plugin:2.20.1:test (default-test) @ hbase-shaded-client ---
[INFO] No tests to run.
[INFO]
[INFO] --- maven-surefire-plugin:2.20.1:test (secondPartTestsExecution) @ hbase-shaded-client ---
[INFO] No tests to run.
[INFO]
[INFO] --- maven-jar-plugin:3.0.0:test-jar (default) @ hbase-shaded-client ---
[INFO] Skipping packaging of the test-jar
[INFO]
[INFO] --- maven-jar-plugin:3.0.0:jar (default-jar) @ hbase-shaded-client ---
[INFO] Building jar: <https://builds.apache.org/job/HBase-Trunk_matrix/jdk=JDK%201.8%20(latest),label=(Hadoop%20&&%20!H5)/ws/hbase-shaded/hbase-shaded-client/target/hbase-shaded-client-3.0.0-SNAPSHOT.jar>
[INFO]
[INFO] --- maven-install-plugin:2.5.2:install (default-install) @ hbase-shaded-client ---
[INFO] Installing <https://builds.apache.org/job/HBase-Trunk_matrix/jdk=JDK%201.8%20(latest),label=(Hadoop%20&&%20!H5)/ws/hbase-shaded/hbase-shaded-client/target/hbase-shaded-client-3.0.0-SNAPSHOT.jar> to /home/jenkins/.m2/repository/org/apache/hbase/hbase-shaded-client/3.0.0-SNAPSHOT/hbase-shaded-client-3.0.0-SNAPSHOT.jar
[INFO] Installing <https://builds.apache.org/job/HBase-Trunk_matrix/jdk=JDK%201.8%20(latest),label=(Hadoop%20&&%20!H5)/4607/artifact/hbase-shaded/hbase-shaded-client/pom.xml> to /home/jenkins/.m2/repository/org/apache/hbase/hbase-shaded-client/3.0.0-SNAPSHOT/hbase-shaded-client-3.0.0-SNAPSHOT.pom
[INFO]
[INFO] ------------------------------------------------------------------------
[INFO] Skipping Apache HBase - Shaded - MapReduce
[INFO] This project has been banned from the build due to previous failures.
[INFO] ------------------------------------------------------------------------
[INFO]
[INFO] ------------------------------------------------------------------------
[INFO] Skipping Apache HBase Shaded Packaging Invariants
[INFO] This project has been banned from the build due to previous failures.
[INFO] ------------------------------------------------------------------------
[INFO]
[INFO] ------------------------------------------------------------------------
[INFO] Building Apache HBase - Archetypes 3.0.0-SNAPSHOT
[INFO] ------------------------------------------------------------------------
[INFO]
[INFO] --- build-helper-maven-plugin:3.0.0:bsh-property (negate-license-bundles-property) @ hbase-archetypes ---
[INFO]
[INFO] --- maven-enforcer-plugin:3.0.0-M1:enforce (hadoop-profile-min-maven-min-java-banned-xerces) @ hbase-archetypes ---
[INFO]
[INFO] --- maven-enforcer-plugin:3.0.0-M1:enforce (banned-jsr305) @ hbase-archetypes ---
[INFO]
[INFO] --- maven-enforcer-plugin:3.0.0-M1:enforce (banned-scala) @ hbase-archetypes ---
[INFO]
[INFO] --- maven-enforcer-plugin:3.0.0-M1:enforce (banned-hbase-spark) @ hbase-archetypes ---
[INFO]
[INFO] --- buildnumber-maven-plugin:1.4:create-timestamp (default) @ hbase-archetypes ---
[INFO]
[INFO] --- maven-remote-resources-plugin:1.5:process (process-resource-bundles) @ hbase-archetypes ---
[INFO]
[INFO] --- maven-enforcer-plugin:3.0.0-M1:enforce (check-aggregate-license) @ hbase-archetypes ---
[INFO] Skipping Rule Enforcement.
[INFO]
[INFO] --- findbugs-maven-plugin:3.0.0:findbugs (default) @ hbase-archetypes ---
[INFO]
[INFO] --- maven-install-plugin:2.5.2:install (default-install) @ hbase-archetypes ---
[INFO] Installing <https://builds.apache.org/job/HBase-Trunk_matrix/jdk=JDK%201.8%20(latest),label=(Hadoop%20&&%20!H5)/4607/artifact/hbase-archetypes/pom.xml> to /home/jenkins/.m2/repository/org/apache/hbase/hbase-archetypes/3.0.0-SNAPSHOT/hbase-archetypes-3.0.0-SNAPSHOT.pom
[INFO]
[INFO] ------------------------------------------------------------------------
[INFO] Skipping Apache HBase - Exemplar for hbase-client archetype
[INFO] This project has been banned from the build due to previous failures.
[INFO] ------------------------------------------------------------------------
[INFO]
[INFO] ------------------------------------------------------------------------
[INFO] Skipping Apache HBase - Exemplar for hbase-shaded-client archetype
[INFO] This project has been banned from the build due to previous failures.
[INFO] ------------------------------------------------------------------------
[INFO]
[INFO] ------------------------------------------------------------------------
[INFO] Building Apache HBase - Archetype builder 3.0.0-SNAPSHOT
[INFO] ------------------------------------------------------------------------
[INFO]
[INFO] --- build-helper-maven-plugin:3.0.0:bsh-property (negate-license-bundles-property) @ hbase-archetype-builder ---
[INFO]
[INFO] --- maven-enforcer-plugin:3.0.0-M1:enforce (hadoop-profile-min-maven-min-java-banned-xerces) @ hbase-archetype-builder ---
[INFO]
[INFO] --- maven-enforcer-plugin:3.0.0-M1:enforce (banned-jsr305) @ hbase-archetype-builder ---
[INFO]
[INFO] --- maven-enforcer-plugin:3.0.0-M1:enforce (banned-scala) @ hbase-archetype-builder ---
[INFO]
[INFO] --- maven-enforcer-plugin:3.0.0-M1:enforce (banned-hbase-spark) @ hbase-archetype-builder ---
[INFO]
[INFO] --- buildnumber-maven-plugin:1.4:create-timestamp (default) @ hbase-archetype-builder ---
[INFO]
[INFO] --- maven-remote-resources-plugin:1.5:process (process-resource-bundles) @ hbase-archetype-builder ---
[INFO]
[INFO] --- maven-resources-plugin:2.7:copy-resources (hbase-client__copy-src-to-build-archetype-subdir) @ hbase-archetype-builder ---
[INFO] Using 'UTF-8' encoding to copy filtered resources.
[INFO] Copying 4 resources
[INFO]
[INFO] --- maven-resources-plugin:2.7:copy-resources (hbase-client__copy-pom-to-temp-for-xslt-processing) @ hbase-archetype-builder ---
[INFO] Using 'UTF-8' encoding to copy filtered resources.
[INFO] Copying 1 resource
[INFO]
[INFO] --- maven-resources-plugin:2.7:copy-resources (hbase-shaded-client__copy-src-to-build-archetype-subdir) @ hbase-archetype-builder ---
[INFO] Using 'UTF-8' encoding to copy filtered resources.
[INFO] Copying 4 resources
[INFO]
[INFO] --- maven-resources-plugin:2.7:copy-resources (hbase-shaded-client__copy-pom-to-temp-for-xslt-processing) @ hbase-archetype-builder ---
[INFO] Using 'UTF-8' encoding to copy filtered resources.
[INFO] Copying 1 resource
[INFO]
[INFO] --- maven-enforcer-plugin:3.0.0-M1:enforce (check-aggregate-license) @ hbase-archetype-builder ---
[INFO] Skipping Rule Enforcement.
[INFO]
[INFO] --- xml-maven-plugin:1.0.1:transform (modify-exemplar-pom-files-via-xslt) @ hbase-archetype-builder ---
Warning: org.apache.xerces.parsers.SAXParser: Feature 'http://javax.xml.XMLConstants/feature/secure-processing' is not recognized.
Warning: org.apache.xerces.parsers.SAXParser: Property 'http://javax.xml.XMLConstants/property/accessExternalDTD' is not recognized.
Warning: org.apache.xerces.parsers.SAXParser: Property 'http://www.oracle.com/xml/jaxp/properties/entityExpansionLimit' is not recognized.
[INFO] Transforming file: <https://builds.apache.org/job/HBase-Trunk_matrix/jdk=JDK%201.8%20(latest),label=(Hadoop%20&&%20!H5)/4607/artifact/hbase-archetypes/hbase-archetype-builder/../hbase-client-project/target/temp/pom.xml>
[INFO] Transformed 1 file(s).
[INFO] Transforming file: <https://builds.apache.org/job/HBase-Trunk_matrix/jdk=JDK%201.8%20(latest),label=(Hadoop%20&&%20!H5)/4607/artifact/hbase-archetypes/hbase-archetype-builder/../hbase-shaded-client-project/target/temp/pom.xml>
[INFO] Transformed 1 file(s).
[INFO]
[INFO] --- maven-antrun-plugin:1.8:run (make-scripts-executable) @ hbase-archetype-builder ---
[INFO] No Ant target defined - SKIPPED
[INFO]
[INFO] --- maven-antrun-plugin:1.8:run (run-createArchetypes-script) @ hbase-archetype-builder ---
[INFO] No Ant target defined - SKIPPED
[INFO]
[INFO] --- maven-resources-plugin:2.7:copy-resources (hbase-client-ARCHETYPE__copy-pom-to-temp-for-xslt-processing) @ hbase-archetype-builder ---
[INFO] Using 'UTF-8' encoding to copy filtered resources.
[INFO] skip non existing resourceDirectory <https://builds.apache.org/job/HBase-Trunk_matrix/jdk=JDK%201.8%20(latest),label=(Hadoop%20&&%20!H5)/ws/hbase-archetypes/hbase-archetype-builder/../hbase-client-project/target/build-archetype/target/generated-sources/archetype>
[INFO]
[INFO] --- maven-resources-plugin:2.7:copy-resources (hbase-shaded-client-ARCHETYPE__copy-pom-to-temp-for-xslt-processing) @ hbase-archetype-builder ---
[INFO] Using 'UTF-8' encoding to copy filtered resources.
[INFO] skip non existing resourceDirectory <https://builds.apache.org/job/HBase-Trunk_matrix/jdk=JDK%201.8%20(latest),label=(Hadoop%20&&%20!H5)/ws/hbase-archetypes/hbase-archetype-builder/../hbase-shaded-client-project/target/build-archetype/target/generated-sources/archetype>
[INFO]
[INFO] --- xml-maven-plugin:1.0.1:transform (modify-archetype-pom-files-via-xslt) @ hbase-archetype-builder ---
[WARNING] The directory <https://builds.apache.org/job/HBase-Trunk_matrix/jdk=JDK%201.8%20(latest),label=(Hadoop%20&&%20!H5)/ws/hbase-archetypes/hbase-archetype-builder/../hbase-client-project/target/temp-arch,> which is a base directory of a ValidationSet or TransformationSet, does not exist.
[WARNING] No files found for transformation by stylesheet modify_archetype_pom.xsl
[WARNING] The directory <https://builds.apache.org/job/HBase-Trunk_matrix/jdk=JDK%201.8%20(latest),label=(Hadoop%20&&%20!H5)/ws/hbase-archetypes/hbase-archetype-builder/../hbase-shaded-client-project/target/temp-arch,> which is a base directory of a ValidationSet or TransformationSet, does not exist.
[WARNING] No files found for transformation by stylesheet modify_archetype_pom.xsl
[INFO]
[INFO] --- maven-install-plugin:2.5.2:install (default-install) @ hbase-archetype-builder ---
[INFO] Installing <https://builds.apache.org/job/HBase-Trunk_matrix/jdk=JDK%201.8%20(latest),label=(Hadoop%20&&%20!H5)/4607/artifact/hbase-archetypes/hbase-archetype-builder/pom.xml> to /home/jenkins/.m2/repository/org/apache/hbase/hbase-archetype-builder/3.0.0-SNAPSHOT/hbase-archetype-builder-3.0.0-SNAPSHOT.pom
[INFO]
[INFO] --- maven-antrun-plugin:1.8:run (run-installArchetypes-script) @ hbase-archetype-builder ---
[INFO] No Ant target defined - SKIPPED
[INFO] ------------------------------------------------------------------------
[INFO] Reactor Summary:
[INFO]
[INFO] Apache HBase ...................................... SUCCESS [2.070s]
[INFO] Apache HBase - Checkstyle ......................... SUCCESS [0.499s]
[INFO] Apache HBase - Build Support ...................... SUCCESS [0.053s]
[INFO] Apache HBase - Error Prone Rules .................. SUCCESS [0.182s]
[INFO] Apache HBase - Annotations ........................ SUCCESS [0.438s]
[INFO] Apache HBase - Build Configuration ................ SUCCESS [0.097s]
[INFO] Apache HBase - Shaded Protocol .................... SUCCESS [23.406s]
[INFO] Apache HBase - Common ............................. SUCCESS [2:11.256s]
[INFO] Apache HBase - Metrics API ........................ SUCCESS [2.135s]
[INFO] Apache HBase - Hadoop Compatibility ............... SUCCESS [13.808s]
[INFO] Apache HBase - Metrics Implementation ............. SUCCESS [9.216s]
[INFO] Apache HBase - Hadoop Two Compatibility ........... SUCCESS [15.970s]
[INFO] Apache HBase - Protocol ........................... SUCCESS [6.418s]
[INFO] Apache HBase - Client ............................. SUCCESS [2:39.825s]
[INFO] Apache HBase - Zookeeper .......................... SUCCESS [27.863s]
[INFO] Apache HBase - Replication ........................ SUCCESS [7.561s]
[INFO] Apache HBase - Resource Bundle .................... SUCCESS [0.161s]
[INFO] Apache HBase - HTTP ............................... SUCCESS [32.048s]
[INFO] Apache HBase - Procedure .......................... SUCCESS [2:18.239s]
[INFO] Apache HBase - Server ............................. FAILURE [2:26:42.581s]
[INFO] Apache HBase - MapReduce .......................... SKIPPED
[INFO] Apache HBase - Testing Util ....................... SKIPPED
[INFO] Apache HBase - Thrift ............................. SKIPPED
[INFO] Apache HBase - RSGroup ............................ SKIPPED
[INFO] Apache HBase - Shell .............................. SKIPPED
[INFO] Apache HBase - Coprocessor Endpoint ............... SKIPPED
[INFO] Apache HBase - Backup ............................. SKIPPED
[INFO] Apache HBase - Integration Tests .................. SKIPPED
[INFO] Apache HBase - Examples ........................... SKIPPED
[INFO] Apache HBase - Rest ............................... SKIPPED
[INFO] Apache HBase - External Block Cache ............... SKIPPED
[INFO] Apache HBase - Spark .............................. SKIPPED
[INFO] Apache HBase - Spark Integration Tests ............ SKIPPED
[INFO] Apache HBase - Assembly ........................... SKIPPED
[INFO] Apache HBase - Shaded ............................. SUCCESS [0.237s]
[INFO] Apache HBase - Shaded - Client .................... SUCCESS [1.086s]
[INFO] Apache HBase - Shaded - MapReduce ................. SKIPPED
[INFO] Apache HBase Shaded Packaging Invariants .......... SKIPPED
[INFO] Apache HBase - Archetypes ......................... SUCCESS [0.054s]
[INFO] Apache HBase - Exemplar for hbase-client archetype SKIPPED
[INFO] Apache HBase - Exemplar for hbase-shaded-client archetype SKIPPED
[INFO] Apache HBase - Archetype builder .................. SUCCESS [0.339s]
[INFO] ------------------------------------------------------------------------
[INFO] BUILD FAILURE
[INFO] ------------------------------------------------------------------------
[INFO] Total time: 2:36:17.036s
[INFO] Finished at: Sun Feb 18 21:24:08 UTC 2018
[INFO] Final Memory: 99M/7172M
[INFO] ------------------------------------------------------------------------
[ERROR] Failed to execute goal org.apache.maven.plugins:maven-surefire-plugin:2.20.1:test (secondPartTestsExecution) on project hbase-server: There are test failures.
[ERROR]
[ERROR] Please refer to <https://builds.apache.org/job/HBase-Trunk_matrix/jdk=JDK%201.8%20(latest),label=(Hadoop%20&&%20!H5)/ws/hbase-server/target/surefire-reports> for the individual test results.
[ERROR] Please refer to dump files (if any exist) [date]-jvmRun[N].dump, [date].dumpstream and [date]-jvmRun[N].dumpstream.
[ERROR] -> [Help 1]
[ERROR]
[ERROR] To see the full stack trace of the errors, re-run Maven with the -e switch.
[ERROR] Re-run Maven using the -X switch to enable full debug logging.
[ERROR]
[ERROR] For more information about the errors and possible solutions, please read the following articles:
[ERROR] [Help 1] http://cwiki.apache.org/confluence/display/MAVEN/MojoFailureException
[ERROR]
[ERROR] After correcting the problems, you can resume the build with the command
[ERROR] mvn <goals> -rf :hbase-server
Build step 'Invoke top-level Maven targets' marked build as failure
Performing Post build task...
Match found for :.* : True
Logical operation result is TRUE
Running script : # Run zombie detector script
./dev-support/zombie-detector.sh --jenkins ${BUILD_ID}
[11c72c70] $ /bin/bash -xe /tmp/jenkins3951466642818994273.sh
+ ./dev-support/zombie-detector.sh --jenkins 4607
Sun Feb 18 21:24:10 UTC 2018 We're ok: there is no zombie test
{color:green}+1 zombies{color}. No zombie tests found running at the end of the build.
POST BUILD TASK : SUCCESS
END OF POST BUILD TASK : 0
Archiving artifacts
Recording test results
[FINDBUGS] Skipping publisher since build result is FAILURE
[CHECKSTYLE] Skipping publisher since build result is FAILURE
Build failed in Jenkins: HBase-Trunk_matrix » JDK 1.8 (latest),(Hadoop && !H5) #4606
Posted by Apache Jenkins Server <je...@builds.apache.org>.
See <https://builds.apache.org/job/HBase-Trunk_matrix/jdk=JDK%201.8%20(latest),label=(Hadoop%20&&%20!H5)/4606/display/redirect>
------------------------------------------
[...truncated 1.61 MB...]
[INFO] --- maven-resources-plugin:2.7:copy-resources (hbase-shaded-client-ARCHETYPE__copy-pom-to-temp-for-xslt-processing) @ hbase-archetype-builder ---
[INFO] Using 'UTF-8' encoding to copy filtered resources.
[INFO] skip non existing resourceDirectory <https://builds.apache.org/job/HBase-Trunk_matrix/jdk=JDK%201.8%20(latest),label=(Hadoop%20&&%20!H5)/ws/hbase-archetypes/hbase-archetype-builder/../hbase-shaded-client-project/target/build-archetype/target/generated-sources/archetype>
[INFO]
[INFO] --- xml-maven-plugin:1.0.1:transform (modify-archetype-pom-files-via-xslt) @ hbase-archetype-builder ---
[WARNING] The directory <https://builds.apache.org/job/HBase-Trunk_matrix/jdk=JDK%201.8%20(latest),label=(Hadoop%20&&%20!H5)/ws/hbase-archetypes/hbase-archetype-builder/../hbase-client-project/target/temp-arch,> which is a base directory of a ValidationSet or TransformationSet, does not exist.
[WARNING] No files found for transformation by stylesheet modify_archetype_pom.xsl
[WARNING] The directory <https://builds.apache.org/job/HBase-Trunk_matrix/jdk=JDK%201.8%20(latest),label=(Hadoop%20&&%20!H5)/ws/hbase-archetypes/hbase-archetype-builder/../hbase-shaded-client-project/target/temp-arch,> which is a base directory of a ValidationSet or TransformationSet, does not exist.
[WARNING] No files found for transformation by stylesheet modify_archetype_pom.xsl
[INFO]
[INFO] --- maven-install-plugin:2.5.2:install (default-install) @ hbase-archetype-builder ---
[INFO] Installing <https://builds.apache.org/job/HBase-Trunk_matrix/jdk=JDK%201.8%20(latest),label=(Hadoop%20&&%20!H5)/4606/artifact/hbase-archetypes/hbase-archetype-builder/pom.xml> to /home/jenkins/.m2/repository/org/apache/hbase/hbase-archetype-builder/3.0.0-SNAPSHOT/hbase-archetype-builder-3.0.0-SNAPSHOT.pom
[INFO]
[INFO] --- maven-antrun-plugin:1.8:run (run-installArchetypes-script) @ hbase-archetype-builder ---
[INFO] No Ant target defined - SKIPPED
[INFO] ------------------------------------------------------------------------
[INFO] Reactor Summary:
[INFO]
[INFO] Apache HBase ...................................... SUCCESS [2.118s]
[INFO] Apache HBase - Checkstyle ......................... SUCCESS [0.516s]
[INFO] Apache HBase - Build Support ...................... SUCCESS [0.057s]
[INFO] Apache HBase - Error Prone Rules .................. SUCCESS [0.194s]
[INFO] Apache HBase - Annotations ........................ SUCCESS [0.449s]
[INFO] Apache HBase - Build Configuration ................ SUCCESS [0.068s]
[INFO] Apache HBase - Shaded Protocol .................... SUCCESS [23.697s]
[INFO] Apache HBase - Common ............................. SUCCESS [2:15.071s]
[INFO] Apache HBase - Metrics API ........................ SUCCESS [2.207s]
[INFO] Apache HBase - Hadoop Compatibility ............... SUCCESS [13.939s]
[INFO] Apache HBase - Metrics Implementation ............. SUCCESS [9.447s]
[INFO] Apache HBase - Hadoop Two Compatibility ........... SUCCESS [16.707s]
[INFO] Apache HBase - Protocol ........................... SUCCESS [6.790s]
[INFO] Apache HBase - Client ............................. SUCCESS [2:52.027s]
[INFO] Apache HBase - Zookeeper .......................... SUCCESS [28.900s]
[INFO] Apache HBase - Replication ........................ SUCCESS [7.115s]
[INFO] Apache HBase - Resource Bundle .................... SUCCESS [0.152s]
[INFO] Apache HBase - HTTP ............................... SUCCESS [33.777s]
[INFO] Apache HBase - Procedure .......................... SUCCESS [2:31.052s]
[INFO] Apache HBase - Server ............................. SUCCESS [2:58:34.846s]
[INFO] Apache HBase - MapReduce .......................... SUCCESS [14:16.010s]
[INFO] Apache HBase - Testing Util ....................... SUCCESS [2.645s]
[INFO] Apache HBase - Thrift ............................. SUCCESS [1:59.986s]
[INFO] Apache HBase - RSGroup ............................ SUCCESS [4:25.753s]
[INFO] Apache HBase - Shell .............................. SUCCESS [8:27.425s]
[INFO] Apache HBase - Coprocessor Endpoint ............... SUCCESS [4:06.092s]
[INFO] Apache HBase - Backup ............................. SUCCESS [16:02.171s]
[INFO] Apache HBase - Integration Tests .................. SUCCESS [29.827s]
[INFO] Apache HBase - Examples ........................... SUCCESS [1:28.311s]
[INFO] Apache HBase - Rest ............................... SUCCESS [3:53.597s]
[INFO] Apache HBase - External Block Cache ............... SUCCESS [1.839s]
[INFO] Apache HBase - Spark .............................. SUCCESS [4:01.901s]
[INFO] Apache HBase - Spark Integration Tests ............ SUCCESS [2.805s]
[INFO] Apache HBase - Assembly ........................... SUCCESS [4.376s]
[INFO] Apache HBase - Shaded ............................. SUCCESS [0.146s]
[INFO] Apache HBase - Shaded - Client .................... SUCCESS [1.109s]
[INFO] Apache HBase - Shaded - MapReduce ................. SUCCESS [1.575s]
[INFO] Apache HBase Shaded Packaging Invariants .......... SUCCESS [1.861s]
[INFO] Apache HBase - Archetypes ......................... SUCCESS [0.079s]
[INFO] Apache HBase - Exemplar for hbase-client archetype SUCCESS [40.876s]
[INFO] Apache HBase - Exemplar for hbase-shaded-client archetype SUCCESS [41.074s]
[INFO] Apache HBase - Archetype builder .................. SUCCESS [0.465s]
[INFO] ------------------------------------------------------------------------
[INFO] BUILD SUCCESS
[INFO] ------------------------------------------------------------------------
[INFO] Total time: 4:09:30.479s
[INFO] Finished at: Sun Feb 18 18:13:09 UTC 2018
[INFO] Final Memory: 244M/7561M
[INFO] ------------------------------------------------------------------------
Performing Post build task...
Match found for :.* : True
Logical operation result is TRUE
Running script : # Run zombie detector script
./dev-support/zombie-detector.sh --jenkins ${BUILD_ID}
[11c72c70] $ /bin/bash -xe /tmp/jenkins6368099438867114231.sh
+ ./dev-support/zombie-detector.sh --jenkins 4606
Sun Feb 18 18:13:11 UTC 2018 We're ok: there is no zombie test
{color:green}+1 zombies{color}. No zombie tests found running at the end of the build.
POST BUILD TASK : SUCCESS
END OF POST BUILD TASK : 0
Archiving artifacts
Recording test results
[FINDBUGS] Collecting findbugs analysis files...
[FINDBUGS] Searching for all files in <https://builds.apache.org/job/HBase-Trunk_matrix/jdk=JDK%201.8%20(latest),label=(Hadoop%20&&%20!H5)/ws/> that match the pattern **/findbugs.xml,**/findbugsXml.xml
[FINDBUGS] Parsing 50 files in <https://builds.apache.org/job/HBase-Trunk_matrix/jdk=JDK%201.8%20(latest),label=(Hadoop%20&&%20!H5)/ws/>
[FINDBUGS] Successfully parsed file <https://builds.apache.org/job/HBase-Trunk_matrix/jdk=JDK%201.8%20(latest),label=(Hadoop%20&&%20!H5)/4606/artifact/hbase-archetypes/hbase-client-project/target/findbugs.xml> with 0 unique warnings and 0 duplicates.
[FINDBUGS] Successfully parsed file <https://builds.apache.org/job/HBase-Trunk_matrix/jdk=JDK%201.8%20(latest),label=(Hadoop%20&&%20!H5)/4606/artifact/hbase-archetypes/hbase-client-project/target/findbugsXml.xml> with 0 unique warnings and 0 duplicates.
[FINDBUGS] Successfully parsed file <https://builds.apache.org/job/HBase-Trunk_matrix/jdk=JDK%201.8%20(latest),label=(Hadoop%20&&%20!H5)/4606/artifact/hbase-archetypes/hbase-shaded-client-project/target/findbugs.xml> with 0 unique warnings and 0 duplicates.
[FINDBUGS] Successfully parsed file <https://builds.apache.org/job/HBase-Trunk_matrix/jdk=JDK%201.8%20(latest),label=(Hadoop%20&&%20!H5)/4606/artifact/hbase-archetypes/hbase-shaded-client-project/target/findbugsXml.xml> with 0 unique warnings and 0 duplicates.
[FINDBUGS] Successfully parsed file <https://builds.apache.org/job/HBase-Trunk_matrix/jdk=JDK%201.8%20(latest),label=(Hadoop%20&&%20!H5)/4606/artifact/hbase-backup/target/findbugs.xml> with 0 unique warnings and 0 duplicates.
[FINDBUGS] Successfully parsed file <https://builds.apache.org/job/HBase-Trunk_matrix/jdk=JDK%201.8%20(latest),label=(Hadoop%20&&%20!H5)/4606/artifact/hbase-backup/target/findbugsXml.xml> with 1 unique warning and 0 duplicates.
[FINDBUGS] Successfully parsed file <https://builds.apache.org/job/HBase-Trunk_matrix/jdk=JDK%201.8%20(latest),label=(Hadoop%20&&%20!H5)/4606/artifact/hbase-build-support/hbase-error-prone/target/findbugs.xml> with 1 unique warning and 0 duplicates.
[FINDBUGS] Successfully parsed file <https://builds.apache.org/job/HBase-Trunk_matrix/jdk=JDK%201.8%20(latest),label=(Hadoop%20&&%20!H5)/4606/artifact/hbase-build-support/hbase-error-prone/target/findbugsXml.xml> with 1 unique warning and 0 duplicates.
[FINDBUGS] Successfully parsed file <https://builds.apache.org/job/HBase-Trunk_matrix/jdk=JDK%201.8%20(latest),label=(Hadoop%20&&%20!H5)/4606/artifact/hbase-client/target/findbugs.xml> with 1 unique warning and 0 duplicates.
[FINDBUGS] Successfully parsed file <https://builds.apache.org/job/HBase-Trunk_matrix/jdk=JDK%201.8%20(latest),label=(Hadoop%20&&%20!H5)/4606/artifact/hbase-client/target/findbugsXml.xml> with 1 unique warning and 0 duplicates.
[FINDBUGS] Successfully parsed file <https://builds.apache.org/job/HBase-Trunk_matrix/jdk=JDK%201.8%20(latest),label=(Hadoop%20&&%20!H5)/4606/artifact/hbase-common/target/findbugs.xml> with 1 unique warning and 0 duplicates.
[FINDBUGS] Successfully parsed file <https://builds.apache.org/job/HBase-Trunk_matrix/jdk=JDK%201.8%20(latest),label=(Hadoop%20&&%20!H5)/4606/artifact/hbase-common/target/findbugsXml.xml> with 3 unique warnings and 0 duplicates.
[FINDBUGS] Successfully parsed file <https://builds.apache.org/job/HBase-Trunk_matrix/jdk=JDK%201.8%20(latest),label=(Hadoop%20&&%20!H5)/4606/artifact/hbase-endpoint/target/findbugs.xml> with 3 unique warnings and 0 duplicates.
[FINDBUGS] Successfully parsed file <https://builds.apache.org/job/HBase-Trunk_matrix/jdk=JDK%201.8%20(latest),label=(Hadoop%20&&%20!H5)/4606/artifact/hbase-endpoint/target/findbugsXml.xml> with 3 unique warnings and 0 duplicates.
[FINDBUGS] Successfully parsed file <https://builds.apache.org/job/HBase-Trunk_matrix/jdk=JDK%201.8%20(latest),label=(Hadoop%20&&%20!H5)/4606/artifact/hbase-examples/target/findbugs.xml> with 3 unique warnings and 0 duplicates.
[FINDBUGS] Successfully parsed file <https://builds.apache.org/job/HBase-Trunk_matrix/jdk=JDK%201.8%20(latest),label=(Hadoop%20&&%20!H5)/4606/artifact/hbase-examples/target/findbugsXml.xml> with 3 unique warnings and 0 duplicates.
[FINDBUGS] Successfully parsed file <https://builds.apache.org/job/HBase-Trunk_matrix/jdk=JDK%201.8%20(latest),label=(Hadoop%20&&%20!H5)/4606/artifact/hbase-external-blockcache/target/findbugs.xml> with 3 unique warnings and 0 duplicates.
[FINDBUGS] Successfully parsed file <https://builds.apache.org/job/HBase-Trunk_matrix/jdk=JDK%201.8%20(latest),label=(Hadoop%20&&%20!H5)/4606/artifact/hbase-external-blockcache/target/findbugsXml.xml> with 3 unique warnings and 0 duplicates.
[FINDBUGS] Successfully parsed file <https://builds.apache.org/job/HBase-Trunk_matrix/jdk=JDK%201.8%20(latest),label=(Hadoop%20&&%20!H5)/4606/artifact/hbase-hadoop-compat/target/findbugs.xml> with 3 unique warnings and 0 duplicates.
[FINDBUGS] Successfully parsed file <https://builds.apache.org/job/HBase-Trunk_matrix/jdk=JDK%201.8%20(latest),label=(Hadoop%20&&%20!H5)/4606/artifact/hbase-hadoop-compat/target/findbugsXml.xml> with 3 unique warnings and 0 duplicates.
[FINDBUGS] Successfully parsed file <https://builds.apache.org/job/HBase-Trunk_matrix/jdk=JDK%201.8%20(latest),label=(Hadoop%20&&%20!H5)/4606/artifact/hbase-hadoop2-compat/target/findbugs.xml> with 3 unique warnings and 0 duplicates.
[FINDBUGS] Successfully parsed file <https://builds.apache.org/job/HBase-Trunk_matrix/jdk=JDK%201.8%20(latest),label=(Hadoop%20&&%20!H5)/4606/artifact/hbase-hadoop2-compat/target/findbugsXml.xml> with 3 unique warnings and 0 duplicates.
[FINDBUGS] Successfully parsed file <https://builds.apache.org/job/HBase-Trunk_matrix/jdk=JDK%201.8%20(latest),label=(Hadoop%20&&%20!H5)/4606/artifact/hbase-http/target/findbugs.xml> with 3 unique warnings and 0 duplicates.
[FINDBUGS] Successfully parsed file <https://builds.apache.org/job/HBase-Trunk_matrix/jdk=JDK%201.8%20(latest),label=(Hadoop%20&&%20!H5)/4606/artifact/hbase-http/target/findbugsXml.xml> with 3 unique warnings and 0 duplicates.
[FINDBUGS] Successfully parsed file <https://builds.apache.org/job/HBase-Trunk_matrix/jdk=JDK%201.8%20(latest),label=(Hadoop%20&&%20!H5)/4606/artifact/hbase-mapreduce/target/findbugs.xml> with 3 unique warnings and 0 duplicates.
[FINDBUGS] Successfully parsed file <https://builds.apache.org/job/HBase-Trunk_matrix/jdk=JDK%201.8%20(latest),label=(Hadoop%20&&%20!H5)/4606/artifact/hbase-mapreduce/target/findbugsXml.xml> with 4 unique warnings and 0 duplicates.
[FINDBUGS] Successfully parsed file <https://builds.apache.org/job/HBase-Trunk_matrix/jdk=JDK%201.8%20(latest),label=(Hadoop%20&&%20!H5)/4606/artifact/hbase-metrics-api/target/findbugs.xml> with 4 unique warnings and 0 duplicates.
[FINDBUGS] Successfully parsed file <https://builds.apache.org/job/HBase-Trunk_matrix/jdk=JDK%201.8%20(latest),label=(Hadoop%20&&%20!H5)/4606/artifact/hbase-metrics-api/target/findbugsXml.xml> with 4 unique warnings and 0 duplicates.
[FINDBUGS] Successfully parsed file <https://builds.apache.org/job/HBase-Trunk_matrix/jdk=JDK%201.8%20(latest),label=(Hadoop%20&&%20!H5)/4606/artifact/hbase-metrics/target/findbugs.xml> with 4 unique warnings and 0 duplicates.
[FINDBUGS] Successfully parsed file <https://builds.apache.org/job/HBase-Trunk_matrix/jdk=JDK%201.8%20(latest),label=(Hadoop%20&&%20!H5)/4606/artifact/hbase-metrics/target/findbugsXml.xml> with 4 unique warnings and 0 duplicates.
[FINDBUGS] Successfully parsed file <https://builds.apache.org/job/HBase-Trunk_matrix/jdk=JDK%201.8%20(latest),label=(Hadoop%20&&%20!H5)/4606/artifact/hbase-procedure/target/findbugs.xml> with 4 unique warnings and 0 duplicates.
[FINDBUGS] Successfully parsed file <https://builds.apache.org/job/HBase-Trunk_matrix/jdk=JDK%201.8%20(latest),label=(Hadoop%20&&%20!H5)/4606/artifact/hbase-procedure/target/findbugsXml.xml> with 5 unique warnings and 0 duplicates.
[FINDBUGS] Successfully parsed file <https://builds.apache.org/job/HBase-Trunk_matrix/jdk=JDK%201.8%20(latest),label=(Hadoop%20&&%20!H5)/4606/artifact/hbase-protocol-shaded/target/findbugs.xml> with 5 unique warnings and 0 duplicates.
[FINDBUGS] Successfully parsed file <https://builds.apache.org/job/HBase-Trunk_matrix/jdk=JDK%201.8%20(latest),label=(Hadoop%20&&%20!H5)/4606/artifact/hbase-protocol-shaded/target/findbugsXml.xml> with 5 unique warnings and 0 duplicates.
[FINDBUGS] Successfully parsed file <https://builds.apache.org/job/HBase-Trunk_matrix/jdk=JDK%201.8%20(latest),label=(Hadoop%20&&%20!H5)/4606/artifact/hbase-protocol/target/findbugs.xml> with 5 unique warnings and 0 duplicates.
[FINDBUGS] Successfully parsed file <https://builds.apache.org/job/HBase-Trunk_matrix/jdk=JDK%201.8%20(latest),label=(Hadoop%20&&%20!H5)/4606/artifact/hbase-protocol/target/findbugsXml.xml> with 5 unique warnings and 0 duplicates.
[FINDBUGS] Successfully parsed file <https://builds.apache.org/job/HBase-Trunk_matrix/jdk=JDK%201.8%20(latest),label=(Hadoop%20&&%20!H5)/4606/artifact/hbase-replication/target/findbugs.xml> with 5 unique warnings and 0 duplicates.
[FINDBUGS] Successfully parsed file <https://builds.apache.org/job/HBase-Trunk_matrix/jdk=JDK%201.8%20(latest),label=(Hadoop%20&&%20!H5)/4606/artifact/hbase-replication/target/findbugsXml.xml> with 5 unique warnings and 0 duplicates.
[FINDBUGS] Successfully parsed file <https://builds.apache.org/job/HBase-Trunk_matrix/jdk=JDK%201.8%20(latest),label=(Hadoop%20&&%20!H5)/4606/artifact/hbase-rest/target/findbugs.xml> with 5 unique warnings and 0 duplicates.
[FINDBUGS] Successfully parsed file <https://builds.apache.org/job/HBase-Trunk_matrix/jdk=JDK%201.8%20(latest),label=(Hadoop%20&&%20!H5)/4606/artifact/hbase-rest/target/findbugsXml.xml> with 5 unique warnings and 0 duplicates.
[FINDBUGS] Successfully parsed file <https://builds.apache.org/job/HBase-Trunk_matrix/jdk=JDK%201.8%20(latest),label=(Hadoop%20&&%20!H5)/4606/artifact/hbase-rsgroup/target/findbugs.xml> with 5 unique warnings and 0 duplicates.
[FINDBUGS] Successfully parsed file <https://builds.apache.org/job/HBase-Trunk_matrix/jdk=JDK%201.8%20(latest),label=(Hadoop%20&&%20!H5)/4606/artifact/hbase-rsgroup/target/findbugsXml.xml> with 5 unique warnings and 0 duplicates.
[FINDBUGS] Successfully parsed file <https://builds.apache.org/job/HBase-Trunk_matrix/jdk=JDK%201.8%20(latest),label=(Hadoop%20&&%20!H5)/4606/artifact/hbase-server/target/findbugs.xml> with 5 unique warnings and 0 duplicates.
[FINDBUGS] Successfully parsed file <https://builds.apache.org/job/HBase-Trunk_matrix/jdk=JDK%201.8%20(latest),label=(Hadoop%20&&%20!H5)/4606/artifact/hbase-server/target/findbugsXml.xml> with 30 unique warnings and 0 duplicates.
[FINDBUGS] Successfully parsed file <https://builds.apache.org/job/HBase-Trunk_matrix/jdk=JDK%201.8%20(latest),label=(Hadoop%20&&%20!H5)/4606/artifact/hbase-spark/target/findbugs.xml> with 30 unique warnings and 0 duplicates.
[FINDBUGS] Successfully parsed file <https://builds.apache.org/job/HBase-Trunk_matrix/jdk=JDK%201.8%20(latest),label=(Hadoop%20&&%20!H5)/4606/artifact/hbase-spark/target/findbugsXml.xml> with 30 unique warnings and 0 duplicates.
[FINDBUGS] Successfully parsed file <https://builds.apache.org/job/HBase-Trunk_matrix/jdk=JDK%201.8%20(latest),label=(Hadoop%20&&%20!H5)/4606/artifact/hbase-thrift/target/findbugs.xml> with 30 unique warnings and 0 duplicates.
[FINDBUGS] Successfully parsed file <https://builds.apache.org/job/HBase-Trunk_matrix/jdk=JDK%201.8%20(latest),label=(Hadoop%20&&%20!H5)/4606/artifact/hbase-thrift/target/findbugsXml.xml> with 30 unique warnings and 0 duplicates.
[FINDBUGS] Successfully parsed file <https://builds.apache.org/job/HBase-Trunk_matrix/jdk=JDK%201.8%20(latest),label=(Hadoop%20&&%20!H5)/4606/artifact/hbase-zookeeper/target/findbugs.xml> with 30 unique warnings and 0 duplicates.
[FINDBUGS] Successfully parsed file <https://builds.apache.org/job/HBase-Trunk_matrix/jdk=JDK%201.8%20(latest),label=(Hadoop%20&&%20!H5)/4606/artifact/hbase-zookeeper/target/findbugsXml.xml> with 33 unique warnings and 0 duplicates.
<Git Blamer> Using GitBlamer to create author and commit information for all warnings.
<Git Blamer> GIT_COMMIT=f3bb9b9613beaefbee0a53be1fb66b94fde1ce19, workspace=<https://builds.apache.org/job/HBase-Trunk_matrix/jdk=JDK%201.8%20(latest),label=(Hadoop%20&&%20!H5)/ws/>
> git rev-parse f3bb9b9613beaefbee0a53be1fb66b94fde1ce19^{commit} # timeout=10
[FINDBUGS] Computing warning deltas based on reference build #4436
[CHECKSTYLE] Collecting checkstyle analysis files...
[CHECKSTYLE] Searching for all files in <https://builds.apache.org/job/HBase-Trunk_matrix/jdk=JDK%201.8%20(latest),label=(Hadoop%20&&%20!H5)/ws/> that match the pattern **/checkstyle-result.xml
[CHECKSTYLE] Parsing 42 files in <https://builds.apache.org/job/HBase-Trunk_matrix/jdk=JDK%201.8%20(latest),label=(Hadoop%20&&%20!H5)/ws/>
[CHECKSTYLE] Successfully parsed file <https://builds.apache.org/job/HBase-Trunk_matrix/jdk=JDK%201.8%20(latest),label=(Hadoop%20&&%20!H5)/4606/artifact/hbase-annotations/target/checkstyle-result.xml> with 0 unique warnings and 0 duplicates.
[CHECKSTYLE] Successfully parsed file <https://builds.apache.org/job/HBase-Trunk_matrix/jdk=JDK%201.8%20(latest),label=(Hadoop%20&&%20!H5)/4606/artifact/hbase-archetypes/hbase-archetype-builder/target/checkstyle-result.xml> with 0 unique warnings and 0 duplicates.
[CHECKSTYLE] Successfully parsed file <https://builds.apache.org/job/HBase-Trunk_matrix/jdk=JDK%201.8%20(latest),label=(Hadoop%20&&%20!H5)/4606/artifact/hbase-archetypes/hbase-client-project/target/checkstyle-result.xml> with 0 unique warnings and 0 duplicates.
[CHECKSTYLE] Successfully parsed file <https://builds.apache.org/job/HBase-Trunk_matrix/jdk=JDK%201.8%20(latest),label=(Hadoop%20&&%20!H5)/4606/artifact/hbase-archetypes/hbase-shaded-client-project/target/checkstyle-result.xml> with 0 unique warnings and 0 duplicates.
[CHECKSTYLE] Successfully parsed file <https://builds.apache.org/job/HBase-Trunk_matrix/jdk=JDK%201.8%20(latest),label=(Hadoop%20&&%20!H5)/4606/artifact/hbase-archetypes/target/checkstyle-result.xml> with 0 unique warnings and 0 duplicates.
[CHECKSTYLE] Successfully parsed file <https://builds.apache.org/job/HBase-Trunk_matrix/jdk=JDK%201.8%20(latest),label=(Hadoop%20&&%20!H5)/4606/artifact/hbase-assembly/target/checkstyle-result.xml> with 0 unique warnings and 0 duplicates.
[CHECKSTYLE] Successfully parsed file <https://builds.apache.org/job/HBase-Trunk_matrix/jdk=JDK%201.8%20(latest),label=(Hadoop%20&&%20!H5)/4606/artifact/hbase-backup/target/checkstyle-result.xml> with 0 unique warnings and 0 duplicates.
[CHECKSTYLE] Successfully parsed file <https://builds.apache.org/job/HBase-Trunk_matrix/jdk=JDK%201.8%20(latest),label=(Hadoop%20&&%20!H5)/4606/artifact/hbase-build-configuration/target/checkstyle-result.xml> with 0 unique warnings and 0 duplicates.
[CHECKSTYLE] Successfully parsed file <https://builds.apache.org/job/HBase-Trunk_matrix/jdk=JDK%201.8%20(latest),label=(Hadoop%20&&%20!H5)/4606/artifact/hbase-build-support/hbase-error-prone/target/checkstyle-result.xml> with 0 unique warnings and 0 duplicates.
[CHECKSTYLE] Successfully parsed file <https://builds.apache.org/job/HBase-Trunk_matrix/jdk=JDK%201.8%20(latest),label=(Hadoop%20&&%20!H5)/4606/artifact/hbase-build-support/target/checkstyle-result.xml> with 0 unique warnings and 0 duplicates.
[CHECKSTYLE] Successfully parsed file <https://builds.apache.org/job/HBase-Trunk_matrix/jdk=JDK%201.8%20(latest),label=(Hadoop%20&&%20!H5)/4606/artifact/hbase-checkstyle/target/checkstyle-result.xml> with 0 unique warnings and 0 duplicates.
[CHECKSTYLE] Successfully parsed file <https://builds.apache.org/job/HBase-Trunk_matrix/jdk=JDK%201.8%20(latest),label=(Hadoop%20&&%20!H5)/4606/artifact/hbase-client/target/checkstyle-result.xml> with 3078 unique warnings and 0 duplicates.
[CHECKSTYLE] Successfully parsed file <https://builds.apache.org/job/HBase-Trunk_matrix/jdk=JDK%201.8%20(latest),label=(Hadoop%20&&%20!H5)/4606/artifact/hbase-common/target/checkstyle-result.xml> with 4386 unique warnings and 0 duplicates.
[CHECKSTYLE] Successfully parsed file <https://builds.apache.org/job/HBase-Trunk_matrix/jdk=JDK%201.8%20(latest),label=(Hadoop%20&&%20!H5)/4606/artifact/hbase-endpoint/target/checkstyle-result.xml> with 4596 unique warnings and 0 duplicates.
[CHECKSTYLE] Successfully parsed file <https://builds.apache.org/job/HBase-Trunk_matrix/jdk=JDK%201.8%20(latest),label=(Hadoop%20&&%20!H5)/4606/artifact/hbase-examples/target/checkstyle-result.xml> with 4888 unique warnings and 0 duplicates.
[CHECKSTYLE] Successfully parsed file <https://builds.apache.org/job/HBase-Trunk_matrix/jdk=JDK%201.8%20(latest),label=(Hadoop%20&&%20!H5)/4606/artifact/hbase-external-blockcache/target/checkstyle-result.xml> with 4888 unique warnings and 0 duplicates.
[CHECKSTYLE] Successfully parsed file <https://builds.apache.org/job/HBase-Trunk_matrix/jdk=JDK%201.8%20(latest),label=(Hadoop%20&&%20!H5)/4606/artifact/hbase-hadoop-compat/target/checkstyle-result.xml> with 4888 unique warnings and 0 duplicates.
[CHECKSTYLE] Successfully parsed file <https://builds.apache.org/job/HBase-Trunk_matrix/jdk=JDK%201.8%20(latest),label=(Hadoop%20&&%20!H5)/4606/artifact/hbase-hadoop2-compat/target/checkstyle-result.xml> with 5042 unique warnings and 0 duplicates.
[CHECKSTYLE] Successfully parsed file <https://builds.apache.org/job/HBase-Trunk_matrix/jdk=JDK%201.8%20(latest),label=(Hadoop%20&&%20!H5)/4606/artifact/hbase-http/target/checkstyle-result.xml> with 5195 unique warnings and 0 duplicates.
[CHECKSTYLE] Successfully parsed file <https://builds.apache.org/job/HBase-Trunk_matrix/jdk=JDK%201.8%20(latest),label=(Hadoop%20&&%20!H5)/4606/artifact/hbase-it/target/checkstyle-result.xml> with 5638 unique warnings and 0 duplicates.
[CHECKSTYLE] Successfully parsed file <https://builds.apache.org/job/HBase-Trunk_matrix/jdk=JDK%201.8%20(latest),label=(Hadoop%20&&%20!H5)/4606/artifact/hbase-mapreduce/target/checkstyle-result.xml> with 6572 unique warnings and 0 duplicates.
[CHECKSTYLE] Successfully parsed file <https://builds.apache.org/job/HBase-Trunk_matrix/jdk=JDK%201.8%20(latest),label=(Hadoop%20&&%20!H5)/4606/artifact/hbase-metrics-api/target/checkstyle-result.xml> with 6572 unique warnings and 0 duplicates.
[CHECKSTYLE] Successfully parsed file <https://builds.apache.org/job/HBase-Trunk_matrix/jdk=JDK%201.8%20(latest),label=(Hadoop%20&&%20!H5)/4606/artifact/hbase-metrics/target/checkstyle-result.xml> with 6572 unique warnings and 0 duplicates.
[CHECKSTYLE] Successfully parsed file <https://builds.apache.org/job/HBase-Trunk_matrix/jdk=JDK%201.8%20(latest),label=(Hadoop%20&&%20!H5)/4606/artifact/hbase-procedure/target/checkstyle-result.xml> with 6747 unique warnings and 0 duplicates.
[CHECKSTYLE] Successfully parsed file <https://builds.apache.org/job/HBase-Trunk_matrix/jdk=JDK%201.8%20(latest),label=(Hadoop%20&&%20!H5)/4606/artifact/hbase-protocol-shaded/target/checkstyle-result.xml> with 6747 unique warnings and 0 duplicates.
[CHECKSTYLE] Successfully parsed file <https://builds.apache.org/job/HBase-Trunk_matrix/jdk=JDK%201.8%20(latest),label=(Hadoop%20&&%20!H5)/4606/artifact/hbase-protocol/target/checkstyle-result.xml> with 6747 unique warnings and 0 duplicates.
[CHECKSTYLE] Successfully parsed file <https://builds.apache.org/job/HBase-Trunk_matrix/jdk=JDK%201.8%20(latest),label=(Hadoop%20&&%20!H5)/4606/artifact/hbase-replication/target/checkstyle-result.xml> with 6747 unique warnings and 0 duplicates.
[CHECKSTYLE] Successfully parsed file <https://builds.apache.org/job/HBase-Trunk_matrix/jdk=JDK%201.8%20(latest),label=(Hadoop%20&&%20!H5)/4606/artifact/hbase-resource-bundle/target/checkstyle-result.xml> with 6747 unique warnings and 0 duplicates.
[CHECKSTYLE] Successfully parsed file <https://builds.apache.org/job/HBase-Trunk_matrix/jdk=JDK%201.8%20(latest),label=(Hadoop%20&&%20!H5)/4606/artifact/hbase-rest/target/checkstyle-result.xml> with 7585 unique warnings and 0 duplicates.
[CHECKSTYLE] Successfully parsed file <https://builds.apache.org/job/HBase-Trunk_matrix/jdk=JDK%201.8%20(latest),label=(Hadoop%20&&%20!H5)/4606/artifact/hbase-rsgroup/target/checkstyle-result.xml> with 7585 unique warnings and 0 duplicates.
[CHECKSTYLE] Successfully parsed file <https://builds.apache.org/job/HBase-Trunk_matrix/jdk=JDK%201.8%20(latest),label=(Hadoop%20&&%20!H5)/4606/artifact/hbase-server/target/checkstyle-result.xml> with 16525 unique warnings and 0 duplicates.
[CHECKSTYLE] Successfully parsed file <https://builds.apache.org/job/HBase-Trunk_matrix/jdk=JDK%201.8%20(latest),label=(Hadoop%20&&%20!H5)/4606/artifact/hbase-shaded/hbase-shaded-check-invariants/target/checkstyle-result.xml> with 16525 unique warnings and 0 duplicates.
[CHECKSTYLE] Successfully parsed file <https://builds.apache.org/job/HBase-Trunk_matrix/jdk=JDK%201.8%20(latest),label=(Hadoop%20&&%20!H5)/4606/artifact/hbase-shaded/hbase-shaded-client/target/checkstyle-result.xml> with 16525 unique warnings and 0 duplicates.
[CHECKSTYLE] Successfully parsed file <https://builds.apache.org/job/HBase-Trunk_matrix/jdk=JDK%201.8%20(latest),label=(Hadoop%20&&%20!H5)/4606/artifact/hbase-shaded/hbase-shaded-mapreduce/target/checkstyle-result.xml> with 16525 unique warnings and 0 duplicates.
[CHECKSTYLE] Successfully parsed file <https://builds.apache.org/job/HBase-Trunk_matrix/jdk=JDK%201.8%20(latest),label=(Hadoop%20&&%20!H5)/4606/artifact/hbase-shaded/target/checkstyle-result.xml> with 16525 unique warnings and 0 duplicates.
[CHECKSTYLE] Successfully parsed file <https://builds.apache.org/job/HBase-Trunk_matrix/jdk=JDK%201.8%20(latest),label=(Hadoop%20&&%20!H5)/4606/artifact/hbase-shell/target/checkstyle-result.xml> with 16525 unique warnings and 0 duplicates.
[CHECKSTYLE] Successfully parsed file <https://builds.apache.org/job/HBase-Trunk_matrix/jdk=JDK%201.8%20(latest),label=(Hadoop%20&&%20!H5)/4606/artifact/hbase-spark-it/target/checkstyle-result.xml> with 16525 unique warnings and 0 duplicates.
[CHECKSTYLE] Successfully parsed file <https://builds.apache.org/job/HBase-Trunk_matrix/jdk=JDK%201.8%20(latest),label=(Hadoop%20&&%20!H5)/4606/artifact/hbase-spark/target/checkstyle-result.xml> with 16525 unique warnings and 0 duplicates.
[CHECKSTYLE] Successfully parsed file <https://builds.apache.org/job/HBase-Trunk_matrix/jdk=JDK%201.8%20(latest),label=(Hadoop%20&&%20!H5)/4606/artifact/hbase-testing-util/target/checkstyle-result.xml> with 16525 unique warnings and 0 duplicates.
[CHECKSTYLE] Successfully parsed file <https://builds.apache.org/job/HBase-Trunk_matrix/jdk=JDK%201.8%20(latest),label=(Hadoop%20&&%20!H5)/4606/artifact/hbase-thrift/target/checkstyle-result.xml> with 16525 unique warnings and 0 duplicates.
[CHECKSTYLE] Successfully parsed file <https://builds.apache.org/job/HBase-Trunk_matrix/jdk=JDK%201.8%20(latest),label=(Hadoop%20&&%20!H5)/4606/artifact/hbase-zookeeper/target/checkstyle-result.xml> with 16538 unique warnings and 0 duplicates.
[CHECKSTYLE] Successfully parsed file <https://builds.apache.org/job/HBase-Trunk_matrix/jdk=JDK%201.8%20(latest),label=(Hadoop%20&&%20!H5)/4606/artifact/target/checkstyle-result.xml> with 16538 unique warnings and 0 duplicates.
<Git Blamer> Using GitBlamer to create author and commit information for all warnings.
<Git Blamer> GIT_COMMIT=f3bb9b9613beaefbee0a53be1fb66b94fde1ce19, workspace=<https://builds.apache.org/job/HBase-Trunk_matrix/jdk=JDK%201.8%20(latest),label=(Hadoop%20&&%20!H5)/ws/>
> git rev-parse f3bb9b9613beaefbee0a53be1fb66b94fde1ce19^{commit} # timeout=10
<Git Blamer> No blame results for request <hbase-common/target/generated-sources/java/org/apache/hadoop/hbase/Version.java - [8, 14]>.
ERROR: Build step failed with exception
java.lang.OutOfMemoryError
Also: hudson.remoting.Channel$CallSiteStackTrace: Remote call to H18
at hudson.remoting.Channel.attachCallSiteStackTrace(Channel.java:1693)
at hudson.remoting.UserResponse.retrieve(UserRequest.java:310)
at hudson.remoting.Channel.call(Channel.java:908)
at hudson.FilePath.act(FilePath.java:986)
at hudson.FilePath.act(FilePath.java:975)
at hudson.plugins.analysis.util.AbstractBlamer.invokeBlamer(AbstractBlamer.java:59)
at hudson.plugins.analysis.util.AbstractBlamer.blame(AbstractBlamer.java:45)
at hudson.plugins.analysis.core.HealthAwarePublisher.blame(HealthAwarePublisher.java:109)
at hudson.plugins.checkstyle.CheckStylePublisher.perform(CheckStylePublisher.java:81)
at hudson.plugins.analysis.core.HealthAwarePublisher.perform(HealthAwarePublisher.java:69)
at hudson.plugins.analysis.core.HealthAwareRecorder.perform(HealthAwareRecorder.java:298)
at hudson.tasks.BuildStepCompatibilityLayer.perform(BuildStepCompatibilityLayer.java:81)
at hudson.tasks.BuildStepMonitor$1.perform(BuildStepMonitor.java:20)
at hudson.model.AbstractBuild$AbstractBuildExecution.perform(AbstractBuild.java:744)
at hudson.model.AbstractBuild$AbstractBuildExecution.performAllBuildSteps(AbstractBuild.java:690)
at hudson.model.Build$BuildExecution.post2(Build.java:186)
at hudson.model.AbstractBuild$AbstractBuildExecution.post(AbstractBuild.java:635)
at hudson.model.Run.execute(Run.java:1749)
at hudson.matrix.MatrixRun.run(MatrixRun.java:146)
at hudson.model.ResourceController.execute(ResourceController.java:97)
at hudson.model.Executor.run(Executor.java:429)
Caused: org.eclipse.jgit.errors.LargeObjectException$OutOfMemory: Out of memory loading unknown object
at org.eclipse.jgit.internal.storage.file.PackFile.load(PackFile.java:869)
at org.eclipse.jgit.internal.storage.file.PackFile.get(PackFile.java:273)
at org.eclipse.jgit.internal.storage.file.ObjectDirectory.openPackedObject(ObjectDirectory.java:421)
at org.eclipse.jgit.internal.storage.file.ObjectDirectory.openPackedFromSelfOrAlternate(ObjectDirectory.java:390)
at org.eclipse.jgit.internal.storage.file.ObjectDirectory.openObject(ObjectDirectory.java:382)
at org.eclipse.jgit.internal.storage.file.WindowCursor.open(WindowCursor.java:154)
at org.eclipse.jgit.treewalk.CanonicalTreeParser.reset(CanonicalTreeParser.java:214)
at org.eclipse.jgit.treewalk.CanonicalTreeParser.createSubtreeIterator0(CanonicalTreeParser.java:248)
at org.eclipse.jgit.treewalk.CanonicalTreeParser.createSubtreeIterator(CanonicalTreeParser.java:226)
at org.eclipse.jgit.treewalk.CanonicalTreeParser.createSubtreeIterator(CanonicalTreeParser.java:70)
at org.eclipse.jgit.treewalk.TreeWalk.enterSubtree(TreeWalk.java:1210)
at org.eclipse.jgit.treewalk.TreeWalk.next(TreeWalk.java:828)
at org.eclipse.jgit.blame.BlameGenerator.find(BlameGenerator.java:955)
at org.eclipse.jgit.blame.BlameGenerator.processOne(BlameGenerator.java:603)
at org.eclipse.jgit.blame.BlameGenerator.next(BlameGenerator.java:496)
at org.eclipse.jgit.blame.BlameResult.computeAll(BlameResult.java:239)
at org.eclipse.jgit.blame.BlameGenerator.computeBlameResult(BlameGenerator.java:450)
at org.eclipse.jgit.api.BlameCommand.call(BlameCommand.java:230)
at hudson.plugins.analysis.util.GitBlamer$BlameCallback.invoke(GitBlamer.java:130)
at hudson.plugins.analysis.util.GitBlamer$BlameCallback.invoke(GitBlamer.java:104)
at org.jenkinsci.plugins.gitclient.AbstractGitAPIImpl.withRepository(AbstractGitAPIImpl.java:29)
at org.jenkinsci.plugins.gitclient.CliGitAPIImpl.withRepository(CliGitAPIImpl.java:72)
at hudson.plugins.analysis.util.GitBlamer.loadBlameResultsForFiles(GitBlamer.java:61)
at hudson.plugins.analysis.util.GitBlamer.blame(GitBlamer.java:54)
at hudson.plugins.analysis.util.AbstractBlamer$1.invoke(AbstractBlamer.java:62)
at hudson.plugins.analysis.util.AbstractBlamer$1.invoke(AbstractBlamer.java:59)
at hudson.FilePath$FileCallableWrapper.call(FilePath.java:2760)
at hudson.remoting.UserRequest.perform(UserRequest.java:207)
at hudson.remoting.UserRequest.perform(UserRequest.java:53)
at hudson.remoting.Request$2.run(Request.java:358)
at hudson.remoting.InterceptingExecutorService$1.call(InterceptingExecutorService.java:72)
at java.util.concurrent.FutureTask.run(FutureTask.java:266)
at java.util.concurrent.ThreadPoolExecutor.runWorker(ThreadPoolExecutor.java:1142)
at java.util.concurrent.ThreadPoolExecutor$Worker.run(ThreadPoolExecutor.java:617)
at java.lang.Thread.run(Thread.java:748)
Build step 'Publish Checkstyle analysis results' marked build as failure