You are viewing a plain text version of this content. The canonical link for it is here.
Posted to commits@myfaces.apache.org by "Continuum@myfaces.zones.apache.org" <co...@myfaces.apache.org> on 2007/06/15 04:43:51 UTC

[continuum] BUILD FAILURE: Apache Trinidad Maven JDev Plugin

Online report : http://myfaces.zones.apache.org:8081/continuum/buildResult.action?buildId=2338&projectId=126
Build statistics:
  State: Failed
  Previous State: Ok
  Started at: Fri 15 Jun 2007 02:43:43 +0000
  Finished at: Fri 15 Jun 2007 02:43:46 +0000
  Total time: 3s
  Build Trigger: Schedule
  Build Number: 4
  Exit code: 1
  Building machine hostname: myfaces.zones.apache.org
  Operating system : SunOS(unknown)
  Java version : 1.5.0_11(Sun Microsystems Inc.)

****************************************************************************
SCM Changes:
****************************************************************************
Changed: no author @ no date
Comment: no comment
Files changed:
  NOTICE.txt ( no revision )
  src/main/resources/META-INF/NOTICE ( no revision )
  pom.xml ( no revision )

****************************************************************************
SCM Changes since last success:
****************************************************************************
****************************************************************************
Dependencies Changes:
****************************************************************************
No dependencies changed

****************************************************************************
Test Summary:
****************************************************************************
Tests: 0
Failures: 0
Total time: 0

****************************************************************************
Output:
****************************************************************************
[INFO] Scanning for projects...
[INFO] ------------------------------------------------------------------------
[ERROR] FATAL ERROR
[INFO] ------------------------------------------------------------------------
[INFO] Failed to resolve artifact.

GroupId: org.apache.myfaces.trinidadbuild
ArtifactId: maven-plugin-parent
Version: 1.0.2-SNAPSHOT

Reason: Unable to download the artifact from any repository

  org.apache.myfaces.trinidadbuild:maven-plugin-parent:pom:1.0.2-SNAPSHOT

from the specified remote repositories:
  central (http://repo1.maven.org/maven2)


[INFO] ------------------------------------------------------------------------
[INFO] Trace
org.apache.maven.reactor.MavenExecutionException: Cannot find parent: org.apache.myfaces.trinidadbuild:maven-plugin-parent for project: org.apache.myfaces.trinidadbuild:maven-jdev-plugin:maven-plugin:1.0.2-SNAPSHOT
	at org.apache.maven.DefaultMaven.getProjects(DefaultMaven.java:373)
	at org.apache.maven.DefaultMaven.doExecute(DefaultMaven.java:286)
	at org.apache.maven.DefaultMaven.execute(DefaultMaven.java:123)
	at org.apache.maven.cli.MavenCli.main(MavenCli.java:272)
	at sun.reflect.NativeMethodAccessorImpl.invoke0(Native Method)
	at sun.reflect.NativeMethodAccessorImpl.invoke(NativeMethodAccessorImpl.java:39)
	at sun.reflect.DelegatingMethodAccessorImpl.invoke(DelegatingMethodAccessorImpl.java:25)
	at java.lang.reflect.Method.invoke(Method.java:585)
	at org.codehaus.classworlds.Launcher.launchEnhanced(Launcher.java:315)
	at org.codehaus.classworlds.Launcher.launch(Launcher.java:255)
	at org.codehaus.classworlds.Launcher.mainWithExitCode(Launcher.java:430)
	at org.codehaus.classworlds.Launcher.main(Launcher.java:375)
Caused by: org.apache.maven.project.ProjectBuildingException: Cannot find parent: org.apache.myfaces.trinidadbuild:maven-plugin-parent for project: org.apache.myfaces.trinidadbuild:maven-jdev-plugin:maven-plugin:1.0.2-SNAPSHOT
	at org.apache.maven.project.DefaultMavenProjectBuilder.assembleLineage(DefaultMavenProjectBuilder.java:1198)
	at org.apache.maven.project.DefaultMavenProjectBuilder.buildInternal(DefaultMavenProjectBuilder.java:697)
	at org.apache.maven.project.DefaultMavenProjectBuilder.buildFromSourceFileInternal(DefaultMavenProjectBuilder.java:431)
	at org.apache.maven.project.DefaultMavenProjectBuilder.build(DefaultMavenProjectBuilder.java:195)
	at org.apache.maven.DefaultMaven.getProject(DefaultMaven.java:523)
	at org.apache.maven.DefaultMaven.collectProjects(DefaultMaven.java:455)
	at org.apache.maven.DefaultMaven.getProjects(DefaultMaven.java:359)
	... 11 more
Caused by: org.apache.maven.project.ProjectBuildingException: POM 'org.apache.myfaces.trinidadbuild:maven-plugin-parent' not found in repository: Unable to download the artifact from any repository

  org.apache.myfaces.trinidadbuild:maven-plugin-parent:pom:1.0.2-SNAPSHOT

from the specified remote repositories:
  central (http://repo1.maven.org/maven2)

	at org.apache.maven.project.DefaultMavenProjectBuilder.findModelFromRepository(DefaultMavenProjectBuilder.java:528)
	at org.apache.maven.project.DefaultMavenProjectBuilder.assembleLineage(DefaultMavenProjectBuilder.java:1194)
	... 17 more
Caused by: org.apache.maven.artifact.resolver.ArtifactNotFoundException: Unable to download the artifact from any repository

  org.apache.myfaces.trinidadbuild:maven-plugin-parent:pom:1.0.2-SNAPSHOT

from the specified remote repositories:
  central (http://repo1.maven.org/maven2)

	at org.apache.maven.artifact.resolver.DefaultArtifactResolver.resolve(DefaultArtifactResolver.java:197)
	at org.apache.maven.artifact.resolver.DefaultArtifactResolver.resolve(DefaultArtifactResolver.java:73)
	at org.apache.maven.project.DefaultMavenProjectBuilder.findModelFromRepository(DefaultMavenProjectBuilder.java:482)
	... 18 more
Caused by: org.apache.maven.wagon.ResourceDoesNotExistException: Unable to download the artifact from any repository
	at org.apache.maven.artifact.manager.DefaultWagonManager.getArtifact(DefaultWagonManager.java:308)
	at org.apache.maven.artifact.resolver.DefaultArtifactResolver.resolve(DefaultArtifactResolver.java:185)
	... 20 more
[INFO] ------------------------------------------------------------------------
[INFO] Total time: < 1 second
[INFO] Finished at: Fri Jun 15 02:43:46 GMT+00:00 2007
[INFO] Final Memory: 1M/8M
[INFO] ------------------------------------------------------------------------

****************************************************************************