You are viewing a plain text version of this content. The canonical link for it is here.
Posted to commits@tomee.apache.org by Apache Jenkins Server <je...@builds.apache.org> on 2026/10/20 12:20:35 UTC

Build failed in Jenkins: TomEE » tomee-jakartaee-api-master #1731

See <https://ci-builds.apache.org/job/Tomee/job/tomee-jakartaee-api-master/1731/display/redirect>

Changes:


------------------------------------------
Started by timer
Running as SYSTEM
[EnvInject] - Loading node environment variables.
Building remotely on builds32 (ubuntu) in workspace <https://ci-builds.apache.org/job/Tomee/job/tomee-jakartaee-api-master/ws/>
The recommended git tool is: NONE
No credentials specified
 > git rev-parse --resolve-git-dir <https://ci-builds.apache.org/job/Tomee/job/tomee-jakartaee-api-master/ws/.git> # timeout=10
Fetching changes from the remote Git repository
 > git config remote.origin.url https://github.com/apache/tomee-jakartaee-api # timeout=10
Cleaning workspace
 > git rev-parse --verify HEAD # timeout=10
Resetting working tree
 > git reset --hard # timeout=10
 > git clean -fdx # timeout=10
Fetching upstream changes from https://github.com/apache/tomee-jakartaee-api
 > git --version # timeout=10
 > git --version # 'git version 2.34.1'
 > git fetch --tags --force --progress -- https://github.com/apache/tomee-jakartaee-api +refs/heads/*:refs/remotes/origin/* # timeout=10
 > git rev-parse refs/remotes/origin/main^{commit} # timeout=10
Checking out Revision c531599fb0d0f9bdb326e28cff23baaaf65af5f5 (refs/remotes/origin/main)
 > git config core.sparsecheckout # timeout=10
 > git checkout -f c531599fb0d0f9bdb326e28cff23baaaf65af5f5 # timeout=10
Commit message: "[maven-release-plugin] prepare for next development iteration"
 > git rev-list --no-walk c531599fb0d0f9bdb326e28cff23baaaf65af5f5 # timeout=10
Parsing POMs
Established TCP socket on 40037
maven35-agent.jar already up to date
maven35-interceptor.jar already up to date
maven3-interceptor-commons.jar already up to date
[tomee-jakartaee-api-master] $ /home/jenkins/tools/java/latest11/bin/java -Xmx1536m -cp /home/jenkins/jenkins-agent/maven35-agent.jar:/home/jenkins/tools/maven/latest/boot/plexus-classworlds-2.11.0.jar:/home/jenkins/tools/maven/latest/conf/logging jenkins.maven3.agent.Maven35Main /home/jenkins/tools/maven/latest /home/jenkins/jenkins-agent/agent.jar /home/jenkins/jenkins-agent/maven35-interceptor.jar /home/jenkins/jenkins-agent/maven3-interceptor-commons.jar 40037
<===[JENKINS REMOTING CAPACITY]===>   channel started
Oct 20, 2026 12:19:12 PM hudson.remoting.UserRequest perform
WARNING: LinkageError while performing UserRequest:hudson.maven.AbstractMavenProcessFactory$ConfigureOriginalJDK@1c592a0b
java.lang.UnsupportedClassVersionError: Failed to load hudson.maven.AbstractMavenProcessFactory$ConfigureOriginalJDK
	at hudson.remoting.RemoteClassLoader.loadClassFile(RemoteClassLoader.java:472)
	at hudson.remoting.RemoteClassLoader.loadRemoteClass(RemoteClassLoader.java:301)
	at hudson.remoting.RemoteClassLoader.loadWithMultiClassLoader(RemoteClassLoader.java:277)
	at hudson.remoting.RemoteClassLoader.findClass(RemoteClassLoader.java:236)
	at java.base/java.lang.ClassLoader.loadClass(ClassLoader.java:594)
	at java.base/java.lang.ClassLoader.loadClass(ClassLoader.java:527)
	at java.base/java.lang.Class.forName0(Native Method)
	at java.base/java.lang.Class.forName(Class.java:398)
	at hudson.remoting.MultiClassLoaderSerializer$Input.resolveClass(MultiClassLoaderSerializer.java:133)
	at java.base/java.io.ObjectInputStream.readNonProxyDesc(ObjectInputStream.java:2003)
	at java.base/java.io.ObjectInputStream.readClassDesc(ObjectInputStream.java:1870)
	at java.base/java.io.ObjectInputStream.readOrdinaryObject(ObjectInputStream.java:2201)
	at java.base/java.io.ObjectInputStream.readObject0(ObjectInputStream.java:1687)
	at java.base/java.io.ObjectInputStream.readObject(ObjectInputStream.java:489)
	at java.base/java.io.ObjectInputStream.readObject(ObjectInputStream.java:447)
	at hudson.remoting.UserRequest.deserialize(UserRequest.java:312)
	at hudson.remoting.UserRequest.perform(UserRequest.java:196)
	at hudson.remoting.UserRequest.perform(UserRequest.java:50)
	at hudson.remoting.Request$2.run(Request.java:391)
	at hudson.remoting.InterceptingExecutorService.lambda$wrap$0(InterceptingExecutorService.java:81)
	at java.base/java.util.concurrent.FutureTask.run(FutureTask.java:264)
	at java.base/java.util.concurrent.ThreadPoolExecutor.runWorker(ThreadPoolExecutor.java:1128)
	at java.base/java.util.concurrent.ThreadPoolExecutor$Worker.run(ThreadPoolExecutor.java:628)
	at java.base/java.lang.Thread.run(Thread.java:829)
Caused by: java.lang.UnsupportedClassVersionError: Failed to load jenkins.security.MasterToSlaveCallable
	at hudson.remoting.RemoteClassLoader.loadClassFile(RemoteClassLoader.java:472)
	at hudson.remoting.RemoteClassLoader.loadRemoteClass(RemoteClassLoader.java:301)
	at hudson.remoting.RemoteClassLoader.loadWithMultiClassLoader(RemoteClassLoader.java:277)
	at hudson.remoting.RemoteClassLoader.findClass(RemoteClassLoader.java:236)
	at java.base/java.lang.ClassLoader.loadClass(ClassLoader.java:594)
	at java.base/java.lang.ClassLoader.loadClass(ClassLoader.java:527)
	at java.base/java.lang.ClassLoader.defineClass1(Native Method)
	at java.base/java.lang.ClassLoader.defineClass(ClassLoader.java:1022)
	at java.base/java.lang.ClassLoader.defineClass(ClassLoader.java:883)
	at hudson.remoting.RemoteClassLoader.loadClassFile(RemoteClassLoader.java:470)
	... 23 more
Caused by: java.lang.UnsupportedClassVersionError: jenkins/security/MasterToSlaveCallable has been compiled by a more recent version of the Java Runtime (class file version 61.0), this version of the Java Runtime only recognizes class file versions up to 55.0
	at java.base/java.lang.ClassLoader.defineClass1(Native Method)
	at java.base/java.lang.ClassLoader.defineClass(ClassLoader.java:1022)
	at java.base/java.lang.ClassLoader.defineClass(ClassLoader.java:883)
	at hudson.remoting.RemoteClassLoader.loadClassFile(RemoteClassLoader.java:470)
	... 32 more

ERROR: ================================================================================
ERROR: Invalid project setup: Failed to load hudson.maven.AbstractMavenProcessFactory$ConfigureOriginalJDK
ERROR: [JENKINS-18403][JENKINS-28294] JDK 'jdk_11_latest' not supported to run Maven projects.
ERROR: Maven projects have to be launched with a Java version greater or equal to the minimum version required by the controller.
ERROR: Use the Maven JDK Toolchains (plugin) to build your maven project with an older JDK.
ERROR: Retrying with agent Java and setting compile/test properties to point to /home/jenkins/tools/java/latest11.
ERROR: ================================================================================
Established TCP socket on 41517
maven35-agent.jar already up to date
maven35-interceptor.jar already up to date
maven3-interceptor-commons.jar already up to date
[tomee-jakartaee-api-master] $ /usr/local/asfpackages/java/adoptium-jdk-17.0.12+7/bin/java -Xmx1536m -cp /home/jenkins/jenkins-agent/maven35-agent.jar:/home/jenkins/tools/maven/latest/boot/plexus-classworlds-2.11.0.jar:/home/jenkins/tools/maven/latest/conf/logging jenkins.maven3.agent.Maven35Main /home/jenkins/tools/maven/latest /home/jenkins/jenkins-agent/agent.jar /home/jenkins/jenkins-agent/maven35-interceptor.jar /home/jenkins/jenkins-agent/maven3-interceptor-commons.jar 41517
<===[JENKINS REMOTING CAPACITY]===>   channel started
Executing Maven:  -B -f <https://ci-builds.apache.org/job/Tomee/job/tomee-jakartaee-api-master/ws/pom.xml> -U --show-version --fail-at-end clean install deploy -Dfile.encoding=UTF-8
Apache Maven 3.9.16 (2bdd9fddda4b155ebf8000e807eb73fd829a51d5)
Maven home: /usr/local/asfpackages/maven/apache-maven-3.9.16
Java version: 17.0.12, vendor: Eclipse Adoptium, runtime: /usr/local/asfpackages/java/adoptium-jdk-17.0.12+7
Default locale: en_US, platform encoding: UTF-8
OS name: "linux", version: "5.15.0-187-generic", arch: "amd64", family: "unix"
[INFO] Scanning for projects...
[HUDSON] Collecting dependencies info
[INFO] ------------------------------------------------------------------------
[INFO] Reactor Build Order:
[HUDSON] Collecting dependencies info
[INFO] 
[HUDSON] Collecting dependencies info
[INFO] Apache TomEE :: Jakarta EE 11 Full API :: Parent                   [pom]
[INFO] Apache TomEE :: Jakarta EE 11 Full API                             [jar]
[INFO] Apache TomEE :: Jakarta EE 11 Full API :: Signature Tests          [pom]
[INFO] 
[INFO] ---------------< org.apache.tomee:jakartaee-api-parent >----------------
[INFO] Building Apache TomEE :: Jakarta EE 11 Full API :: Parent 11.0.0-M2-SNAPSHOT [1/3]
[INFO]   from pom.xml
[INFO] --------------------------------[ pom ]---------------------------------
[INFO] 
[INFO] --- clean:3.5.0:clean (default-clean) @ jakartaee-api-parent ---
[INFO] 
[INFO] --- enforcer:3.6.2:enforce (enforce-maven-version) @ jakartaee-api-parent ---
[INFO] Rule 0: org.apache.maven.enforcer.rules.version.RequireMavenVersion passed
[INFO] 
[INFO] --- enforcer:3.6.2:enforce (enforce-java-version) @ jakartaee-api-parent ---
[INFO] Rule 0: org.apache.maven.enforcer.rules.version.RequireJavaVersion passed
[INFO] 
[INFO] --- remote-resources:3.3.0:process (process-resource-bundles) @ jakartaee-api-parent ---
[INFO] Preparing remote bundle org.apache.apache.resources:apache-jar-resource-bundle:1.8
[INFO] Copying 3 resources from 1 bundle.
[INFO] 
[INFO] --- install:3.1.4:install (default-install) @ jakartaee-api-parent ---
[INFO] Installing <https://ci-builds.apache.org/job/Tomee/job/tomee-jakartaee-api-master/ws/pom.xml> to /home/jenkins/.m2/repository/org/apache/tomee/jakartaee-api-parent/11.0.0-M2-SNAPSHOT/jakartaee-api-parent-11.0.0-M2-SNAPSHOT.pom
[INFO] 
[INFO] --- enforcer:3.6.2:enforce (enforce-maven-version) @ jakartaee-api-parent ---
[INFO] 
[INFO] --- enforcer:3.6.2:enforce (enforce-java-version) @ jakartaee-api-parent ---
[INFO] 
[INFO] --- remote-resources:3.3.0:process (process-resource-bundles) @ jakartaee-api-parent ---
[INFO] Preparing remote bundle org.apache.apache.resources:apache-jar-resource-bundle:1.8
[INFO] Copying 3 resources from 1 bundle.
[INFO] 
[INFO] --- install:3.1.4:install (default-install) @ jakartaee-api-parent ---
[INFO] Installing <https://ci-builds.apache.org/job/Tomee/job/tomee-jakartaee-api-master/ws/pom.xml> to /home/jenkins/.m2/repository/org/apache/tomee/jakartaee-api-parent/11.0.0-M2-SNAPSHOT/jakartaee-api-parent-11.0.0-M2-SNAPSHOT.pom
[INFO] 
[INFO] --- deploy:3.1.4:deploy (default-deploy) @ jakartaee-api-parent ---
[INFO] Downloading from apache.snapshots.https: https://repository.apache.org/content/repositories/snapshots/org/apache/tomee/jakartaee-api-parent/11.0.0-M2-SNAPSHOT/maven-metadata.xml
[INFO] Downloaded from apache.snapshots.https: https://repository.apache.org/content/repositories/snapshots/org/apache/tomee/jakartaee-api-parent/11.0.0-M2-SNAPSHOT/maven-metadata.xml (625 B at 674 B/s)
[INFO] Uploading to apache.snapshots.https: https://repository.apache.org/content/repositories/snapshots/org/apache/tomee/jakartaee-api-parent/11.0.0-M2-SNAPSHOT/jakartaee-api-parent-11.0.0-M2-20261020.121945-266.pom
[INFO] Uploaded to apache.snapshots.https: https://repository.apache.org/content/repositories/snapshots/org/apache/tomee/jakartaee-api-parent/11.0.0-M2-SNAPSHOT/jakartaee-api-parent-11.0.0-M2-20261020.121945-266.pom (2.3 kB at 2.1 kB/s)
[INFO] Downloading from apache.snapshots.https: https://repository.apache.org/content/repositories/snapshots/org/apache/tomee/jakartaee-api-parent/maven-metadata.xml
[INFO] Downloaded from apache.snapshots.https: https://repository.apache.org/content/repositories/snapshots/org/apache/tomee/jakartaee-api-parent/maven-metadata.xml (527 B at 2.8 kB/s)
[INFO] Uploading to apache.snapshots.https: https://repository.apache.org/content/repositories/snapshots/org/apache/tomee/jakartaee-api-parent/11.0.0-M2-SNAPSHOT/maven-metadata.xml
[INFO] Uploaded to apache.snapshots.https: https://repository.apache.org/content/repositories/snapshots/org/apache/tomee/jakartaee-api-parent/11.0.0-M2-SNAPSHOT/maven-metadata.xml (625 B at 577 B/s)
[INFO] Uploading to apache.snapshots.https: https://repository.apache.org/content/repositories/snapshots/org/apache/tomee/jakartaee-api-parent/maven-metadata.xml
[INFO] Uploaded to apache.snapshots.https: https://repository.apache.org/content/repositories/snapshots/org/apache/tomee/jakartaee-api-parent/maven-metadata.xml (527 B at 487 B/s)
[WARNING] Attempt to (de-)serialize anonymous class org.jfrog.hudson.maven2.MavenDependenciesRecorder$1; see: https://jenkins.io/redirect/serialization-of-anonymous-classes/
[INFO] 
[INFO] -------------------< org.apache.tomee:jakartaee-api >-------------------
[INFO] Building Apache TomEE :: Jakarta EE 11 Full API 11.0.0-M2-SNAPSHOT [2/3]
[INFO]   from api/pom.xml
[INFO] --------------------------------[ jar ]---------------------------------
[INFO] 
[INFO] --- clean:3.1.0:clean (default-clean) @ jakartaee-api ---
[INFO] 
[INFO] --- enforcer:3.6.2:enforce (enforce-maven-version) @ jakartaee-api ---
[INFO] 
[INFO] --- enforcer:3.6.2:enforce (enforce-java-version) @ jakartaee-api ---
[INFO] 
[INFO] --- remote-resources:3.3.0:process (process-resource-bundles) @ jakartaee-api ---
[INFO] Preparing remote bundle org.apache.apache.resources:apache-jar-resource-bundle:1.8
[INFO] Copying 3 resources from 1 bundle.
[INFO] 
[INFO] --- resources:3.5.0:resources (default-resources) @ jakartaee-api ---
[INFO] Copying 1 resource from src/main/resources to target/classes
[INFO] Copying 1 resource from src/main/filtered-resources to target/classes
[INFO] Copying 3 resources from target/maven-shared-archive-resources to target/classes
[INFO] 
[INFO] --- compiler:3.8.1:compile (default-compile) @ jakartaee-api ---
[INFO] Changes detected - recompiling the module!
[INFO] Compiling 2 source files to <https://ci-builds.apache.org/job/Tomee/job/tomee-jakartaee-api-master/ws/api/target/classes>
[INFO] -------------------------------------------------------------
[ERROR] COMPILATION ERROR : 
[INFO] -------------------------------------------------------------
[ERROR] error: release version 17 not supported
[INFO] 1 error
[INFO] -------------------------------------------------------------
[INFO] 
[INFO] -----------------< org.apache.tomee:jakartaee-api-tck >-----------------
[INFO] Building Apache TomEE :: Jakarta EE 11 Full API :: Signature Tests 11.0.0-M2-SNAPSHOT [3/3]
[INFO]   from tck/pom.xml
[INFO] --------------------------------[ pom ]---------------------------------
[INFO] 
[INFO] --- clean:3.5.0:clean (default-clean) @ jakartaee-api-tck ---
[INFO] 
[INFO] --- enforcer:3.6.2:enforce (enforce-maven-version) @ jakartaee-api-tck ---
[INFO] 
[INFO] --- enforcer:3.6.2:enforce (enforce-java-version) @ jakartaee-api-tck ---
[INFO] 
[INFO] --- dependency:3.10.0:unpack (unpack-classes) @ jakartaee-api-tck ---
[INFO] ------------------------------------------------------------------------
[INFO] Reactor Summary for Apache TomEE :: Jakarta EE 11 Full API :: Parent 11.0.0-M2-SNAPSHOT:
[INFO] 
[INFO] Apache TomEE :: Jakarta EE 11 Full API :: Parent ... SUCCESS [ 16.755 s]
[INFO] Apache TomEE :: Jakarta EE 11 Full API ............. FAILURE [  5.384 s]
[INFO] Apache TomEE :: Jakarta EE 11 Full API :: Signature Tests FAILURE [  2.994 s]
[INFO] ------------------------------------------------------------------------
[INFO] BUILD FAILURE
[INFO] ------------------------------------------------------------------------
[INFO] Total time:  39.524 s
[INFO] Finished at: 2026-10-20T12:20:25Z
[INFO] ------------------------------------------------------------------------
Waiting for Jenkins to finish collecting data
[ERROR] Failed to execute goal org.apache.maven.plugins:maven-compiler-plugin:3.8.1:compile (default-compile) on project jakartaee-api: Compilation failure
[ERROR] error: release version 17 not supported
[ERROR] -> [Help 1]
[ERROR] Failed to execute goal org.apache.maven.plugins:maven-dependency-plugin:3.10.0:unpack (unpack-classes) on project jakartaee-api-tck: Unable to find/resolve artifact. The following artifacts could not be resolved: org.apache.tomee:jakartaee-api:jar:11.0.0-M2-SNAPSHOT (absent): Could not find artifact org.apache.tomee:jakartaee-api:jar:11.0.0-M2-SNAPSHOT -> [Help 2]
[ERROR] 
[ERROR] To see the full stack trace of the errors, re-run Maven with the -e switch.
[ERROR] Re-run Maven using the -X switch to enable full debug logging.
[ERROR] 
[ERROR] For more information about the errors and possible solutions, please read the following articles:
[ERROR] [Help 1] http://cwiki.apache.org/confluence/display/MAVEN/MojoFailureException
[ERROR] [Help 2] http://cwiki.apache.org/confluence/display/MAVEN/MojoExecutionException
[ERROR] 
[ERROR] After correcting the problems, you can resume the build with the command
[ERROR]   mvn <goals> -rf :jakartaee-api
[JENKINS] Archiving <https://ci-builds.apache.org/job/Tomee/job/tomee-jakartaee-api-master/ws/pom.xml> to org.apache.tomee/jakartaee-api-parent/11.0.0-M2-SNAPSHOT/jakartaee-api-parent-11.0.0-M2-SNAPSHOT.pom
[JENKINS] Archiving <https://ci-builds.apache.org/job/Tomee/job/tomee-jakartaee-api-master/ws/api/pom.xml> to org.apache.tomee/jakartaee-api/11.0.0-M2-SNAPSHOT/jakartaee-api-11.0.0-M2-SNAPSHOT.pom
[JENKINS] Archiving <https://ci-builds.apache.org/job/Tomee/job/tomee-jakartaee-api-master/ws/tck/pom.xml> to org.apache.tomee/jakartaee-api-tck/11.0.0-M2-SNAPSHOT/jakartaee-api-tck-11.0.0-M2-SNAPSHOT.pom
Sending e-mails to: commits@tomee.apache.org
Sending e-mails to: commits@tomee.apache.org
channel stopped

Build failed in Jenkins: TomEE » tomee-jakartaee-api-master #1734

Posted by Apache Jenkins Server <je...@builds.apache.org>.
See <https://ci-builds.apache.org/job/Tomee/job/tomee-jakartaee-api-master/1734/display/redirect>

Changes:


------------------------------------------
Started by timer
Running as SYSTEM
[EnvInject] - Loading node environment variables.
Building remotely on builds32 (ubuntu) in workspace <https://ci-builds.apache.org/job/Tomee/job/tomee-jakartaee-api-master/ws/>
The recommended git tool is: NONE
No credentials specified
 > git rev-parse --resolve-git-dir <https://ci-builds.apache.org/job/Tomee/job/tomee-jakartaee-api-master/ws/.git> # timeout=10
Fetching changes from the remote Git repository
 > git config remote.origin.url https://github.com/apache/tomee-jakartaee-api # timeout=10
Cleaning workspace
 > git rev-parse --verify HEAD # timeout=10
Resetting working tree
 > git reset --hard # timeout=10
 > git clean -fdx # timeout=10
Fetching upstream changes from https://github.com/apache/tomee-jakartaee-api
 > git --version # timeout=10
 > git --version # 'git version 2.34.1'
 > git fetch --tags --force --progress -- https://github.com/apache/tomee-jakartaee-api +refs/heads/*:refs/remotes/origin/* # timeout=10
 > git rev-parse refs/remotes/origin/main^{commit} # timeout=10
Checking out Revision c531599fb0d0f9bdb326e28cff23baaaf65af5f5 (refs/remotes/origin/main)
 > git config core.sparsecheckout # timeout=10
 > git checkout -f c531599fb0d0f9bdb326e28cff23baaaf65af5f5 # timeout=10
Commit message: "[maven-release-plugin] prepare for next development iteration"
 > git rev-list --no-walk c531599fb0d0f9bdb326e28cff23baaaf65af5f5 # timeout=10
Parsing POMs
Established TCP socket on 46257
maven35-agent.jar already up to date
maven35-interceptor.jar already up to date
maven3-interceptor-commons.jar already up to date
[tomee-jakartaee-api-master] $ /home/jenkins/tools/java/latest11/bin/java -Xmx1536m -cp /home/jenkins/jenkins-agent/maven35-agent.jar:/home/jenkins/tools/maven/latest/boot/plexus-classworlds-2.12.1.jar:/home/jenkins/tools/maven/latest/conf/logging jenkins.maven3.agent.Maven35Main /home/jenkins/tools/maven/latest /home/jenkins/jenkins-agent/agent.jar /home/jenkins/jenkins-agent/maven35-interceptor.jar /home/jenkins/jenkins-agent/maven3-interceptor-commons.jar 46257
<===[JENKINS REMOTING CAPACITY]===>   channel started
Oct 23, 2026 12:19:12 PM hudson.remoting.UserRequest perform
WARNING: LinkageError while performing UserRequest:hudson.maven.AbstractMavenProcessFactory$ConfigureOriginalJDK@5377d5b1
java.lang.UnsupportedClassVersionError: Failed to load hudson.maven.AbstractMavenProcessFactory$ConfigureOriginalJDK
	at hudson.remoting.RemoteClassLoader.loadClassFile(RemoteClassLoader.java:472)
	at hudson.remoting.RemoteClassLoader.loadRemoteClass(RemoteClassLoader.java:301)
	at hudson.remoting.RemoteClassLoader.loadWithMultiClassLoader(RemoteClassLoader.java:277)
	at hudson.remoting.RemoteClassLoader.findClass(RemoteClassLoader.java:236)
	at java.base/java.lang.ClassLoader.loadClass(ClassLoader.java:594)
	at java.base/java.lang.ClassLoader.loadClass(ClassLoader.java:527)
	at java.base/java.lang.Class.forName0(Native Method)
	at java.base/java.lang.Class.forName(Class.java:398)
	at hudson.remoting.MultiClassLoaderSerializer$Input.resolveClass(MultiClassLoaderSerializer.java:133)
	at java.base/java.io.ObjectInputStream.readNonProxyDesc(ObjectInputStream.java:2003)
	at java.base/java.io.ObjectInputStream.readClassDesc(ObjectInputStream.java:1870)
	at java.base/java.io.ObjectInputStream.readOrdinaryObject(ObjectInputStream.java:2201)
	at java.base/java.io.ObjectInputStream.readObject0(ObjectInputStream.java:1687)
	at java.base/java.io.ObjectInputStream.readObject(ObjectInputStream.java:489)
	at java.base/java.io.ObjectInputStream.readObject(ObjectInputStream.java:447)
	at hudson.remoting.UserRequest.deserialize(UserRequest.java:312)
	at hudson.remoting.UserRequest.perform(UserRequest.java:196)
	at hudson.remoting.UserRequest.perform(UserRequest.java:50)
	at hudson.remoting.Request$2.run(Request.java:391)
	at hudson.remoting.InterceptingExecutorService.lambda$wrap$0(InterceptingExecutorService.java:81)
	at java.base/java.util.concurrent.FutureTask.run(FutureTask.java:264)
	at java.base/java.util.concurrent.ThreadPoolExecutor.runWorker(ThreadPoolExecutor.java:1128)
	at java.base/java.util.concurrent.ThreadPoolExecutor$Worker.run(ThreadPoolExecutor.java:628)
	at java.base/java.lang.Thread.run(Thread.java:829)
Caused by: java.lang.UnsupportedClassVersionError: Failed to load jenkins.security.MasterToSlaveCallable
	at hudson.remoting.RemoteClassLoader.loadClassFile(RemoteClassLoader.java:472)
	at hudson.remoting.RemoteClassLoader.loadRemoteClass(RemoteClassLoader.java:301)
	at hudson.remoting.RemoteClassLoader.loadWithMultiClassLoader(RemoteClassLoader.java:277)
	at hudson.remoting.RemoteClassLoader.findClass(RemoteClassLoader.java:236)
	at java.base/java.lang.ClassLoader.loadClass(ClassLoader.java:594)
	at java.base/java.lang.ClassLoader.loadClass(ClassLoader.java:527)
	at java.base/java.lang.ClassLoader.defineClass1(Native Method)
	at java.base/java.lang.ClassLoader.defineClass(ClassLoader.java:1022)
	at java.base/java.lang.ClassLoader.defineClass(ClassLoader.java:883)
	at hudson.remoting.RemoteClassLoader.loadClassFile(RemoteClassLoader.java:470)
	... 23 more
Caused by: java.lang.UnsupportedClassVersionError: jenkins/security/MasterToSlaveCallable has been compiled by a more recent version of the Java Runtime (class file version 61.0), this version of the Java Runtime only recognizes class file versions up to 55.0
	at java.base/java.lang.ClassLoader.defineClass1(Native Method)
	at java.base/java.lang.ClassLoader.defineClass(ClassLoader.java:1022)
	at java.base/java.lang.ClassLoader.defineClass(ClassLoader.java:883)
	at hudson.remoting.RemoteClassLoader.loadClassFile(RemoteClassLoader.java:470)
	... 32 more

ERROR: ================================================================================
ERROR: Invalid project setup: Failed to load hudson.maven.AbstractMavenProcessFactory$ConfigureOriginalJDK
ERROR: [JENKINS-18403][JENKINS-28294] JDK 'jdk_11_latest' not supported to run Maven projects.
ERROR: Maven projects have to be launched with a Java version greater or equal to the minimum version required by the controller.
ERROR: Use the Maven JDK Toolchains (plugin) to build your maven project with an older JDK.
ERROR: Retrying with agent Java and setting compile/test properties to point to /home/jenkins/tools/java/latest11.
ERROR: ================================================================================
Established TCP socket on 44337
maven35-agent.jar already up to date
maven35-interceptor.jar already up to date
maven3-interceptor-commons.jar already up to date
[tomee-jakartaee-api-master] $ /usr/local/asfpackages/java/adoptium-jdk-17.0.12+7/bin/java -Xmx1536m -cp /home/jenkins/jenkins-agent/maven35-agent.jar:/home/jenkins/tools/maven/latest/boot/plexus-classworlds-2.12.1.jar:/home/jenkins/tools/maven/latest/conf/logging jenkins.maven3.agent.Maven35Main /home/jenkins/tools/maven/latest /home/jenkins/jenkins-agent/agent.jar /home/jenkins/jenkins-agent/maven35-interceptor.jar /home/jenkins/jenkins-agent/maven3-interceptor-commons.jar 44337
<===[JENKINS REMOTING CAPACITY]===>   channel started
Executing Maven:  -B -f <https://ci-builds.apache.org/job/Tomee/job/tomee-jakartaee-api-master/ws/pom.xml> -U --show-version --fail-at-end clean install deploy -Dfile.encoding=UTF-8
Apache Maven 3.10.0 (c43a36b8d67be7e0805a411bc0898af1a51f5472)
Maven home: /usr/local/asfpackages/maven/apache-maven-3.10.0
Java version: 17.0.12, vendor: Eclipse Adoptium, runtime: /usr/local/asfpackages/java/adoptium-jdk-17.0.12+7
Default locale: en_US, platform encoding: UTF-8, time zone: Etc/UTC
OS name: "linux", version: "5.15.0-187-generic", arch: "amd64", family: "unix"
java.lang.reflect.InvocationTargetException
	at java.base/jdk.internal.reflect.NativeMethodAccessorImpl.invoke0(Native Method)
	at java.base/jdk.internal.reflect.NativeMethodAccessorImpl.invoke(NativeMethodAccessorImpl.java:77)
	at java.base/jdk.internal.reflect.DelegatingMethodAccessorImpl.invoke(DelegatingMethodAccessorImpl.java:43)
	at java.base/java.lang.reflect.Method.invoke(Method.java:569)
	at org.codehaus.plexus.classworlds.launcher.Launcher.launchEnhanced(Launcher.java:255)
	at org.codehaus.plexus.classworlds.launcher.Launcher.launch(Launcher.java:201)
	at jenkins.maven3.agent.Maven35Main.launch(Maven35Main.java:179)
	at java.base/jdk.internal.reflect.NativeMethodAccessorImpl.invoke0(Native Method)
	at java.base/jdk.internal.reflect.NativeMethodAccessorImpl.invoke(NativeMethodAccessorImpl.java:77)
	at java.base/jdk.internal.reflect.DelegatingMethodAccessorImpl.invoke(DelegatingMethodAccessorImpl.java:43)
	at java.base/java.lang.reflect.Method.invoke(Method.java:569)
	at PluginClassLoader for maven-plugin//hudson.maven.Maven3Builder.call(Maven3Builder.java:140)
	at PluginClassLoader for maven-plugin//hudson.maven.Maven3Builder.call(Maven3Builder.java:71)
	at hudson.remoting.UserRequest.perform(UserRequest.java:225)
	at hudson.remoting.UserRequest.perform(UserRequest.java:50)
	at hudson.remoting.Request$2.run(Request.java:391)
	at hudson.remoting.InterceptingExecutorService.lambda$wrap$0(InterceptingExecutorService.java:81)
	at java.base/java.util.concurrent.FutureTask.run(FutureTask.java:264)
	at java.base/java.util.concurrent.ThreadPoolExecutor.runWorker(ThreadPoolExecutor.java:1136)
	at java.base/java.util.concurrent.ThreadPoolExecutor$Worker.run(ThreadPoolExecutor.java:635)
	at java.base/java.lang.Thread.run(Thread.java:840)
Caused by: java.lang.UnsupportedOperationException
	at org.eclipse.sisu.wire.EntryListAdapter$ValueListIterator.add(EntryListAdapter.java:185)
	at java.base/java.util.AbstractSequentialList.add(AbstractSequentialList.java:146)
	at java.base/java.util.AbstractList.add(AbstractList.java:111)
	at java.base/java.util.AbstractCollection.addAll(AbstractCollection.java:336)
	at org.jvnet.hudson.maven3.launcher.Maven35Launcher.main(Maven35Launcher.java:127)
	... 21 more
No mail will be sent out, as 'TomEE » tomee-jakartaee-api-master » Apache TomEE :: Jakarta EE 11 Full API :: Parent #1734' does not have a result yet. Please make sure you set a proper result in case of pipeline/build scripts.
No mail will be sent out, as 'TomEE » tomee-jakartaee-api-master » Apache TomEE :: Jakarta EE 11 Full API :: Signature Tests #1734' does not have a result yet. Please make sure you set a proper result in case of pipeline/build scripts.
No mail will be sent out, as 'TomEE » tomee-jakartaee-api-master » Apache TomEE :: Jakarta EE 11 Full API #1734' does not have a result yet. Please make sure you set a proper result in case of pipeline/build scripts.
ERROR: Failed to parse POMs
java.io.IOException: java.lang.reflect.InvocationTargetException
	at PluginClassLoader for maven-plugin//hudson.maven.Maven3Builder.call(Maven3Builder.java:178)
	at PluginClassLoader for maven-plugin//hudson.maven.Maven3Builder.call(Maven3Builder.java:71)
	at hudson.remoting.UserRequest.perform(UserRequest.java:225)
	at hudson.remoting.UserRequest.perform(UserRequest.java:50)
	at hudson.remoting.Request$2.run(Request.java:391)
	at hudson.remoting.InterceptingExecutorService.lambda$wrap$0(InterceptingExecutorService.java:81)
	at java.base/java.util.concurrent.FutureTask.run(FutureTask.java:264)
	at java.base/java.util.concurrent.ThreadPoolExecutor.runWorker(ThreadPoolExecutor.java:1136)
	at java.base/java.util.concurrent.ThreadPoolExecutor$Worker.run(ThreadPoolExecutor.java:635)
	at java.base/java.lang.Thread.run(Thread.java:840)
	Suppressed: hudson.remoting.Channel$CallSiteStackTrace: Remote call to Channel to Maven [/usr/local/asfpackages/java/adoptium-jdk-17.0.12+7/bin/java, -Xmx1536m, -cp, /home/jenkins/jenkins-agent/maven35-agent.jar:/home/jenkins/tools/maven/latest/boot/plexus-classworlds-2.12.1.jar:/home/jenkins/tools/maven/latest/conf/logging, jenkins.maven3.agent.Maven35Main, /home/jenkins/tools/maven/latest, /home/jenkins/jenkins-agent/agent.jar, /home/jenkins/jenkins-agent/maven35-interceptor.jar, /home/jenkins/jenkins-agent/maven3-interceptor-commons.jar, 44337]
		at hudson.remoting.Channel.attachCallSiteStackTrace(Channel.java:1923)
		at hudson.remoting.UserRequest$ExceptionResponse.retrieve(UserRequest.java:384)
		at hudson.remoting.Channel.call(Channel.java:1112)
		at PluginClassLoader for maven-plugin//hudson.maven.ProcessCache$MavenProcess.call(ProcessCache.java:161)
		at PluginClassLoader for maven-plugin//hudson.maven.MavenModuleSetBuild$MavenModuleSetBuildExecution.doRun(MavenModuleSetBuild.java:877)
		at hudson.model.AbstractBuild$AbstractBuildExecution.run(AbstractBuild.java:527)
		at hudson.model.Run.execute(Run.java:1833)
		at PluginClassLoader for maven-plugin//hudson.maven.MavenModuleSetBuild.run(MavenModuleSetBuild.java:543)
		at hudson.model.ResourceController.execute(ResourceController.java:101)
		at hudson.model.Executor.run(Executor.java:446)
Caused by: java.lang.reflect.InvocationTargetException
	at java.base/jdk.internal.reflect.NativeMethodAccessorImpl.invoke0(Native Method)
	at java.base/jdk.internal.reflect.NativeMethodAccessorImpl.invoke(NativeMethodAccessorImpl.java:77)
	at java.base/jdk.internal.reflect.DelegatingMethodAccessorImpl.invoke(DelegatingMethodAccessorImpl.java:43)
	at java.base/java.lang.reflect.Method.invoke(Method.java:569)
	at PluginClassLoader for maven-plugin//hudson.maven.Maven3Builder.call(Maven3Builder.java:140)
	... 9 more
Caused by: java.lang.Exception: java.lang.reflect.InvocationTargetException
	at jenkins.maven3.agent.Maven35Main.launch(Maven35Main.java:182)
	... 14 more
Caused by: java.lang.reflect.InvocationTargetException
	at java.base/jdk.internal.reflect.NativeMethodAccessorImpl.invoke0(Native Method)
	at java.base/jdk.internal.reflect.NativeMethodAccessorImpl.invoke(NativeMethodAccessorImpl.java:77)
	at java.base/jdk.internal.reflect.DelegatingMethodAccessorImpl.invoke(DelegatingMethodAccessorImpl.java:43)
	at java.base/java.lang.reflect.Method.invoke(Method.java:569)
	at org.codehaus.plexus.classworlds.launcher.Launcher.launchEnhanced(Launcher.java:255)
	at org.codehaus.plexus.classworlds.launcher.Launcher.launch(Launcher.java:201)
	at jenkins.maven3.agent.Maven35Main.launch(Maven35Main.java:179)
	... 14 more
Caused by: java.lang.UnsupportedOperationException
	at org.eclipse.sisu.wire.EntryListAdapter$ValueListIterator.add(EntryListAdapter.java:185)
	at java.base/java.util.AbstractSequentialList.add(AbstractSequentialList.java:146)
	at java.base/java.util.AbstractList.add(AbstractList.java:111)
	at java.base/java.util.AbstractCollection.addAll(AbstractCollection.java:336)
	at org.jvnet.hudson.maven3.launcher.Maven35Launcher.main(Maven35Launcher.java:127)
	... 21 more
channel stopped

Build failed in Jenkins: TomEE » tomee-jakartaee-api-master #1733

Posted by Apache Jenkins Server <je...@builds.apache.org>.
See <https://ci-builds.apache.org/job/Tomee/job/tomee-jakartaee-api-master/1733/display/redirect>

Changes:


------------------------------------------
Started by timer
Running as SYSTEM
[EnvInject] - Loading node environment variables.
Building remotely on builds32 (ubuntu) in workspace <https://ci-builds.apache.org/job/Tomee/job/tomee-jakartaee-api-master/ws/>
The recommended git tool is: NONE
No credentials specified
 > git rev-parse --resolve-git-dir <https://ci-builds.apache.org/job/Tomee/job/tomee-jakartaee-api-master/ws/.git> # timeout=10
Fetching changes from the remote Git repository
 > git config remote.origin.url https://github.com/apache/tomee-jakartaee-api # timeout=10
Cleaning workspace
 > git rev-parse --verify HEAD # timeout=10
Resetting working tree
 > git reset --hard # timeout=10
 > git clean -fdx # timeout=10
Fetching upstream changes from https://github.com/apache/tomee-jakartaee-api
 > git --version # timeout=10
 > git --version # 'git version 2.34.1'
 > git fetch --tags --force --progress -- https://github.com/apache/tomee-jakartaee-api +refs/heads/*:refs/remotes/origin/* # timeout=10
 > git rev-parse refs/remotes/origin/main^{commit} # timeout=10
Checking out Revision c531599fb0d0f9bdb326e28cff23baaaf65af5f5 (refs/remotes/origin/main)
 > git config core.sparsecheckout # timeout=10
 > git checkout -f c531599fb0d0f9bdb326e28cff23baaaf65af5f5 # timeout=10
Commit message: "[maven-release-plugin] prepare for next development iteration"
 > git rev-list --no-walk c531599fb0d0f9bdb326e28cff23baaaf65af5f5 # timeout=10
Parsing POMs
Established TCP socket on 42657
maven35-agent.jar already up to date
maven35-interceptor.jar already up to date
maven3-interceptor-commons.jar already up to date
[tomee-jakartaee-api-master] $ /home/jenkins/tools/java/latest11/bin/java -Xmx1536m -cp /home/jenkins/jenkins-agent/maven35-agent.jar:/home/jenkins/tools/maven/latest/boot/plexus-classworlds-2.11.0.jar:/home/jenkins/tools/maven/latest/conf/logging jenkins.maven3.agent.Maven35Main /home/jenkins/tools/maven/latest /home/jenkins/jenkins-agent/agent.jar /home/jenkins/jenkins-agent/maven35-interceptor.jar /home/jenkins/jenkins-agent/maven3-interceptor-commons.jar 42657
<===[JENKINS REMOTING CAPACITY]===>   channel started
Oct 22, 2026 12:19:15 PM hudson.remoting.UserRequest perform
WARNING: LinkageError while performing UserRequest:hudson.maven.AbstractMavenProcessFactory$ConfigureOriginalJDK@4e0de2
java.lang.UnsupportedClassVersionError: Failed to load hudson.maven.AbstractMavenProcessFactory$ConfigureOriginalJDK
	at hudson.remoting.RemoteClassLoader.loadClassFile(RemoteClassLoader.java:472)
	at hudson.remoting.RemoteClassLoader.loadRemoteClass(RemoteClassLoader.java:301)
	at hudson.remoting.RemoteClassLoader.loadWithMultiClassLoader(RemoteClassLoader.java:277)
	at hudson.remoting.RemoteClassLoader.findClass(RemoteClassLoader.java:236)
	at java.base/java.lang.ClassLoader.loadClass(ClassLoader.java:594)
	at java.base/java.lang.ClassLoader.loadClass(ClassLoader.java:527)
	at java.base/java.lang.Class.forName0(Native Method)
	at java.base/java.lang.Class.forName(Class.java:398)
	at hudson.remoting.MultiClassLoaderSerializer$Input.resolveClass(MultiClassLoaderSerializer.java:133)
	at java.base/java.io.ObjectInputStream.readNonProxyDesc(ObjectInputStream.java:2003)
	at java.base/java.io.ObjectInputStream.readClassDesc(ObjectInputStream.java:1870)
	at java.base/java.io.ObjectInputStream.readOrdinaryObject(ObjectInputStream.java:2201)
	at java.base/java.io.ObjectInputStream.readObject0(ObjectInputStream.java:1687)
	at java.base/java.io.ObjectInputStream.readObject(ObjectInputStream.java:489)
	at java.base/java.io.ObjectInputStream.readObject(ObjectInputStream.java:447)
	at hudson.remoting.UserRequest.deserialize(UserRequest.java:312)
	at hudson.remoting.UserRequest.perform(UserRequest.java:196)
	at hudson.remoting.UserRequest.perform(UserRequest.java:50)
	at hudson.remoting.Request$2.run(Request.java:391)
	at hudson.remoting.InterceptingExecutorService.lambda$wrap$0(InterceptingExecutorService.java:81)
	at java.base/java.util.concurrent.FutureTask.run(FutureTask.java:264)
	at java.base/java.util.concurrent.ThreadPoolExecutor.runWorker(ThreadPoolExecutor.java:1128)
	at java.base/java.util.concurrent.ThreadPoolExecutor$Worker.run(ThreadPoolExecutor.java:628)
	at java.base/java.lang.Thread.run(Thread.java:829)
Caused by: java.lang.UnsupportedClassVersionError: Failed to load jenkins.security.MasterToSlaveCallable
	at hudson.remoting.RemoteClassLoader.loadClassFile(RemoteClassLoader.java:472)
	at hudson.remoting.RemoteClassLoader.loadRemoteClass(RemoteClassLoader.java:301)
	at hudson.remoting.RemoteClassLoader.loadWithMultiClassLoader(RemoteClassLoader.java:277)
	at hudson.remoting.RemoteClassLoader.findClass(RemoteClassLoader.java:236)
	at java.base/java.lang.ClassLoader.loadClass(ClassLoader.java:594)
	at java.base/java.lang.ClassLoader.loadClass(ClassLoader.java:527)
	at java.base/java.lang.ClassLoader.defineClass1(Native Method)
	at java.base/java.lang.ClassLoader.defineClass(ClassLoader.java:1022)
	at java.base/java.lang.ClassLoader.defineClass(ClassLoader.java:883)
	at hudson.remoting.RemoteClassLoader.loadClassFile(RemoteClassLoader.java:470)
	... 23 more
Caused by: java.lang.UnsupportedClassVersionError: jenkins/security/MasterToSlaveCallable has been compiled by a more recent version of the Java Runtime (class file version 61.0), this version of the Java Runtime only recognizes class file versions up to 55.0
	at java.base/java.lang.ClassLoader.defineClass1(Native Method)
	at java.base/java.lang.ClassLoader.defineClass(ClassLoader.java:1022)
	at java.base/java.lang.ClassLoader.defineClass(ClassLoader.java:883)
	at hudson.remoting.RemoteClassLoader.loadClassFile(RemoteClassLoader.java:470)
	... 32 more

ERROR: ================================================================================
ERROR: Invalid project setup: Failed to load hudson.maven.AbstractMavenProcessFactory$ConfigureOriginalJDK
ERROR: [JENKINS-18403][JENKINS-28294] JDK 'jdk_11_latest' not supported to run Maven projects.
ERROR: Maven projects have to be launched with a Java version greater or equal to the minimum version required by the controller.
ERROR: Use the Maven JDK Toolchains (plugin) to build your maven project with an older JDK.
ERROR: Retrying with agent Java and setting compile/test properties to point to /home/jenkins/tools/java/latest11.
ERROR: ================================================================================
Established TCP socket on 33035
maven35-agent.jar already up to date
maven35-interceptor.jar already up to date
maven3-interceptor-commons.jar already up to date
[tomee-jakartaee-api-master] $ /usr/local/asfpackages/java/adoptium-jdk-17.0.12+7/bin/java -Xmx1536m -cp /home/jenkins/jenkins-agent/maven35-agent.jar:/home/jenkins/tools/maven/latest/boot/plexus-classworlds-2.11.0.jar:/home/jenkins/tools/maven/latest/conf/logging jenkins.maven3.agent.Maven35Main /home/jenkins/tools/maven/latest /home/jenkins/jenkins-agent/agent.jar /home/jenkins/jenkins-agent/maven35-interceptor.jar /home/jenkins/jenkins-agent/maven3-interceptor-commons.jar 33035
<===[JENKINS REMOTING CAPACITY]===>   channel started
Executing Maven:  -B -f <https://ci-builds.apache.org/job/Tomee/job/tomee-jakartaee-api-master/ws/pom.xml> -U --show-version --fail-at-end clean install deploy -Dfile.encoding=UTF-8
Apache Maven 3.9.16 (2bdd9fddda4b155ebf8000e807eb73fd829a51d5)
Maven home: /usr/local/asfpackages/maven/apache-maven-3.9.16
Java version: 17.0.12, vendor: Eclipse Adoptium, runtime: /usr/local/asfpackages/java/adoptium-jdk-17.0.12+7
Default locale: en_US, platform encoding: UTF-8
OS name: "linux", version: "5.15.0-187-generic", arch: "amd64", family: "unix"
[INFO] Scanning for projects...
[HUDSON] Collecting dependencies info
[HUDSON] Collecting dependencies info
[HUDSON] Collecting dependencies info
[INFO] ------------------------------------------------------------------------
[INFO] Reactor Build Order:
[INFO] 
[INFO] Apache TomEE :: Jakarta EE 11 Full API :: Parent                   [pom]
[INFO] Apache TomEE :: Jakarta EE 11 Full API                             [jar]
[INFO] Apache TomEE :: Jakarta EE 11 Full API :: Signature Tests          [pom]
[INFO] 
[INFO] ---------------< org.apache.tomee:jakartaee-api-parent >----------------
[INFO] Building Apache TomEE :: Jakarta EE 11 Full API :: Parent 11.0.0-M2-SNAPSHOT [1/3]
[INFO]   from pom.xml
[INFO] --------------------------------[ pom ]---------------------------------
[INFO] 
[INFO] --- clean:3.5.0:clean (default-clean) @ jakartaee-api-parent ---
[INFO] 
[INFO] --- enforcer:3.6.2:enforce (enforce-maven-version) @ jakartaee-api-parent ---
[INFO] Rule 0: org.apache.maven.enforcer.rules.version.RequireMavenVersion passed
[INFO] 
[INFO] --- enforcer:3.6.2:enforce (enforce-java-version) @ jakartaee-api-parent ---
[INFO] Rule 0: org.apache.maven.enforcer.rules.version.RequireJavaVersion passed
[INFO] 
[INFO] --- remote-resources:3.3.0:process (process-resource-bundles) @ jakartaee-api-parent ---
[INFO] Preparing remote bundle org.apache.apache.resources:apache-jar-resource-bundle:1.8
[INFO] Copying 3 resources from 1 bundle.
[INFO] 
[INFO] --- install:3.1.4:install (default-install) @ jakartaee-api-parent ---
[INFO] Installing <https://ci-builds.apache.org/job/Tomee/job/tomee-jakartaee-api-master/ws/pom.xml> to /home/jenkins/.m2/repository/org/apache/tomee/jakartaee-api-parent/11.0.0-M2-SNAPSHOT/jakartaee-api-parent-11.0.0-M2-SNAPSHOT.pom
[INFO] 
[INFO] --- enforcer:3.6.2:enforce (enforce-maven-version) @ jakartaee-api-parent ---
[INFO] 
[INFO] --- enforcer:3.6.2:enforce (enforce-java-version) @ jakartaee-api-parent ---
[INFO] 
[INFO] --- remote-resources:3.3.0:process (process-resource-bundles) @ jakartaee-api-parent ---
[INFO] Preparing remote bundle org.apache.apache.resources:apache-jar-resource-bundle:1.8
[INFO] Copying 3 resources from 1 bundle.
[INFO] 
[INFO] --- install:3.1.4:install (default-install) @ jakartaee-api-parent ---
[INFO] Installing <https://ci-builds.apache.org/job/Tomee/job/tomee-jakartaee-api-master/ws/pom.xml> to /home/jenkins/.m2/repository/org/apache/tomee/jakartaee-api-parent/11.0.0-M2-SNAPSHOT/jakartaee-api-parent-11.0.0-M2-SNAPSHOT.pom
[INFO] 
[INFO] --- deploy:3.1.4:deploy (default-deploy) @ jakartaee-api-parent ---
[INFO] Downloading from apache.snapshots.https: https://repository.apache.org/content/repositories/snapshots/org/apache/tomee/jakartaee-api-parent/11.0.0-M2-SNAPSHOT/maven-metadata.xml
[INFO] Downloaded from apache.snapshots.https: https://repository.apache.org/content/repositories/snapshots/org/apache/tomee/jakartaee-api-parent/11.0.0-M2-SNAPSHOT/maven-metadata.xml (625 B at 668 B/s)
[INFO] Uploading to apache.snapshots.https: https://repository.apache.org/content/repositories/snapshots/org/apache/tomee/jakartaee-api-parent/11.0.0-M2-SNAPSHOT/jakartaee-api-parent-11.0.0-M2-20261022.121947-270.pom
[INFO] Uploaded to apache.snapshots.https: https://repository.apache.org/content/repositories/snapshots/org/apache/tomee/jakartaee-api-parent/11.0.0-M2-SNAPSHOT/jakartaee-api-parent-11.0.0-M2-20261022.121947-270.pom (2.3 kB at 2.2 kB/s)
[INFO] Downloading from apache.snapshots.https: https://repository.apache.org/content/repositories/snapshots/org/apache/tomee/jakartaee-api-parent/maven-metadata.xml
[INFO] Downloaded from apache.snapshots.https: https://repository.apache.org/content/repositories/snapshots/org/apache/tomee/jakartaee-api-parent/maven-metadata.xml (527 B at 2.7 kB/s)
[INFO] Uploading to apache.snapshots.https: https://repository.apache.org/content/repositories/snapshots/org/apache/tomee/jakartaee-api-parent/11.0.0-M2-SNAPSHOT/maven-metadata.xml
[INFO] Uploaded to apache.snapshots.https: https://repository.apache.org/content/repositories/snapshots/org/apache/tomee/jakartaee-api-parent/11.0.0-M2-SNAPSHOT/maven-metadata.xml (625 B at 595 B/s)
[INFO] Uploading to apache.snapshots.https: https://repository.apache.org/content/repositories/snapshots/org/apache/tomee/jakartaee-api-parent/maven-metadata.xml
[INFO] Uploaded to apache.snapshots.https: https://repository.apache.org/content/repositories/snapshots/org/apache/tomee/jakartaee-api-parent/maven-metadata.xml (527 B at 502 B/s)
[WARNING] Attempt to (de-)serialize anonymous class org.jfrog.hudson.maven2.MavenDependenciesRecorder$1; see: https://jenkins.io/redirect/serialization-of-anonymous-classes/
[INFO] 
[INFO] -------------------< org.apache.tomee:jakartaee-api >-------------------
[INFO] Building Apache TomEE :: Jakarta EE 11 Full API 11.0.0-M2-SNAPSHOT [2/3]
[INFO]   from api/pom.xml
[INFO] --------------------------------[ jar ]---------------------------------
[INFO] 
[INFO] --- clean:3.1.0:clean (default-clean) @ jakartaee-api ---
[INFO] 
[INFO] --- enforcer:3.6.2:enforce (enforce-maven-version) @ jakartaee-api ---
[INFO] 
[INFO] --- enforcer:3.6.2:enforce (enforce-java-version) @ jakartaee-api ---
[INFO] 
[INFO] --- remote-resources:3.3.0:process (process-resource-bundles) @ jakartaee-api ---
[INFO] Preparing remote bundle org.apache.apache.resources:apache-jar-resource-bundle:1.8
[INFO] Copying 3 resources from 1 bundle.
[INFO] 
[INFO] --- resources:3.5.0:resources (default-resources) @ jakartaee-api ---
[INFO] Copying 1 resource from src/main/resources to target/classes
[INFO] Copying 1 resource from src/main/filtered-resources to target/classes
[INFO] Copying 3 resources from target/maven-shared-archive-resources to target/classes
[INFO] 
[INFO] --- compiler:3.8.1:compile (default-compile) @ jakartaee-api ---
[INFO] Changes detected - recompiling the module!
[INFO] Compiling 2 source files to <https://ci-builds.apache.org/job/Tomee/job/tomee-jakartaee-api-master/ws/api/target/classes>
[INFO] -------------------------------------------------------------
[ERROR] COMPILATION ERROR : 
[INFO] -------------------------------------------------------------
[ERROR] error: release version 17 not supported
[INFO] 1 error
[INFO] -------------------------------------------------------------
[INFO] 
[INFO] -----------------< org.apache.tomee:jakartaee-api-tck >-----------------
[INFO] Building Apache TomEE :: Jakarta EE 11 Full API :: Signature Tests 11.0.0-M2-SNAPSHOT [3/3]
[INFO]   from tck/pom.xml
[INFO] --------------------------------[ pom ]---------------------------------
[INFO] 
[INFO] --- clean:3.5.0:clean (default-clean) @ jakartaee-api-tck ---
[INFO] 
[INFO] --- enforcer:3.6.2:enforce (enforce-maven-version) @ jakartaee-api-tck ---
[INFO] 
[INFO] --- enforcer:3.6.2:enforce (enforce-java-version) @ jakartaee-api-tck ---
[INFO] 
[INFO] --- dependency:3.10.0:unpack (unpack-classes) @ jakartaee-api-tck ---
[INFO] ------------------------------------------------------------------------
[INFO] Reactor Summary for Apache TomEE :: Jakarta EE 11 Full API :: Parent 11.0.0-M2-SNAPSHOT:
[INFO] 
[INFO] Apache TomEE :: Jakarta EE 11 Full API :: Parent ... SUCCESS [ 16.329 s]
[INFO] Apache TomEE :: Jakarta EE 11 Full API ............. FAILURE [  5.440 s]
[INFO] Apache TomEE :: Jakarta EE 11 Full API :: Signature Tests FAILURE [  3.220 s]
[INFO] ------------------------------------------------------------------------
[INFO] BUILD FAILURE
[INFO] ------------------------------------------------------------------------
[INFO] Total time:  38.952 s
[INFO] Finished at: 2026-10-22T12:20:26Z
[INFO] ------------------------------------------------------------------------
Waiting for Jenkins to finish collecting data
[ERROR] Failed to execute goal org.apache.maven.plugins:maven-compiler-plugin:3.8.1:compile (default-compile) on project jakartaee-api: Compilation failure
[ERROR] error: release version 17 not supported
[ERROR] -> [Help 1]
[ERROR] Failed to execute goal org.apache.maven.plugins:maven-dependency-plugin:3.10.0:unpack (unpack-classes) on project jakartaee-api-tck: Unable to find/resolve artifact. The following artifacts could not be resolved: org.apache.tomee:jakartaee-api:jar:11.0.0-M2-SNAPSHOT (absent): Could not find artifact org.apache.tomee:jakartaee-api:jar:11.0.0-M2-SNAPSHOT -> [Help 2]
[ERROR] 
[ERROR] To see the full stack trace of the errors, re-run Maven with the -e switch.
[ERROR] Re-run Maven using the -X switch to enable full debug logging.
[ERROR] 
[ERROR] For more information about the errors and possible solutions, please read the following articles:
[ERROR] [Help 1] http://cwiki.apache.org/confluence/display/MAVEN/MojoFailureException
[ERROR] [Help 2] http://cwiki.apache.org/confluence/display/MAVEN/MojoExecutionException
[ERROR] 
[ERROR] After correcting the problems, you can resume the build with the command
[ERROR]   mvn <goals> -rf :jakartaee-api
[JENKINS] Archiving <https://ci-builds.apache.org/job/Tomee/job/tomee-jakartaee-api-master/ws/pom.xml> to org.apache.tomee/jakartaee-api-parent/11.0.0-M2-SNAPSHOT/jakartaee-api-parent-11.0.0-M2-SNAPSHOT.pom
[JENKINS] Archiving <https://ci-builds.apache.org/job/Tomee/job/tomee-jakartaee-api-master/ws/api/pom.xml> to org.apache.tomee/jakartaee-api/11.0.0-M2-SNAPSHOT/jakartaee-api-11.0.0-M2-SNAPSHOT.pom
[JENKINS] Archiving <https://ci-builds.apache.org/job/Tomee/job/tomee-jakartaee-api-master/ws/tck/pom.xml> to org.apache.tomee/jakartaee-api-tck/11.0.0-M2-SNAPSHOT/jakartaee-api-tck-11.0.0-M2-SNAPSHOT.pom
Sending e-mails to: commits@tomee.apache.org
Sending e-mails to: commits@tomee.apache.org
channel stopped

Build failed in Jenkins: TomEE » tomee-jakartaee-api-master #1732

Posted by Apache Jenkins Server <je...@builds.apache.org>.
See <https://ci-builds.apache.org/job/Tomee/job/tomee-jakartaee-api-master/1732/display/redirect>

Changes:


------------------------------------------
[...truncated 57.02 KiB...]
Check mode: src [throws normalized]
Constant checking: on

Warning: incorrect classpath parameter: <https://ci-builds.apache.org/job/Tomee/job/tomee-jakartaee-api-master/ws/tck/target/classes> (<https://ci-builds.apache.org/job/Tomee/job/tomee-jakartaee-api-master/ws/tck/target/classes).> This directory or jar file will be ignored!


[INFO] <https://ci-builds.apache.org/job/Tomee/job/tomee-jakartaee-api-master/ws/tck/target/surefire-reports/sigtest/TEST-jakartaee-api-tck-11.0.0-M2-SNAPSHOT.xml>: 0 failures in <https://ci-builds.apache.org/job/Tomee/job/tomee-jakartaee-api-master/ws/tck/target/jakartaeetck/src/tcks/profiles/platform/signaturevalidation/src/main/java/com/sun/ts/tests/signaturetest/jakarta.interceptor.sig>
[INFO] 
[INFO] --- sigtest:2.3:check (check-jakarta-jms) @ jakartaee-api-tck ---
[INFO] Packages: jakarta.jms.**
[INFO] SignatureTest.args: [-FileName, <https://ci-builds.apache.org/job/Tomee/job/tomee-jakartaee-api-master/ws/tck/target/jakartaeetck/src/tcks/profiles/platform/signaturevalidation/src/main/java/com/sun/ts/tests/signaturetest/jakarta.jms.sig,> -static, -ApiVersion, 11.0.0-M2-SNAPSHOT, -IgnoreJDKClass, -Package, jakarta.jms, -BootCP, 17, -Classpath, <https://ci-builds.apache.org/job/Tomee/job/tomee-jakartaee-api-master/ws/tck/target/dependency>:<https://ci-builds.apache.org/job/Tomee/job/tomee-jakartaee-api-master/ws/tck/target/classes]>
[INFO] SignatureTest report
Base version: 3.1
Tested version: 11.0.0-M2-SNAPSHOT
Check mode: src [throws normalized]
Constant checking: on

Warning: incorrect classpath parameter: <https://ci-builds.apache.org/job/Tomee/job/tomee-jakartaee-api-master/ws/tck/target/classes> (<https://ci-builds.apache.org/job/Tomee/job/tomee-jakartaee-api-master/ws/tck/target/classes).> This directory or jar file will be ignored!


[INFO] <https://ci-builds.apache.org/job/Tomee/job/tomee-jakartaee-api-master/ws/tck/target/surefire-reports/sigtest/TEST-jakartaee-api-tck-11.0.0-M2-SNAPSHOT.xml>: 0 failures in <https://ci-builds.apache.org/job/Tomee/job/tomee-jakartaee-api-master/ws/tck/target/jakartaeetck/src/tcks/profiles/platform/signaturevalidation/src/main/java/com/sun/ts/tests/signaturetest/jakarta.jms.sig>
[INFO] 
[INFO] --- sigtest:2.3:check (check-jakarta-json-bind) @ jakartaee-api-tck ---
[INFO] Packages: jakarta.json.bind.**
[INFO] SignatureTest.args: [-FileName, <https://ci-builds.apache.org/job/Tomee/job/tomee-jakartaee-api-master/ws/tck/target/jakartaeetck/src/tcks/profiles/platform/signaturevalidation/src/main/java/com/sun/ts/tests/signaturetest/jakarta.json.bind.sig,> -static, -ApiVersion, 11.0.0-M2-SNAPSHOT, -IgnoreJDKClass, -Package, jakarta.json.bind, -BootCP, 17, -Classpath, <https://ci-builds.apache.org/job/Tomee/job/tomee-jakartaee-api-master/ws/tck/target/dependency>:<https://ci-builds.apache.org/job/Tomee/job/tomee-jakartaee-api-master/ws/tck/target/classes]>
[INFO] SignatureTest report
Base version: 3.0
Tested version: 11.0.0-M2-SNAPSHOT
Check mode: src [throws normalized]
Constant checking: on

Warning: incorrect classpath parameter: <https://ci-builds.apache.org/job/Tomee/job/tomee-jakartaee-api-master/ws/tck/target/classes> (<https://ci-builds.apache.org/job/Tomee/job/tomee-jakartaee-api-master/ws/tck/target/classes).> This directory or jar file will be ignored!


[INFO] <https://ci-builds.apache.org/job/Tomee/job/tomee-jakartaee-api-master/ws/tck/target/surefire-reports/sigtest/TEST-jakartaee-api-tck-11.0.0-M2-SNAPSHOT.xml>: 0 failures in <https://ci-builds.apache.org/job/Tomee/job/tomee-jakartaee-api-master/ws/tck/target/jakartaeetck/src/tcks/profiles/platform/signaturevalidation/src/main/java/com/sun/ts/tests/signaturetest/jakarta.json.bind.sig>
[INFO] 
[INFO] --- sigtest:2.3:check (check-jakarta-json) @ jakartaee-api-tck ---
[INFO] Packages: jakarta.json
[INFO] SignatureTest.args: [-FileName, <https://ci-builds.apache.org/job/Tomee/job/tomee-jakartaee-api-master/ws/tck/target/jakartaeetck/src/tcks/profiles/platform/signaturevalidation/src/main/java/com/sun/ts/tests/signaturetest/jakarta.json.sig,> -static, -ApiVersion, 11.0.0-M2-SNAPSHOT, -IgnoreJDKClass, -PackageWithoutSubpackages, jakarta.json, -BootCP, 17, -Classpath, <https://ci-builds.apache.org/job/Tomee/job/tomee-jakartaee-api-master/ws/tck/target/dependency>:<https://ci-builds.apache.org/job/Tomee/job/tomee-jakartaee-api-master/ws/tck/target/classes]>
[INFO] SignatureTest report
Base version: 2.1
Tested version: 11.0.0-M2-SNAPSHOT
Check mode: src [throws normalized]
Constant checking: on

Warning: incorrect classpath parameter: <https://ci-builds.apache.org/job/Tomee/job/tomee-jakartaee-api-master/ws/tck/target/classes> (<https://ci-builds.apache.org/job/Tomee/job/tomee-jakartaee-api-master/ws/tck/target/classes).> This directory or jar file will be ignored!


[INFO] <https://ci-builds.apache.org/job/Tomee/job/tomee-jakartaee-api-master/ws/tck/target/surefire-reports/sigtest/TEST-jakartaee-api-tck-11.0.0-M2-SNAPSHOT.xml>: 0 failures in <https://ci-builds.apache.org/job/Tomee/job/tomee-jakartaee-api-master/ws/tck/target/jakartaeetck/src/tcks/profiles/platform/signaturevalidation/src/main/java/com/sun/ts/tests/signaturetest/jakarta.json.sig>
[INFO] 
[INFO] --- sigtest:2.3:check (check-jakarta-persistence) @ jakartaee-api-tck ---
[INFO] Packages: jakarta.persistence.**
[INFO] SignatureTest.args: [-FileName, <https://ci-builds.apache.org/job/Tomee/job/tomee-jakartaee-api-master/ws/tck/target/jakartaeetck/src/tcks/profiles/platform/signaturevalidation/src/main/java/com/sun/ts/tests/signaturetest/jakarta.persistence.sig,> -static, -ApiVersion, 11.0.0-M2-SNAPSHOT, -IgnoreJDKClass, -Package, jakarta.persistence, -BootCP, 17, -Classpath, <https://ci-builds.apache.org/job/Tomee/job/tomee-jakartaee-api-master/ws/tck/target/dependency>:<https://ci-builds.apache.org/job/Tomee/job/tomee-jakartaee-api-master/ws/tck/target/classes]>
[INFO] SignatureTest report
Base version: 3.2
Tested version: 11.0.0-M2-SNAPSHOT
Check mode: src [throws normalized]
Constant checking: on

Warning: incorrect classpath parameter: <https://ci-builds.apache.org/job/Tomee/job/tomee-jakartaee-api-master/ws/tck/target/classes> (<https://ci-builds.apache.org/job/Tomee/job/tomee-jakartaee-api-master/ws/tck/target/classes).> This directory or jar file will be ignored!


[INFO] <https://ci-builds.apache.org/job/Tomee/job/tomee-jakartaee-api-master/ws/tck/target/surefire-reports/sigtest/TEST-jakartaee-api-tck-11.0.0-M2-SNAPSHOT.xml>: 0 failures in <https://ci-builds.apache.org/job/Tomee/job/tomee-jakartaee-api-master/ws/tck/target/jakartaeetck/src/tcks/profiles/platform/signaturevalidation/src/main/java/com/sun/ts/tests/signaturetest/jakarta.persistence.sig>
[INFO] 
[INFO] --- sigtest:2.3:check (check-jakarta-resource) @ jakartaee-api-tck ---
[INFO] Packages: jakarta.resource.**
[INFO] SignatureTest.args: [-FileName, <https://ci-builds.apache.org/job/Tomee/job/tomee-jakartaee-api-master/ws/tck/target/jakartaeetck/src/tcks/profiles/platform/signaturevalidation/src/main/java/com/sun/ts/tests/signaturetest/jakarta.resource.sig,> -static, -ApiVersion, 11.0.0-M2-SNAPSHOT, -IgnoreJDKClass, -Package, jakarta.resource, -BootCP, 17, -Classpath, <https://ci-builds.apache.org/job/Tomee/job/tomee-jakartaee-api-master/ws/tck/target/dependency>:<https://ci-builds.apache.org/job/Tomee/job/tomee-jakartaee-api-master/ws/tck/target/classes]>
[INFO] SignatureTest report
Base version: 2.1
Tested version: 11.0.0-M2-SNAPSHOT
Check mode: src [throws normalized]
Constant checking: on

Warning: incorrect classpath parameter: <https://ci-builds.apache.org/job/Tomee/job/tomee-jakartaee-api-master/ws/tck/target/classes> (<https://ci-builds.apache.org/job/Tomee/job/tomee-jakartaee-api-master/ws/tck/target/classes).> This directory or jar file will be ignored!


[INFO] <https://ci-builds.apache.org/job/Tomee/job/tomee-jakartaee-api-master/ws/tck/target/surefire-reports/sigtest/TEST-jakartaee-api-tck-11.0.0-M2-SNAPSHOT.xml>: 0 failures in <https://ci-builds.apache.org/job/Tomee/job/tomee-jakartaee-api-master/ws/tck/target/jakartaeetck/src/tcks/profiles/platform/signaturevalidation/src/main/java/com/sun/ts/tests/signaturetest/jakarta.resource.sig>
[INFO] 
[INFO] --- sigtest:2.3:check (check-jakarta-security-auth-message) @ jakartaee-api-tck ---
[INFO] Packages: jakarta.security.auth.message.**
[INFO] SignatureTest.args: [-FileName, <https://ci-builds.apache.org/job/Tomee/job/tomee-jakartaee-api-master/ws/tck/target/jakartaeetck/src/tcks/profiles/platform/signaturevalidation/src/main/java/com/sun/ts/tests/signaturetest/jakarta.security.auth.message.sig,> -static, -ApiVersion, 11.0.0-M2-SNAPSHOT, -IgnoreJDKClass, -Package, jakarta.security.auth.message, -BootCP, 17, -Classpath, <https://ci-builds.apache.org/job/Tomee/job/tomee-jakartaee-api-master/ws/tck/target/dependency>:<https://ci-builds.apache.org/job/Tomee/job/tomee-jakartaee-api-master/ws/tck/target/classes]>
[INFO] SignatureTest report
Base version: 3.1
Tested version: 11.0.0-M2-SNAPSHOT
Check mode: src [throws normalized]
Constant checking: on

Warning: incorrect classpath parameter: <https://ci-builds.apache.org/job/Tomee/job/tomee-jakartaee-api-master/ws/tck/target/classes> (<https://ci-builds.apache.org/job/Tomee/job/tomee-jakartaee-api-master/ws/tck/target/classes).> This directory or jar file will be ignored!


[INFO] <https://ci-builds.apache.org/job/Tomee/job/tomee-jakartaee-api-master/ws/tck/target/surefire-reports/sigtest/TEST-jakartaee-api-tck-11.0.0-M2-SNAPSHOT.xml>: 0 failures in <https://ci-builds.apache.org/job/Tomee/job/tomee-jakartaee-api-master/ws/tck/target/jakartaeetck/src/tcks/profiles/platform/signaturevalidation/src/main/java/com/sun/ts/tests/signaturetest/jakarta.security.auth.message.sig>
[INFO] 
[INFO] --- sigtest:2.3:check (check-jakarta-security-enterprise) @ jakartaee-api-tck ---
[INFO] Packages: jakarta.security.enterprise.**
[INFO] SignatureTest.args: [-FileName, <https://ci-builds.apache.org/job/Tomee/job/tomee-jakartaee-api-master/ws/tck/target/jakartaeetck/src/tcks/profiles/platform/signaturevalidation/src/main/java/com/sun/ts/tests/signaturetest/jakarta.security.enterprise.sig,> -static, -ApiVersion, 11.0.0-M2-SNAPSHOT, -IgnoreJDKClass, -Package, jakarta.security.enterprise, -BootCP, 17, -Classpath, <https://ci-builds.apache.org/job/Tomee/job/tomee-jakartaee-api-master/ws/tck/target/dependency>:<https://ci-builds.apache.org/job/Tomee/job/tomee-jakartaee-api-master/ws/tck/target/classes]>
[INFO] SignatureTest report
Base version: 4.0
Tested version: 11.0.0-M2-SNAPSHOT
Check mode: src [throws normalized]
Constant checking: on

Warning: incorrect classpath parameter: <https://ci-builds.apache.org/job/Tomee/job/tomee-jakartaee-api-master/ws/tck/target/classes> (<https://ci-builds.apache.org/job/Tomee/job/tomee-jakartaee-api-master/ws/tck/target/classes).> This directory or jar file will be ignored!


[INFO] <https://ci-builds.apache.org/job/Tomee/job/tomee-jakartaee-api-master/ws/tck/target/surefire-reports/sigtest/TEST-jakartaee-api-tck-11.0.0-M2-SNAPSHOT.xml>: 0 failures in <https://ci-builds.apache.org/job/Tomee/job/tomee-jakartaee-api-master/ws/tck/target/jakartaeetck/src/tcks/profiles/platform/signaturevalidation/src/main/java/com/sun/ts/tests/signaturetest/jakarta.security.enterprise.sig>
[INFO] 
[INFO] --- sigtest:2.3:check (check-jakarta-security-jacc) @ jakartaee-api-tck ---
[INFO] Packages: jakarta.security.jacc.**
[INFO] SignatureTest.args: [-FileName, <https://ci-builds.apache.org/job/Tomee/job/tomee-jakartaee-api-master/ws/tck/target/jakartaeetck/src/tcks/profiles/platform/signaturevalidation/src/main/java/com/sun/ts/tests/signaturetest/jakarta.security.jacc.sig,> -static, -ApiVersion, 11.0.0-M2-SNAPSHOT, -IgnoreJDKClass, -Package, jakarta.security.jacc, -BootCP, 17, -Classpath, <https://ci-builds.apache.org/job/Tomee/job/tomee-jakartaee-api-master/ws/tck/target/dependency>:<https://ci-builds.apache.org/job/Tomee/job/tomee-jakartaee-api-master/ws/tck/target/classes]>
[INFO] SignatureTest report
Base version: 3.0
Tested version: 11.0.0-M2-SNAPSHOT
Check mode: src [throws normalized]
Constant checking: on

Warning: incorrect classpath parameter: <https://ci-builds.apache.org/job/Tomee/job/tomee-jakartaee-api-master/ws/tck/target/classes> (<https://ci-builds.apache.org/job/Tomee/job/tomee-jakartaee-api-master/ws/tck/target/classes).> This directory or jar file will be ignored!


[INFO] <https://ci-builds.apache.org/job/Tomee/job/tomee-jakartaee-api-master/ws/tck/target/surefire-reports/sigtest/TEST-jakartaee-api-tck-11.0.0-M2-SNAPSHOT.xml>: 0 failures in <https://ci-builds.apache.org/job/Tomee/job/tomee-jakartaee-api-master/ws/tck/target/jakartaeetck/src/tcks/profiles/platform/signaturevalidation/src/main/java/com/sun/ts/tests/signaturetest/jakarta.security.jacc.sig>
[INFO] 
[INFO] --- sigtest:2.3:check (check-jakarta-servlet-jsp) @ jakartaee-api-tck ---
[INFO] Packages: jakarta.servlet.jsp.**
[INFO] SignatureTest.args: [-FileName, <https://ci-builds.apache.org/job/Tomee/job/tomee-jakartaee-api-master/ws/tck/target/jakartaeetck/src/tcks/profiles/platform/signaturevalidation/src/main/java/com/sun/ts/tests/signaturetest/jakarta.servlet.jsp.sig,> -static, -ApiVersion, 11.0.0-M2-SNAPSHOT, -IgnoreJDKClass, -Package, jakarta.servlet.jsp, -BootCP, 17, -Classpath, <https://ci-builds.apache.org/job/Tomee/job/tomee-jakartaee-api-master/ws/tck/target/dependency>:<https://ci-builds.apache.org/job/Tomee/job/tomee-jakartaee-api-master/ws/tck/target/classes]>
[INFO] SignatureTest report
Base version: 1.0
Tested version: 11.0.0-M2-SNAPSHOT
Check mode: src [throws normalized]
Constant checking: on

Warning: incorrect classpath parameter: <https://ci-builds.apache.org/job/Tomee/job/tomee-jakartaee-api-master/ws/tck/target/classes> (<https://ci-builds.apache.org/job/Tomee/job/tomee-jakartaee-api-master/ws/tck/target/classes).> This directory or jar file will be ignored!


[INFO] <https://ci-builds.apache.org/job/Tomee/job/tomee-jakartaee-api-master/ws/tck/target/surefire-reports/sigtest/TEST-jakartaee-api-tck-11.0.0-M2-SNAPSHOT.xml>: 0 failures in <https://ci-builds.apache.org/job/Tomee/job/tomee-jakartaee-api-master/ws/tck/target/jakartaeetck/src/tcks/profiles/platform/signaturevalidation/src/main/java/com/sun/ts/tests/signaturetest/jakarta.servlet.jsp.sig>
[INFO] 
[INFO] --- sigtest:2.3:check (check-jakarta-servlet) @ jakartaee-api-tck ---
[INFO] Packages: jakarta.servlet
[INFO] SignatureTest.args: [-FileName, <https://ci-builds.apache.org/job/Tomee/job/tomee-jakartaee-api-master/ws/tck/target/jakartaeetck/src/tcks/profiles/platform/signaturevalidation/src/main/java/com/sun/ts/tests/signaturetest/jakarta.servlet.sig,> -static, -ApiVersion, 11.0.0-M2-SNAPSHOT, -IgnoreJDKClass, -PackageWithoutSubpackages, jakarta.servlet, -BootCP, 17, -Classpath, <https://ci-builds.apache.org/job/Tomee/job/tomee-jakartaee-api-master/ws/tck/target/dependency>:<https://ci-builds.apache.org/job/Tomee/job/tomee-jakartaee-api-master/ws/tck/target/classes]>
[INFO] SignatureTest report
Base version: 6.1
Tested version: 11.0.0-M2-SNAPSHOT
Check mode: src [throws normalized]
Constant checking: on

Warning: incorrect classpath parameter: <https://ci-builds.apache.org/job/Tomee/job/tomee-jakartaee-api-master/ws/tck/target/classes> (<https://ci-builds.apache.org/job/Tomee/job/tomee-jakartaee-api-master/ws/tck/target/classes).> This directory or jar file will be ignored!


[INFO] <https://ci-builds.apache.org/job/Tomee/job/tomee-jakartaee-api-master/ws/tck/target/surefire-reports/sigtest/TEST-jakartaee-api-tck-11.0.0-M2-SNAPSHOT.xml>: 0 failures in <https://ci-builds.apache.org/job/Tomee/job/tomee-jakartaee-api-master/ws/tck/target/jakartaeetck/src/tcks/profiles/platform/signaturevalidation/src/main/java/com/sun/ts/tests/signaturetest/jakarta.servlet.sig>
[INFO] 
[INFO] --- sigtest:2.3:check (check-jakarta-transaction) @ jakartaee-api-tck ---
[INFO] Packages: jakarta.transaction.**
[INFO] SignatureTest.args: [-FileName, <https://ci-builds.apache.org/job/Tomee/job/tomee-jakartaee-api-master/ws/tck/target/jakartaeetck/src/tcks/profiles/platform/signaturevalidation/src/main/java/com/sun/ts/tests/signaturetest/jakarta.transaction.sig,> -static, -ApiVersion, 11.0.0-M2-SNAPSHOT, -IgnoreJDKClass, -Package, jakarta.transaction, -BootCP, 17, -Classpath, <https://ci-builds.apache.org/job/Tomee/job/tomee-jakartaee-api-master/ws/tck/target/dependency>:<https://ci-builds.apache.org/job/Tomee/job/tomee-jakartaee-api-master/ws/tck/target/classes]>
[INFO] SignatureTest report
Base version: 2.0
Tested version: 11.0.0-M2-SNAPSHOT
Check mode: src [throws normalized]
Constant checking: on

Warning: incorrect classpath parameter: <https://ci-builds.apache.org/job/Tomee/job/tomee-jakartaee-api-master/ws/tck/target/classes> (<https://ci-builds.apache.org/job/Tomee/job/tomee-jakartaee-api-master/ws/tck/target/classes).> This directory or jar file will be ignored!


[INFO] <https://ci-builds.apache.org/job/Tomee/job/tomee-jakartaee-api-master/ws/tck/target/surefire-reports/sigtest/TEST-jakartaee-api-tck-11.0.0-M2-SNAPSHOT.xml>: 0 failures in <https://ci-builds.apache.org/job/Tomee/job/tomee-jakartaee-api-master/ws/tck/target/jakartaeetck/src/tcks/profiles/platform/signaturevalidation/src/main/java/com/sun/ts/tests/signaturetest/jakarta.transaction.sig>
[INFO] 
[INFO] --- sigtest:2.3:check (check-jakarta-validation) @ jakartaee-api-tck ---
[INFO] Packages: jakarta.validation.**
[INFO] SignatureTest.args: [-FileName, <https://ci-builds.apache.org/job/Tomee/job/tomee-jakartaee-api-master/ws/tck/target/jakartaeetck/src/tcks/profiles/platform/signaturevalidation/src/main/java/com/sun/ts/tests/signaturetest/jakarta.validation.sig,> -static, -ApiVersion, 11.0.0-M2-SNAPSHOT, -IgnoreJDKClass, -Package, jakarta.validation, -BootCP, 17, -Classpath, <https://ci-builds.apache.org/job/Tomee/job/tomee-jakartaee-api-master/ws/tck/target/dependency>:<https://ci-builds.apache.org/job/Tomee/job/tomee-jakartaee-api-master/ws/tck/target/classes]>
[INFO] SignatureTest report
Base version: 3.1
Tested version: 11.0.0-M2-SNAPSHOT
Check mode: src [throws normalized]
Constant checking: on

Warning: incorrect classpath parameter: <https://ci-builds.apache.org/job/Tomee/job/tomee-jakartaee-api-master/ws/tck/target/classes> (<https://ci-builds.apache.org/job/Tomee/job/tomee-jakartaee-api-master/ws/tck/target/classes).> This directory or jar file will be ignored!


[INFO] <https://ci-builds.apache.org/job/Tomee/job/tomee-jakartaee-api-master/ws/tck/target/surefire-reports/sigtest/TEST-jakartaee-api-tck-11.0.0-M2-SNAPSHOT.xml>: 0 failures in <https://ci-builds.apache.org/job/Tomee/job/tomee-jakartaee-api-master/ws/tck/target/jakartaeetck/src/tcks/profiles/platform/signaturevalidation/src/main/java/com/sun/ts/tests/signaturetest/jakarta.validation.sig>
[INFO] 
[INFO] --- sigtest:2.3:check (check-jakarta-websocket) @ jakartaee-api-tck ---
[INFO] Packages: jakarta.websocket.**
[INFO] SignatureTest.args: [-FileName, <https://ci-builds.apache.org/job/Tomee/job/tomee-jakartaee-api-master/ws/tck/target/jakartaeetck/src/tcks/profiles/platform/signaturevalidation/src/main/java/com/sun/ts/tests/signaturetest/jakarta.websocket.sig,> -static, -ApiVersion, 11.0.0-M2-SNAPSHOT, -IgnoreJDKClass, -Package, jakarta.websocket, -BootCP, 17, -Classpath, <https://ci-builds.apache.org/job/Tomee/job/tomee-jakartaee-api-master/ws/tck/target/dependency>:<https://ci-builds.apache.org/job/Tomee/job/tomee-jakartaee-api-master/ws/tck/target/classes]>
[INFO] SignatureTest report
Base version: 2.2
Tested version: 11.0.0-M2-SNAPSHOT
Check mode: src [throws normalized]
Constant checking: on

Warning: incorrect classpath parameter: <https://ci-builds.apache.org/job/Tomee/job/tomee-jakartaee-api-master/ws/tck/target/classes> (<https://ci-builds.apache.org/job/Tomee/job/tomee-jakartaee-api-master/ws/tck/target/classes).> This directory or jar file will be ignored!


[INFO] <https://ci-builds.apache.org/job/Tomee/job/tomee-jakartaee-api-master/ws/tck/target/surefire-reports/sigtest/TEST-jakartaee-api-tck-11.0.0-M2-SNAPSHOT.xml>: 0 failures in <https://ci-builds.apache.org/job/Tomee/job/tomee-jakartaee-api-master/ws/tck/target/jakartaeetck/src/tcks/profiles/platform/signaturevalidation/src/main/java/com/sun/ts/tests/signaturetest/jakarta.websocket.sig>
[INFO] 
[INFO] --- sigtest:2.3:check (check-jakarta-ws-rs) @ jakartaee-api-tck ---
[INFO] Packages: jakarta.ws.rs.**
[INFO] SignatureTest.args: [-FileName, <https://ci-builds.apache.org/job/Tomee/job/tomee-jakartaee-api-master/ws/tck/target/jakartaeetck/src/tcks/profiles/platform/signaturevalidation/src/main/java/com/sun/ts/tests/signaturetest/jakarta.ws.rs.sig,> -static, -ApiVersion, 11.0.0-M2-SNAPSHOT, -IgnoreJDKClass, -Package, jakarta.ws.rs, -BootCP, 17, -Classpath, <https://ci-builds.apache.org/job/Tomee/job/tomee-jakartaee-api-master/ws/tck/target/dependency>:<https://ci-builds.apache.org/job/Tomee/job/tomee-jakartaee-api-master/ws/tck/target/classes]>
[INFO] SignatureTest report
Base version: 4.0
Tested version: 11.0.0-M2-SNAPSHOT
Check mode: src [throws normalized]
Constant checking: on

Warning: incorrect classpath parameter: <https://ci-builds.apache.org/job/Tomee/job/tomee-jakartaee-api-master/ws/tck/target/classes> (<https://ci-builds.apache.org/job/Tomee/job/tomee-jakartaee-api-master/ws/tck/target/classes).> This directory or jar file will be ignored!


[INFO] <https://ci-builds.apache.org/job/Tomee/job/tomee-jakartaee-api-master/ws/tck/target/surefire-reports/sigtest/TEST-jakartaee-api-tck-11.0.0-M2-SNAPSHOT.xml>: 0 failures in <https://ci-builds.apache.org/job/Tomee/job/tomee-jakartaee-api-master/ws/tck/target/jakartaeetck/src/tcks/profiles/platform/signaturevalidation/src/main/java/com/sun/ts/tests/signaturetest/jakarta.ws.rs.sig>
[INFO] 
[INFO] --- install:3.1.4:install (default-install) @ jakartaee-api-tck ---
[INFO] Installing <https://ci-builds.apache.org/job/Tomee/job/tomee-jakartaee-api-master/ws/tck/pom.xml> to /home/jenkins/.m2/repository/org/apache/tomee/jakartaee-api-tck/11.0.0-M2-SNAPSHOT/jakartaee-api-tck-11.0.0-M2-SNAPSHOT.pom
[INFO] 
[INFO] --- deploy:3.1.4:deploy (default-deploy) @ jakartaee-api-tck ---
[INFO] Downloading from apache.snapshots.https: https://repository.apache.org/content/repositories/snapshots/org/apache/tomee/jakartaee-api-tck/11.0.0-M2-SNAPSHOT/maven-metadata.xml
[INFO] Downloaded from apache.snapshots.https: https://repository.apache.org/content/repositories/snapshots/org/apache/tomee/jakartaee-api-tck/11.0.0-M2-SNAPSHOT/maven-metadata.xml (622 B at 1.1 kB/s)
[INFO] Uploading to apache.snapshots.https: https://repository.apache.org/content/repositories/snapshots/org/apache/tomee/jakartaee-api-tck/11.0.0-M2-SNAPSHOT/jakartaee-api-tck-11.0.0-M2-20261021.121949-143.pom
[INFO] Uploaded to apache.snapshots.https: https://repository.apache.org/content/repositories/snapshots/org/apache/tomee/jakartaee-api-tck/11.0.0-M2-SNAPSHOT/jakartaee-api-tck-11.0.0-M2-20261021.121949-143.pom (22 kB at 17 kB/s)
[INFO] Downloading from apache.snapshots.https: https://repository.apache.org/content/repositories/snapshots/org/apache/tomee/jakartaee-api-tck/maven-metadata.xml
[INFO] Downloaded from apache.snapshots.https: https://repository.apache.org/content/repositories/snapshots/org/apache/tomee/jakartaee-api-tck/maven-metadata.xml (524 B at 2.9 kB/s)
[INFO] Uploading to apache.snapshots.https: https://repository.apache.org/content/repositories/snapshots/org/apache/tomee/jakartaee-api-tck/11.0.0-M2-SNAPSHOT/maven-metadata.xml
[INFO] Uploaded to apache.snapshots.https: https://repository.apache.org/content/repositories/snapshots/org/apache/tomee/jakartaee-api-tck/11.0.0-M2-SNAPSHOT/maven-metadata.xml (622 B at 580 B/s)
[INFO] Uploading to apache.snapshots.https: https://repository.apache.org/content/repositories/snapshots/org/apache/tomee/jakartaee-api-tck/maven-metadata.xml
[INFO] Uploaded to apache.snapshots.https: https://repository.apache.org/content/repositories/snapshots/org/apache/tomee/jakartaee-api-tck/maven-metadata.xml (524 B at 488 B/s)
[INFO] ------------------------------------------------------------------------
[INFO] Reactor Summary for Apache TomEE :: Jakarta EE 11 Full API :: Parent 11.0.0-M2-SNAPSHOT:
[INFO] 
[INFO] Apache TomEE :: Jakarta EE 11 Full API :: Parent ... SUCCESS [ 15.455 s]
[INFO] Apache TomEE :: Jakarta EE 11 Full API ............. FAILURE [  5.513 s]
[INFO] Apache TomEE :: Jakarta EE 11 Full API :: Signature Tests SUCCESS [ 54.725 s]
[INFO] ------------------------------------------------------------------------
[INFO] BUILD FAILURE
[INFO] ------------------------------------------------------------------------
[INFO] Total time:  01:29 min
[INFO] Finished at: 2026-10-21T12:21:19Z
[INFO] ------------------------------------------------------------------------
Waiting for Jenkins to finish collecting data
[ERROR] Failed to execute goal org.apache.maven.plugins:maven-compiler-plugin:3.8.1:compile (default-compile) on project jakartaee-api: Compilation failure
[ERROR] error: release version 17 not supported
[ERROR] -> [Help 1]
[ERROR] 
[ERROR] To see the full stack trace of the errors, re-run Maven with the -e switch.
[ERROR] Re-run Maven using the -X switch to enable full debug logging.
[ERROR] 
[ERROR] For more information about the errors and possible solutions, please read the following articles:
[ERROR] [Help 1] http://cwiki.apache.org/confluence/display/MAVEN/MojoFailureException
[ERROR] 
[ERROR] After correcting the problems, you can resume the build with the command
[ERROR]   mvn <goals> -rf :jakartaee-api
[JENKINS] Archiving <https://ci-builds.apache.org/job/Tomee/job/tomee-jakartaee-api-master/ws/pom.xml> to org.apache.tomee/jakartaee-api-parent/11.0.0-M2-SNAPSHOT/jakartaee-api-parent-11.0.0-M2-SNAPSHOT.pom
[JENKINS] Archiving <https://ci-builds.apache.org/job/Tomee/job/tomee-jakartaee-api-master/ws/api/pom.xml> to org.apache.tomee/jakartaee-api/11.0.0-M2-SNAPSHOT/jakartaee-api-11.0.0-M2-SNAPSHOT.pom
[JENKINS] Archiving <https://ci-builds.apache.org/job/Tomee/job/tomee-jakartaee-api-master/ws/tck/pom.xml> to org.apache.tomee/jakartaee-api-tck/11.0.0-M2-SNAPSHOT/jakartaee-api-tck-11.0.0-M2-SNAPSHOT.pom
Sending e-mails to: commits@tomee.apache.org
Sending e-mails to: commits@tomee.apache.org
channel stopped