You are viewing a plain text version of this content. The canonical link for it is here.
Posted to dev@zookeeper.apache.org by Apache Jenkins Server <je...@builds.apache.org> on 2017/02/22 00:49:48 UTC

ZooKeeper_branch34_jdk8 - Build # 892 - Still Failing

See https://builds.apache.org/job/ZooKeeper_branch34_jdk8/892/

###################################################################################
########################## LAST 60 LINES OF THE CONSOLE ###########################
[...truncated 32.41 MB...]
    [junit] 2017-02-22 00:49:45,074 [myid:] - INFO  [main:SessionTrackerImpl@225] - Shutting down
    [junit] 2017-02-22 00:49:45,074 [myid:] - INFO  [main:PrepRequestProcessor@764] - Shutting down
    [junit] 2017-02-22 00:49:45,075 [myid:] - INFO  [main:SyncRequestProcessor@208] - Shutting down
    [junit] 2017-02-22 00:49:45,075 [myid:] - INFO  [ProcessThread(sid:0 cport:11221)::PrepRequestProcessor@143] - PrepRequestProcessor exited loop!
    [junit] 2017-02-22 00:49:45,075 [myid:] - INFO  [SyncThread:0:SyncRequestProcessor@186] - SyncRequestProcessor exited!
    [junit] 2017-02-22 00:49:45,075 [myid:] - INFO  [main:FinalRequestProcessor@402] - shutdown of request processor complete
    [junit] 2017-02-22 00:49:45,076 [myid:] - INFO  [main:FourLetterWordMain@62] - connecting to 127.0.0.1 11221
    [junit] 2017-02-22 00:49:45,076 [myid:] - INFO  [main:JMXEnv@147] - ensureOnly:[]
    [junit] 2017-02-22 00:49:45,078 [myid:] - INFO  [main:ClientBase@445] - STARTING server
    [junit] 2017-02-22 00:49:45,078 [myid:] - INFO  [main:ClientBase@366] - CREATING server instance 127.0.0.1:11221
    [junit] 2017-02-22 00:49:45,078 [myid:] - INFO  [main:NIOServerCnxnFactory@89] - binding to port 0.0.0.0/0.0.0.0:11221
    [junit] 2017-02-22 00:49:45,079 [myid:] - INFO  [main:ClientBase@341] - STARTING server instance 127.0.0.1:11221
    [junit] 2017-02-22 00:49:45,079 [myid:] - INFO  [main:ZooKeeperServer@173] - Created server with tickTime 3000 minSessionTimeout 6000 maxSessionTimeout 60000 datadir /home/jenkins/jenkins-slave/workspace/ZooKeeper_branch34_jdk8/build/test/tmp/test4820033333377656285.junit.dir/version-2 snapdir /home/jenkins/jenkins-slave/workspace/ZooKeeper_branch34_jdk8/build/test/tmp/test4820033333377656285.junit.dir/version-2
    [junit] 2017-02-22 00:49:45,082 [myid:] - ERROR [main:ZooKeeperServer@472] - ZKShutdownHandler is not registered, so ZooKeeper server won't take any action on ERROR or SHUTDOWN server state changes
    [junit] 2017-02-22 00:49:45,082 [myid:] - INFO  [main:FourLetterWordMain@62] - connecting to 127.0.0.1 11221
    [junit] 2017-02-22 00:49:45,083 [myid:] - INFO  [NIOServerCxn.Factory:0.0.0.0/0.0.0.0:11221:NIOServerCnxnFactory@192] - Accepted socket connection from /127.0.0.1:33819
    [junit] 2017-02-22 00:49:45,083 [myid:] - INFO  [NIOServerCxn.Factory:0.0.0.0/0.0.0.0:11221:NIOServerCnxn@838] - Processing stat command from /127.0.0.1:33819
    [junit] 2017-02-22 00:49:45,083 [myid:] - INFO  [Thread-4:NIOServerCnxn$StatCommand@674] - Stat command output
    [junit] 2017-02-22 00:49:45,084 [myid:] - INFO  [Thread-4:NIOServerCnxn@1019] - Closed socket connection for client /127.0.0.1:33819 (no session established for client)
    [junit] 2017-02-22 00:49:45,084 [myid:] - INFO  [main:JMXEnv@230] - ensureParent:[InMemoryDataTree, StandaloneServer_port]
    [junit] 2017-02-22 00:49:45,086 [myid:] - INFO  [main:JMXEnv@247] - expect:InMemoryDataTree
    [junit] 2017-02-22 00:49:45,086 [myid:] - INFO  [main:JMXEnv@251] - found:InMemoryDataTree org.apache.ZooKeeperService:name0=StandaloneServer_port11221,name1=InMemoryDataTree
    [junit] 2017-02-22 00:49:45,086 [myid:] - INFO  [main:JMXEnv@247] - expect:StandaloneServer_port
    [junit] 2017-02-22 00:49:45,086 [myid:] - INFO  [main:JMXEnv@251] - found:StandaloneServer_port org.apache.ZooKeeperService:name0=StandaloneServer_port11221
    [junit] 2017-02-22 00:49:45,087 [myid:] - INFO  [main:JUnit4ZKTestRunner$LoggedInvokeMethod@58] - Memory used 35517
    [junit] 2017-02-22 00:49:45,087 [myid:] - INFO  [main:JUnit4ZKTestRunner$LoggedInvokeMethod@63] - Number of threads 20
    [junit] 2017-02-22 00:49:45,087 [myid:] - INFO  [main:JUnit4ZKTestRunner$LoggedInvokeMethod@78] - FINISHED TEST METHOD testQuota
    [junit] 2017-02-22 00:49:45,087 [myid:] - INFO  [main:ClientBase@522] - tearDown starting
    [junit] 2017-02-22 00:49:45,158 [myid:] - INFO  [main:ZooKeeper@684] - Session: 0x15a634b9fd80000 closed
    [junit] 2017-02-22 00:49:45,158 [myid:] - INFO  [main:ClientBase@492] - STOPPING server
    [junit] 2017-02-22 00:49:45,158 [myid:] - INFO  [main-EventThread:ClientCnxn$EventThread@519] - EventThread shut down for session: 0x15a634b9fd80000
    [junit] 2017-02-22 00:49:45,159 [myid:] - INFO  [NIOServerCxn.Factory:0.0.0.0/0.0.0.0:11221:NIOServerCnxnFactory@219] - NIOServerCnxn factory exited run method
    [junit] 2017-02-22 00:49:45,159 [myid:] - INFO  [main:ZooKeeperServer@505] - shutting down
    [junit] 2017-02-22 00:49:45,159 [myid:] - ERROR [main:ZooKeeperServer@472] - ZKShutdownHandler is not registered, so ZooKeeper server won't take any action on ERROR or SHUTDOWN server state changes
    [junit] 2017-02-22 00:49:45,159 [myid:] - INFO  [main:SessionTrackerImpl@225] - Shutting down
    [junit] 2017-02-22 00:49:45,160 [myid:] - INFO  [main:PrepRequestProcessor@764] - Shutting down
    [junit] 2017-02-22 00:49:45,160 [myid:] - INFO  [main:SyncRequestProcessor@208] - Shutting down
    [junit] 2017-02-22 00:49:45,160 [myid:] - INFO  [ProcessThread(sid:0 cport:11221)::PrepRequestProcessor@143] - PrepRequestProcessor exited loop!
    [junit] 2017-02-22 00:49:45,160 [myid:] - INFO  [SyncThread:0:SyncRequestProcessor@186] - SyncRequestProcessor exited!
    [junit] 2017-02-22 00:49:45,161 [myid:] - INFO  [main:FinalRequestProcessor@402] - shutdown of request processor complete
    [junit] 2017-02-22 00:49:45,161 [myid:] - INFO  [main:FourLetterWordMain@62] - connecting to 127.0.0.1 11221
    [junit] 2017-02-22 00:49:45,162 [myid:] - INFO  [main:JMXEnv@147] - ensureOnly:[]
    [junit] 2017-02-22 00:49:45,166 [myid:] - INFO  [main:ClientBase@547] - fdcount after test is: 95 at start it was 77
    [junit] 2017-02-22 00:49:45,167 [myid:] - INFO  [main:ClientBase@549] - sleeping for 20 secs
    [junit] 2017-02-22 00:49:45,167 [myid:] - INFO  [main:ZKTestCase$1@65] - SUCCEEDED testQuota
    [junit] 2017-02-22 00:49:45,168 [myid:] - INFO  [main:ZKTestCase$1@60] - FINISHED testQuota
    [junit] Tests run: 1, Failures: 0, Errors: 0, Skipped: 0, Time elapsed: 0.596 sec

fail.build.on.test.failure:

BUILD FAILED
/home/jenkins/jenkins-slave/workspace/ZooKeeper_branch34_jdk8/build.xml:1328: The following error occurred while executing this line:
/home/jenkins/jenkins-slave/workspace/ZooKeeper_branch34_jdk8/build.xml:1331: Tests failed!

Total time: 29 minutes 11 seconds
Build step 'Invoke Ant' marked build as failure
Recording test results
Email was triggered for: Failure - Any
Sending email for trigger: Failure - Any



###################################################################################
############################## FAILED TESTS (if any) ##############################
1 tests failed.
FAILED:  org.apache.zookeeper.server.quorum.auth.QuorumKerberosHostBasedAuthTest.testValidCredentials

Error Message:
waiting for server 0 being up

Stack Trace:
junit.framework.AssertionFailedError: waiting for server 0 being up
	at org.apache.zookeeper.server.quorum.auth.QuorumAuthTestBase.startQuorum(QuorumAuthTestBase.java:74)
	at org.apache.zookeeper.server.quorum.auth.QuorumKerberosHostBasedAuthTest.testValidCredentials(QuorumKerberosHostBasedAuthTest.java:125)
	at org.apache.zookeeper.JUnit4ZKTestRunner$LoggedInvokeMethod.evaluate(JUnit4ZKTestRunner.java:55)



ZooKeeper_branch34_jdk8 - Build # 893 - Still Failing

Posted by Apache Jenkins Server <je...@builds.apache.org>.
See https://builds.apache.org/job/ZooKeeper_branch34_jdk8/893/

###################################################################################
########################## LAST 60 LINES OF THE CONSOLE ###########################
[...truncated 31.17 MB...]
    [junit] 2017-02-22 22:57:48,755 [myid:] - INFO  [main:SessionTrackerImpl@225] - Shutting down
    [junit] 2017-02-22 22:57:48,755 [myid:] - INFO  [main:PrepRequestProcessor@764] - Shutting down
    [junit] 2017-02-22 22:57:48,755 [myid:] - INFO  [main:SyncRequestProcessor@208] - Shutting down
    [junit] 2017-02-22 22:57:48,755 [myid:] - INFO  [ProcessThread(sid:0 cport:11221)::PrepRequestProcessor@143] - PrepRequestProcessor exited loop!
    [junit] 2017-02-22 22:57:48,755 [myid:] - INFO  [SyncThread:0:SyncRequestProcessor@186] - SyncRequestProcessor exited!
    [junit] 2017-02-22 22:57:48,755 [myid:] - INFO  [main:FinalRequestProcessor@402] - shutdown of request processor complete
    [junit] 2017-02-22 22:57:48,755 [myid:] - INFO  [main:FourLetterWordMain@62] - connecting to 127.0.0.1 11221
    [junit] 2017-02-22 22:57:48,756 [myid:] - INFO  [main:JMXEnv@147] - ensureOnly:[]
    [junit] 2017-02-22 22:57:48,757 [myid:] - INFO  [main:ClientBase@445] - STARTING server
    [junit] 2017-02-22 22:57:48,757 [myid:] - INFO  [main:ClientBase@366] - CREATING server instance 127.0.0.1:11221
    [junit] 2017-02-22 22:57:48,757 [myid:] - INFO  [main:NIOServerCnxnFactory@89] - binding to port 0.0.0.0/0.0.0.0:11221
    [junit] 2017-02-22 22:57:48,757 [myid:] - INFO  [main:ClientBase@341] - STARTING server instance 127.0.0.1:11221
    [junit] 2017-02-22 22:57:48,758 [myid:] - INFO  [main:ZooKeeperServer@173] - Created server with tickTime 3000 minSessionTimeout 6000 maxSessionTimeout 60000 datadir /home/jenkins/jenkins-slave/workspace/ZooKeeper_branch34_jdk8/build/test/tmp/test3190633856898099141.junit.dir/version-2 snapdir /home/jenkins/jenkins-slave/workspace/ZooKeeper_branch34_jdk8/build/test/tmp/test3190633856898099141.junit.dir/version-2
    [junit] 2017-02-22 22:57:48,760 [myid:] - ERROR [main:ZooKeeperServer@472] - ZKShutdownHandler is not registered, so ZooKeeper server won't take any action on ERROR or SHUTDOWN server state changes
    [junit] 2017-02-22 22:57:48,760 [myid:] - INFO  [main:FourLetterWordMain@62] - connecting to 127.0.0.1 11221
    [junit] 2017-02-22 22:57:48,760 [myid:] - INFO  [NIOServerCxn.Factory:0.0.0.0/0.0.0.0:11221:NIOServerCnxnFactory@192] - Accepted socket connection from /127.0.0.1:34654
    [junit] 2017-02-22 22:57:48,760 [myid:] - INFO  [NIOServerCxn.Factory:0.0.0.0/0.0.0.0:11221:NIOServerCnxn@838] - Processing stat command from /127.0.0.1:34654
    [junit] 2017-02-22 22:57:48,761 [myid:] - INFO  [Thread-4:NIOServerCnxn$StatCommand@674] - Stat command output
    [junit] 2017-02-22 22:57:48,761 [myid:] - INFO  [Thread-4:NIOServerCnxn@1019] - Closed socket connection for client /127.0.0.1:34654 (no session established for client)
    [junit] 2017-02-22 22:57:48,761 [myid:] - INFO  [main:JMXEnv@230] - ensureParent:[InMemoryDataTree, StandaloneServer_port]
    [junit] 2017-02-22 22:57:48,762 [myid:] - INFO  [main:JMXEnv@247] - expect:InMemoryDataTree
    [junit] 2017-02-22 22:57:48,763 [myid:] - INFO  [main:JMXEnv@251] - found:InMemoryDataTree org.apache.ZooKeeperService:name0=StandaloneServer_port11221,name1=InMemoryDataTree
    [junit] 2017-02-22 22:57:48,763 [myid:] - INFO  [main:JMXEnv@247] - expect:StandaloneServer_port
    [junit] 2017-02-22 22:57:48,763 [myid:] - INFO  [main:JMXEnv@251] - found:StandaloneServer_port org.apache.ZooKeeperService:name0=StandaloneServer_port11221
    [junit] 2017-02-22 22:57:48,763 [myid:] - INFO  [main:JUnit4ZKTestRunner$LoggedInvokeMethod@58] - Memory used 35518
    [junit] 2017-02-22 22:57:48,763 [myid:] - INFO  [main:JUnit4ZKTestRunner$LoggedInvokeMethod@63] - Number of threads 20
    [junit] 2017-02-22 22:57:48,763 [myid:] - INFO  [main:JUnit4ZKTestRunner$LoggedInvokeMethod@78] - FINISHED TEST METHOD testQuota
    [junit] 2017-02-22 22:57:48,764 [myid:] - INFO  [main:ClientBase@522] - tearDown starting
    [junit] 2017-02-22 22:57:48,844 [myid:] - INFO  [main:ZooKeeper@684] - Session: 0x15a680b80620000 closed
    [junit] 2017-02-22 22:57:48,844 [myid:] - INFO  [main:ClientBase@492] - STOPPING server
    [junit] 2017-02-22 22:57:48,844 [myid:] - INFO  [main-EventThread:ClientCnxn$EventThread@519] - EventThread shut down for session: 0x15a680b80620000
    [junit] 2017-02-22 22:57:48,844 [myid:] - INFO  [NIOServerCxn.Factory:0.0.0.0/0.0.0.0:11221:NIOServerCnxnFactory@219] - NIOServerCnxn factory exited run method
    [junit] 2017-02-22 22:57:48,844 [myid:] - INFO  [main:ZooKeeperServer@505] - shutting down
    [junit] 2017-02-22 22:57:48,845 [myid:] - ERROR [main:ZooKeeperServer@472] - ZKShutdownHandler is not registered, so ZooKeeper server won't take any action on ERROR or SHUTDOWN server state changes
    [junit] 2017-02-22 22:57:48,845 [myid:] - INFO  [main:SessionTrackerImpl@225] - Shutting down
    [junit] 2017-02-22 22:57:48,845 [myid:] - INFO  [main:PrepRequestProcessor@764] - Shutting down
    [junit] 2017-02-22 22:57:48,845 [myid:] - INFO  [main:SyncRequestProcessor@208] - Shutting down
    [junit] 2017-02-22 22:57:48,845 [myid:] - INFO  [ProcessThread(sid:0 cport:11221)::PrepRequestProcessor@143] - PrepRequestProcessor exited loop!
    [junit] 2017-02-22 22:57:48,846 [myid:] - INFO  [SyncThread:0:SyncRequestProcessor@186] - SyncRequestProcessor exited!
    [junit] 2017-02-22 22:57:48,846 [myid:] - INFO  [main:FinalRequestProcessor@402] - shutdown of request processor complete
    [junit] 2017-02-22 22:57:48,846 [myid:] - INFO  [main:FourLetterWordMain@62] - connecting to 127.0.0.1 11221
    [junit] 2017-02-22 22:57:48,846 [myid:] - INFO  [main:JMXEnv@147] - ensureOnly:[]
    [junit] 2017-02-22 22:57:48,850 [myid:] - INFO  [main:ClientBase@547] - fdcount after test is: 95 at start it was 77
    [junit] 2017-02-22 22:57:48,850 [myid:] - INFO  [main:ClientBase@549] - sleeping for 20 secs
    [junit] 2017-02-22 22:57:48,851 [myid:] - INFO  [main:ZKTestCase$1@65] - SUCCEEDED testQuota
    [junit] 2017-02-22 22:57:48,851 [myid:] - INFO  [main:ZKTestCase$1@60] - FINISHED testQuota
    [junit] Tests run: 1, Failures: 0, Errors: 0, Skipped: 0, Time elapsed: 0.539 sec

fail.build.on.test.failure:

BUILD FAILED
/home/jenkins/jenkins-slave/workspace/ZooKeeper_branch34_jdk8/build.xml:1328: The following error occurred while executing this line:
/home/jenkins/jenkins-slave/workspace/ZooKeeper_branch34_jdk8/build.xml:1331: Tests failed!

Total time: 28 minutes 46 seconds
Build step 'Invoke Ant' marked build as failure
Recording test results
Email was triggered for: Failure - Any
Sending email for trigger: Failure - Any



###################################################################################
############################## FAILED TESTS (if any) ##############################
3 tests failed.
FAILED:  org.apache.zookeeper.server.quorum.auth.QuorumKerberosHostBasedAuthTest.testConnectBadServer

Error Message:
waiting for server 0 being up

Stack Trace:
junit.framework.AssertionFailedError: waiting for server 0 being up
	at org.apache.zookeeper.server.quorum.auth.QuorumAuthTestBase.startQuorum(QuorumAuthTestBase.java:74)
	at org.apache.zookeeper.server.quorum.auth.QuorumKerberosHostBasedAuthTest.testConnectBadServer(QuorumKerberosHostBasedAuthTest.java:146)
	at org.apache.zookeeper.JUnit4ZKTestRunner$LoggedInvokeMethod.evaluate(JUnit4ZKTestRunner.java:55)


FAILED:  org.apache.zookeeper.test.ReadOnlyModeTest.testSessionEstablishment

Error Message:
KeeperErrorCode = ConnectionLoss for /test

Stack Trace:
org.apache.zookeeper.KeeperException$ConnectionLossException: KeeperErrorCode = ConnectionLoss for /test
	at org.apache.zookeeper.KeeperException.create(KeeperException.java:99)
	at org.apache.zookeeper.KeeperException.create(KeeperException.java:51)
	at org.apache.zookeeper.ZooKeeper.create(ZooKeeper.java:783)
	at org.apache.zookeeper.test.ReadOnlyModeTest.testSessionEstablishment(ReadOnlyModeTest.java:216)
	at org.apache.zookeeper.JUnit4ZKTestRunner$LoggedInvokeMethod.evaluate(JUnit4ZKTestRunner.java:55)


FAILED:  org.apache.zookeeper.server.quorum.auth.QuorumKerberosHostBasedAuthTest.testValidCredentials

Error Message:
waiting for server 0 being up

Stack Trace:
junit.framework.AssertionFailedError: waiting for server 0 being up
	at org.apache.zookeeper.server.quorum.auth.QuorumAuthTestBase.startQuorum(QuorumAuthTestBase.java:74)
	at org.apache.zookeeper.server.quorum.auth.QuorumKerberosHostBasedAuthTest.testValidCredentials(QuorumKerberosHostBasedAuthTest.java:125)
	at org.apache.zookeeper.JUnit4ZKTestRunner$LoggedInvokeMethod.evaluate(JUnit4ZKTestRunner.java:55)