You are viewing a plain text version of this content. The canonical link for it is here.
Posted to dev@lucene.apache.org by Policeman Jenkins Server <je...@thetaphi.de> on 2016/04/15 10:02:51 UTC
[JENKINS] Lucene-Solr-6.0-Windows (32bit/jdk1.8.0_72) - Build # 27
- Failure!
Build: http://jenkins.thetaphi.de/job/Lucene-Solr-6.0-Windows/27/
Java: 32bit/jdk1.8.0_72 -client -XX:+UseParallelGC
2 tests failed.
FAILED: org.apache.solr.cloud.DistribDocExpirationUpdateProcessorTest.test
Error Message:
There are still nodes recoverying - waited for 45 seconds
Stack Trace:
java.lang.AssertionError: There are still nodes recoverying - waited for 45 seconds
at __randomizedtesting.SeedInfo.seed([AB6AEC9DE9E30E85:233ED347471F637D]:0)
at org.junit.Assert.fail(Assert.java:93)
at org.apache.solr.cloud.AbstractDistribZkTestBase.waitForRecoveriesToFinish(AbstractDistribZkTestBase.java:174)
at org.apache.solr.cloud.AbstractFullDistribZkTestBase.waitForRecoveriesToFinish(AbstractFullDistribZkTestBase.java:856)
at org.apache.solr.cloud.DistribDocExpirationUpdateProcessorTest.test(DistribDocExpirationUpdateProcessorTest.java:73)
at sun.reflect.NativeMethodAccessorImpl.invoke0(Native Method)
at sun.reflect.NativeMethodAccessorImpl.invoke(NativeMethodAccessorImpl.java:62)
at sun.reflect.DelegatingMethodAccessorImpl.invoke(DelegatingMethodAccessorImpl.java:43)
at java.lang.reflect.Method.invoke(Method.java:498)
at com.carrotsearch.randomizedtesting.RandomizedRunner.invoke(RandomizedRunner.java:1764)
at com.carrotsearch.randomizedtesting.RandomizedRunner$8.evaluate(RandomizedRunner.java:871)
at com.carrotsearch.randomizedtesting.RandomizedRunner$9.evaluate(RandomizedRunner.java:907)
at com.carrotsearch.randomizedtesting.RandomizedRunner$10.evaluate(RandomizedRunner.java:921)
at org.apache.solr.BaseDistributedSearchTestCase$ShardsRepeatRule$ShardsFixedStatement.callStatement(BaseDistributedSearchTestCase.java:992)
at org.apache.solr.BaseDistributedSearchTestCase$ShardsRepeatRule$ShardsStatement.evaluate(BaseDistributedSearchTestCase.java:967)
at com.carrotsearch.randomizedtesting.rules.SystemPropertiesRestoreRule$1.evaluate(SystemPropertiesRestoreRule.java:57)
at org.apache.lucene.util.TestRuleSetupTeardownChained$1.evaluate(TestRuleSetupTeardownChained.java:49)
at org.apache.lucene.util.AbstractBeforeAfterRule$1.evaluate(AbstractBeforeAfterRule.java:45)
at org.apache.lucene.util.TestRuleThreadAndTestName$1.evaluate(TestRuleThreadAndTestName.java:48)
at org.apache.lucene.util.TestRuleIgnoreAfterMaxFailures$1.evaluate(TestRuleIgnoreAfterMaxFailures.java:64)
at org.apache.lucene.util.TestRuleMarkFailure$1.evaluate(TestRuleMarkFailure.java:47)
at com.carrotsearch.randomizedtesting.rules.StatementAdapter.evaluate(StatementAdapter.java:36)
at com.carrotsearch.randomizedtesting.ThreadLeakControl$StatementRunner.run(ThreadLeakControl.java:367)
at com.carrotsearch.randomizedtesting.ThreadLeakControl.forkTimeoutingTask(ThreadLeakControl.java:809)
at com.carrotsearch.randomizedtesting.ThreadLeakControl$3.evaluate(ThreadLeakControl.java:460)
at com.carrotsearch.randomizedtesting.RandomizedRunner.runSingleTest(RandomizedRunner.java:880)
at com.carrotsearch.randomizedtesting.RandomizedRunner$5.evaluate(RandomizedRunner.java:781)
at com.carrotsearch.randomizedtesting.RandomizedRunner$6.evaluate(RandomizedRunner.java:816)
at com.carrotsearch.randomizedtesting.RandomizedRunner$7.evaluate(RandomizedRunner.java:827)
at com.carrotsearch.randomizedtesting.rules.StatementAdapter.evaluate(StatementAdapter.java:36)
at com.carrotsearch.randomizedtesting.rules.SystemPropertiesRestoreRule$1.evaluate(SystemPropertiesRestoreRule.java:57)
at org.apache.lucene.util.AbstractBeforeAfterRule$1.evaluate(AbstractBeforeAfterRule.java:45)
at com.carrotsearch.randomizedtesting.rules.StatementAdapter.evaluate(StatementAdapter.java:36)
at org.apache.lucene.util.TestRuleStoreClassName$1.evaluate(TestRuleStoreClassName.java:41)
at com.carrotsearch.randomizedtesting.rules.NoShadowingOrOverridesOnMethodsRule$1.evaluate(NoShadowingOrOverridesOnMethodsRule.java:40)
at com.carrotsearch.randomizedtesting.rules.NoShadowingOrOverridesOnMethodsRule$1.evaluate(NoShadowingOrOverridesOnMethodsRule.java:40)
at com.carrotsearch.randomizedtesting.rules.StatementAdapter.evaluate(StatementAdapter.java:36)
at com.carrotsearch.randomizedtesting.rules.StatementAdapter.evaluate(StatementAdapter.java:36)
at com.carrotsearch.randomizedtesting.rules.StatementAdapter.evaluate(StatementAdapter.java:36)
at org.apache.lucene.util.TestRuleAssertionsRequired$1.evaluate(TestRuleAssertionsRequired.java:53)
at org.apache.lucene.util.TestRuleMarkFailure$1.evaluate(TestRuleMarkFailure.java:47)
at org.apache.lucene.util.TestRuleIgnoreAfterMaxFailures$1.evaluate(TestRuleIgnoreAfterMaxFailures.java:64)
at org.apache.lucene.util.TestRuleIgnoreTestSuites$1.evaluate(TestRuleIgnoreTestSuites.java:54)
at com.carrotsearch.randomizedtesting.rules.StatementAdapter.evaluate(StatementAdapter.java:36)
at com.carrotsearch.randomizedtesting.ThreadLeakControl$StatementRunner.run(ThreadLeakControl.java:367)
at java.lang.Thread.run(Thread.java:745)
FAILED: junit.framework.TestSuite.org.apache.solr.search.join.BlockJoinFacetDistribTest
Error Message:
Could not remove the following files (in the order of attempts): C:\Users\jenkins\workspace\Lucene-Solr-6.0-Windows\solr\build\solr-core\test\J1\temp\solr.search.join.BlockJoinFacetDistribTest_AB6AEC9DE9E30E85-001\tempDir-001\shard0\collection1: java.nio.file.DirectoryNotEmptyException: C:\Users\jenkins\workspace\Lucene-Solr-6.0-Windows\solr\build\solr-core\test\J1\temp\solr.search.join.BlockJoinFacetDistribTest_AB6AEC9DE9E30E85-001\tempDir-001\shard0\collection1 C:\Users\jenkins\workspace\Lucene-Solr-6.0-Windows\solr\build\solr-core\test\J1\temp\solr.search.join.BlockJoinFacetDistribTest_AB6AEC9DE9E30E85-001\tempDir-001\shard0: java.nio.file.DirectoryNotEmptyException: C:\Users\jenkins\workspace\Lucene-Solr-6.0-Windows\solr\build\solr-core\test\J1\temp\solr.search.join.BlockJoinFacetDistribTest_AB6AEC9DE9E30E85-001\tempDir-001\shard0 C:\Users\jenkins\workspace\Lucene-Solr-6.0-Windows\solr\build\solr-core\test\J1\temp\solr.search.join.BlockJoinFacetDistribTest_AB6AEC9DE9E30E85-001\tempDir-001: java.nio.file.DirectoryNotEmptyException: C:\Users\jenkins\workspace\Lucene-Solr-6.0-Windows\solr\build\solr-core\test\J1\temp\solr.search.join.BlockJoinFacetDistribTest_AB6AEC9DE9E30E85-001\tempDir-001
Stack Trace:
java.io.IOException: Could not remove the following files (in the order of attempts):
C:\Users\jenkins\workspace\Lucene-Solr-6.0-Windows\solr\build\solr-core\test\J1\temp\solr.search.join.BlockJoinFacetDistribTest_AB6AEC9DE9E30E85-001\tempDir-001\shard0\collection1: java.nio.file.DirectoryNotEmptyException: C:\Users\jenkins\workspace\Lucene-Solr-6.0-Windows\solr\build\solr-core\test\J1\temp\solr.search.join.BlockJoinFacetDistribTest_AB6AEC9DE9E30E85-001\tempDir-001\shard0\collection1
C:\Users\jenkins\workspace\Lucene-Solr-6.0-Windows\solr\build\solr-core\test\J1\temp\solr.search.join.BlockJoinFacetDistribTest_AB6AEC9DE9E30E85-001\tempDir-001\shard0: java.nio.file.DirectoryNotEmptyException: C:\Users\jenkins\workspace\Lucene-Solr-6.0-Windows\solr\build\solr-core\test\J1\temp\solr.search.join.BlockJoinFacetDistribTest_AB6AEC9DE9E30E85-001\tempDir-001\shard0
C:\Users\jenkins\workspace\Lucene-Solr-6.0-Windows\solr\build\solr-core\test\J1\temp\solr.search.join.BlockJoinFacetDistribTest_AB6AEC9DE9E30E85-001\tempDir-001: java.nio.file.DirectoryNotEmptyException: C:\Users\jenkins\workspace\Lucene-Solr-6.0-Windows\solr\build\solr-core\test\J1\temp\solr.search.join.BlockJoinFacetDistribTest_AB6AEC9DE9E30E85-001\tempDir-001
at __randomizedtesting.SeedInfo.seed([AB6AEC9DE9E30E85]:0)
at org.apache.lucene.util.IOUtils.rm(IOUtils.java:323)
at org.apache.lucene.util.TestRuleTemporaryFilesCleanup.afterAlways(TestRuleTemporaryFilesCleanup.java:216)
at com.carrotsearch.randomizedtesting.rules.TestRuleAdapter$1.afterAlways(TestRuleAdapter.java:31)
at com.carrotsearch.randomizedtesting.rules.StatementAdapter.evaluate(StatementAdapter.java:43)
at com.carrotsearch.randomizedtesting.rules.StatementAdapter.evaluate(StatementAdapter.java:36)
at org.apache.lucene.util.TestRuleAssertionsRequired$1.evaluate(TestRuleAssertionsRequired.java:53)
at org.apache.lucene.util.TestRuleMarkFailure$1.evaluate(TestRuleMarkFailure.java:47)
at org.apache.lucene.util.TestRuleIgnoreAfterMaxFailures$1.evaluate(TestRuleIgnoreAfterMaxFailures.java:64)
at org.apache.lucene.util.TestRuleIgnoreTestSuites$1.evaluate(TestRuleIgnoreTestSuites.java:54)
at com.carrotsearch.randomizedtesting.rules.StatementAdapter.evaluate(StatementAdapter.java:36)
at com.carrotsearch.randomizedtesting.ThreadLeakControl$StatementRunner.run(ThreadLeakControl.java:367)
at java.lang.Thread.run(Thread.java:745)
Build Log:
[...truncated 10623 lines...]
[junit4] Suite: org.apache.solr.cloud.DistribDocExpirationUpdateProcessorTest
[junit4] 2> Creating dataDir: C:\Users\jenkins\workspace\Lucene-Solr-6.0-Windows\solr\build\solr-core\test\J0\temp\solr.cloud.DistribDocExpirationUpdateProcessorTest_AB6AEC9DE9E30E85-001\init-core-data-001
[junit4] 2> 129759 INFO (SUITE-DistribDocExpirationUpdateProcessorTest-seed#[AB6AEC9DE9E30E85]-worker) [ ] o.a.s.SolrTestCaseJ4 Randomized ssl (false) and clientAuth (false)
[junit4] 2> 129759 INFO (SUITE-DistribDocExpirationUpdateProcessorTest-seed#[AB6AEC9DE9E30E85]-worker) [ ] o.a.s.BaseDistributedSearchTestCase Setting hostContext system property: /d/
[junit4] 2> 129762 INFO (TEST-DistribDocExpirationUpdateProcessorTest.test-seed#[AB6AEC9DE9E30E85]) [ ] o.a.s.c.ZkTestServer STARTING ZK TEST SERVER
[junit4] 2> 129762 INFO (Thread-268) [ ] o.a.s.c.ZkTestServer client port:0.0.0.0/0.0.0.0:0
[junit4] 2> 129762 INFO (Thread-268) [ ] o.a.s.c.ZkTestServer Starting server
[junit4] 2> 129862 INFO (TEST-DistribDocExpirationUpdateProcessorTest.test-seed#[AB6AEC9DE9E30E85]) [ ] o.a.s.c.ZkTestServer start zk server on port:64487
[junit4] 2> 129862 INFO (TEST-DistribDocExpirationUpdateProcessorTest.test-seed#[AB6AEC9DE9E30E85]) [ ] o.a.s.c.c.SolrZkClient Using default ZkCredentialsProvider
[junit4] 2> 129864 INFO (TEST-DistribDocExpirationUpdateProcessorTest.test-seed#[AB6AEC9DE9E30E85]) [ ] o.a.s.c.c.ConnectionManager Waiting for client to connect to ZooKeeper
[junit4] 2> 129869 INFO (zkCallback-118-thread-1) [ ] o.a.s.c.c.ConnectionManager Watcher org.apache.solr.common.cloud.ConnectionManager@7875bd name:ZooKeeperConnection Watcher:127.0.0.1:64487 got event WatchedEvent state:SyncConnected type:None path:null path:null type:None
[junit4] 2> 129869 INFO (TEST-DistribDocExpirationUpdateProcessorTest.test-seed#[AB6AEC9DE9E30E85]) [ ] o.a.s.c.c.ConnectionManager Client is connected to ZooKeeper
[junit4] 2> 129870 INFO (TEST-DistribDocExpirationUpdateProcessorTest.test-seed#[AB6AEC9DE9E30E85]) [ ] o.a.s.c.c.SolrZkClient Using default ZkACLProvider
[junit4] 2> 129870 INFO (TEST-DistribDocExpirationUpdateProcessorTest.test-seed#[AB6AEC9DE9E30E85]) [ ] o.a.s.c.c.SolrZkClient makePath: /solr
[junit4] 2> 129873 INFO (TEST-DistribDocExpirationUpdateProcessorTest.test-seed#[AB6AEC9DE9E30E85]) [ ] o.a.s.c.c.SolrZkClient Using default ZkCredentialsProvider
[junit4] 2> 129878 INFO (TEST-DistribDocExpirationUpdateProcessorTest.test-seed#[AB6AEC9DE9E30E85]) [ ] o.a.s.c.c.ConnectionManager Waiting for client to connect to ZooKeeper
[junit4] 2> 129880 INFO (zkCallback-119-thread-1) [ ] o.a.s.c.c.ConnectionManager Watcher org.apache.solr.common.cloud.ConnectionManager@1137a7d name:ZooKeeperConnection Watcher:127.0.0.1:64487/solr got event WatchedEvent state:SyncConnected type:None path:null path:null type:None
[junit4] 2> 129880 INFO (TEST-DistribDocExpirationUpdateProcessorTest.test-seed#[AB6AEC9DE9E30E85]) [ ] o.a.s.c.c.ConnectionManager Client is connected to ZooKeeper
[junit4] 2> 129880 INFO (TEST-DistribDocExpirationUpdateProcessorTest.test-seed#[AB6AEC9DE9E30E85]) [ ] o.a.s.c.c.SolrZkClient Using default ZkACLProvider
[junit4] 2> 129880 INFO (TEST-DistribDocExpirationUpdateProcessorTest.test-seed#[AB6AEC9DE9E30E85]) [ ] o.a.s.c.c.SolrZkClient makePath: /collections/collection1
[junit4] 2> 129883 INFO (TEST-DistribDocExpirationUpdateProcessorTest.test-seed#[AB6AEC9DE9E30E85]) [ ] o.a.s.c.c.SolrZkClient makePath: /collections/collection1/shards
[junit4] 2> 129886 INFO (TEST-DistribDocExpirationUpdateProcessorTest.test-seed#[AB6AEC9DE9E30E85]) [ ] o.a.s.c.c.SolrZkClient makePath: /collections/control_collection
[junit4] 2> 129889 INFO (TEST-DistribDocExpirationUpdateProcessorTest.test-seed#[AB6AEC9DE9E30E85]) [ ] o.a.s.c.c.SolrZkClient makePath: /collections/control_collection/shards
[junit4] 2> 129892 INFO (TEST-DistribDocExpirationUpdateProcessorTest.test-seed#[AB6AEC9DE9E30E85]) [ ] o.a.s.c.AbstractZkTestCase put C:\Users\jenkins\workspace\Lucene-Solr-6.0-Windows\solr\core\src\test-files\solr\collection1\conf\solrconfig-doc-expire-update-processor.xml to /configs/conf1/solrconfig.xml
[junit4] 2> 129892 INFO (TEST-DistribDocExpirationUpdateProcessorTest.test-seed#[AB6AEC9DE9E30E85]) [ ] o.a.s.c.c.SolrZkClient makePath: /configs/conf1/solrconfig.xml
[junit4] 2> 129897 INFO (TEST-DistribDocExpirationUpdateProcessorTest.test-seed#[AB6AEC9DE9E30E85]) [ ] o.a.s.c.AbstractZkTestCase put C:\Users\jenkins\workspace\Lucene-Solr-6.0-Windows\solr\core\src\test-files\solr\collection1\conf\schema15.xml to /configs/conf1/schema.xml
[junit4] 2> 129897 INFO (TEST-DistribDocExpirationUpdateProcessorTest.test-seed#[AB6AEC9DE9E30E85]) [ ] o.a.s.c.c.SolrZkClient makePath: /configs/conf1/schema.xml
[junit4] 2> 129900 INFO (TEST-DistribDocExpirationUpdateProcessorTest.test-seed#[AB6AEC9DE9E30E85]) [ ] o.a.s.c.AbstractZkTestCase put C:\Users\jenkins\workspace\Lucene-Solr-6.0-Windows\solr\core\src\test-files\solr\collection1\conf\solrconfig.snippet.randomindexconfig.xml to /configs/conf1/solrconfig.snippet.randomindexconfig.xml
[junit4] 2> 129902 INFO (TEST-DistribDocExpirationUpdateProcessorTest.test-seed#[AB6AEC9DE9E30E85]) [ ] o.a.s.c.c.SolrZkClient makePath: /configs/conf1/solrconfig.snippet.randomindexconfig.xml
[junit4] 2> 129904 INFO (TEST-DistribDocExpirationUpdateProcessorTest.test-seed#[AB6AEC9DE9E30E85]) [ ] o.a.s.c.AbstractZkTestCase put C:\Users\jenkins\workspace\Lucene-Solr-6.0-Windows\solr\core\src\test-files\solr\collection1\conf\stopwords.txt to /configs/conf1/stopwords.txt
[junit4] 2> 129904 INFO (TEST-DistribDocExpirationUpdateProcessorTest.test-seed#[AB6AEC9DE9E30E85]) [ ] o.a.s.c.c.SolrZkClient makePath: /configs/conf1/stopwords.txt
[junit4] 2> 129908 INFO (TEST-DistribDocExpirationUpdateProcessorTest.test-seed#[AB6AEC9DE9E30E85]) [ ] o.a.s.c.AbstractZkTestCase put C:\Users\jenkins\workspace\Lucene-Solr-6.0-Windows\solr\core\src\test-files\solr\collection1\conf\protwords.txt to /configs/conf1/protwords.txt
[junit4] 2> 129908 INFO (TEST-DistribDocExpirationUpdateProcessorTest.test-seed#[AB6AEC9DE9E30E85]) [ ] o.a.s.c.c.SolrZkClient makePath: /configs/conf1/protwords.txt
[junit4] 2> 129911 INFO (TEST-DistribDocExpirationUpdateProcessorTest.test-seed#[AB6AEC9DE9E30E85]) [ ] o.a.s.c.AbstractZkTestCase put C:\Users\jenkins\workspace\Lucene-Solr-6.0-Windows\solr\core\src\test-files\solr\collection1\conf\currency.xml to /configs/conf1/currency.xml
[junit4] 2> 129911 INFO (TEST-DistribDocExpirationUpdateProcessorTest.test-seed#[AB6AEC9DE9E30E85]) [ ] o.a.s.c.c.SolrZkClient makePath: /configs/conf1/currency.xml
[junit4] 2> 129914 INFO (TEST-DistribDocExpirationUpdateProcessorTest.test-seed#[AB6AEC9DE9E30E85]) [ ] o.a.s.c.AbstractZkTestCase put C:\Users\jenkins\workspace\Lucene-Solr-6.0-Windows\solr\core\src\test-files\solr\collection1\conf\enumsConfig.xml to /configs/conf1/enumsConfig.xml
[junit4] 2> 129914 INFO (TEST-DistribDocExpirationUpdateProcessorTest.test-seed#[AB6AEC9DE9E30E85]) [ ] o.a.s.c.c.SolrZkClient makePath: /configs/conf1/enumsConfig.xml
[junit4] 2> 129918 INFO (TEST-DistribDocExpirationUpdateProcessorTest.test-seed#[AB6AEC9DE9E30E85]) [ ] o.a.s.c.AbstractZkTestCase put C:\Users\jenkins\workspace\Lucene-Solr-6.0-Windows\solr\core\src\test-files\solr\collection1\conf\open-exchange-rates.json to /configs/conf1/open-exchange-rates.json
[junit4] 2> 129918 INFO (TEST-DistribDocExpirationUpdateProcessorTest.test-seed#[AB6AEC9DE9E30E85]) [ ] o.a.s.c.c.SolrZkClient makePath: /configs/conf1/open-exchange-rates.json
[junit4] 2> 129921 INFO (TEST-DistribDocExpirationUpdateProcessorTest.test-seed#[AB6AEC9DE9E30E85]) [ ] o.a.s.c.AbstractZkTestCase put C:\Users\jenkins\workspace\Lucene-Solr-6.0-Windows\solr\core\src\test-files\solr\collection1\conf\mapping-ISOLatin1Accent.txt to /configs/conf1/mapping-ISOLatin1Accent.txt
[junit4] 2> 129921 INFO (TEST-DistribDocExpirationUpdateProcessorTest.test-seed#[AB6AEC9DE9E30E85]) [ ] o.a.s.c.c.SolrZkClient makePath: /configs/conf1/mapping-ISOLatin1Accent.txt
[junit4] 2> 129924 INFO (TEST-DistribDocExpirationUpdateProcessorTest.test-seed#[AB6AEC9DE9E30E85]) [ ] o.a.s.c.AbstractZkTestCase put C:\Users\jenkins\workspace\Lucene-Solr-6.0-Windows\solr\core\src\test-files\solr\collection1\conf\old_synonyms.txt to /configs/conf1/old_synonyms.txt
[junit4] 2> 129924 INFO (TEST-DistribDocExpirationUpdateProcessorTest.test-seed#[AB6AEC9DE9E30E85]) [ ] o.a.s.c.c.SolrZkClient makePath: /configs/conf1/old_synonyms.txt
[junit4] 2> 129928 INFO (TEST-DistribDocExpirationUpdateProcessorTest.test-seed#[AB6AEC9DE9E30E85]) [ ] o.a.s.c.AbstractZkTestCase put C:\Users\jenkins\workspace\Lucene-Solr-6.0-Windows\solr\core\src\test-files\solr\collection1\conf\synonyms.txt to /configs/conf1/synonyms.txt
[junit4] 2> 129929 INFO (TEST-DistribDocExpirationUpdateProcessorTest.test-seed#[AB6AEC9DE9E30E85]) [ ] o.a.s.c.c.SolrZkClient makePath: /configs/conf1/synonyms.txt
[junit4] 2> 129934 WARN (NIOServerCxn.Factory:0.0.0.0/0.0.0.0:0) [ ] o.a.z.s.NIOServerCnxn caught end of stream exception
[junit4] 2> EndOfStreamException: Unable to read additional data from client sessionid 0x15418bedcb30001, likely client has closed socket
[junit4] 2> at org.apache.zookeeper.server.NIOServerCnxn.doIO(NIOServerCnxn.java:228)
[junit4] 2> at org.apache.zookeeper.server.NIOServerCnxnFactory.run(NIOServerCnxnFactory.java:208)
[junit4] 2> at java.lang.Thread.run(Thread.java:745)
[junit4] 2> 130377 INFO (TEST-DistribDocExpirationUpdateProcessorTest.test-seed#[AB6AEC9DE9E30E85]) [ ] o.a.s.SolrTestCaseJ4 Writing core.properties file to C:\Users\jenkins\workspace\Lucene-Solr-6.0-Windows\solr\build\solr-core\test\J0\temp\solr.cloud.DistribDocExpirationUpdateProcessorTest_AB6AEC9DE9E30E85-001\control-001\cores\collection1
[junit4] 2> 130380 INFO (TEST-DistribDocExpirationUpdateProcessorTest.test-seed#[AB6AEC9DE9E30E85]) [ ] o.e.j.s.Server jetty-9.3.8.v20160314
[junit4] 2> 130382 INFO (TEST-DistribDocExpirationUpdateProcessorTest.test-seed#[AB6AEC9DE9E30E85]) [ ] o.e.j.s.h.ContextHandler Started o.e.j.s.ServletContextHandler@18c4588{/d,null,AVAILABLE}
[junit4] 2> 130387 INFO (TEST-DistribDocExpirationUpdateProcessorTest.test-seed#[AB6AEC9DE9E30E85]) [ ] o.e.j.s.ServerConnector Started ServerConnector@1668df2{HTTP/1.1,[http/1.1]}{127.0.0.1:64494}
[junit4] 2> 130387 INFO (TEST-DistribDocExpirationUpdateProcessorTest.test-seed#[AB6AEC9DE9E30E85]) [ ] o.e.j.s.Server Started @133632ms
[junit4] 2> 130387 INFO (TEST-DistribDocExpirationUpdateProcessorTest.test-seed#[AB6AEC9DE9E30E85]) [ ] o.a.s.c.s.e.JettySolrRunner Jetty properties: {solr.data.dir=C:\Users\jenkins\workspace\Lucene-Solr-6.0-Windows\solr\build\solr-core\test\J0\temp\solr.cloud.DistribDocExpirationUpdateProcessorTest_AB6AEC9DE9E30E85-001\tempDir-001/control/data, hostContext=/d, hostPort=64494, coreRootDirectory=C:\Users\jenkins\workspace\Lucene-Solr-6.0-Windows\solr\build\solr-core\test\J0\temp\solr.cloud.DistribDocExpirationUpdateProcessorTest_AB6AEC9DE9E30E85-001\control-001\cores}
[junit4] 2> 130387 INFO (TEST-DistribDocExpirationUpdateProcessorTest.test-seed#[AB6AEC9DE9E30E85]) [ ] o.a.s.s.SolrDispatchFilter SolrDispatchFilter.init(): sun.misc.Launcher$AppClassLoader@1d16e93
[junit4] 2> 130388 INFO (TEST-DistribDocExpirationUpdateProcessorTest.test-seed#[AB6AEC9DE9E30E85]) [ ] o.a.s.c.SolrResourceLoader new SolrResourceLoader for directory: 'C:\Users\jenkins\workspace\Lucene-Solr-6.0-Windows\solr\build\solr-core\test\J0\temp\solr.cloud.DistribDocExpirationUpdateProcessorTest_AB6AEC9DE9E30E85-001\control-001'
[junit4] 2> 130388 INFO (TEST-DistribDocExpirationUpdateProcessorTest.test-seed#[AB6AEC9DE9E30E85]) [ ] o.a.s.c.SolrResourceLoader JNDI not configured for solr (NoInitialContextEx)
[junit4] 2> 130388 INFO (TEST-DistribDocExpirationUpdateProcessorTest.test-seed#[AB6AEC9DE9E30E85]) [ ] o.a.s.c.SolrResourceLoader solr home defaulted to 'solr/' (could not find system property or JNDI)
[junit4] 2> 130388 INFO (TEST-DistribDocExpirationUpdateProcessorTest.test-seed#[AB6AEC9DE9E30E85]) [ ] o.a.s.c.c.SolrZkClient Using default ZkCredentialsProvider
[junit4] 2> 130390 INFO (TEST-DistribDocExpirationUpdateProcessorTest.test-seed#[AB6AEC9DE9E30E85]) [ ] o.a.s.c.c.ConnectionManager Waiting for client to connect to ZooKeeper
[junit4] 2> 130392 INFO (zkCallback-120-thread-1) [ ] o.a.s.c.c.ConnectionManager Watcher org.apache.solr.common.cloud.ConnectionManager@1bd1e2 name:ZooKeeperConnection Watcher:127.0.0.1:64487/solr got event WatchedEvent state:SyncConnected type:None path:null path:null type:None
[junit4] 2> 130392 INFO (TEST-DistribDocExpirationUpdateProcessorTest.test-seed#[AB6AEC9DE9E30E85]) [ ] o.a.s.c.c.ConnectionManager Client is connected to ZooKeeper
[junit4] 2> 130393 INFO (TEST-DistribDocExpirationUpdateProcessorTest.test-seed#[AB6AEC9DE9E30E85]) [ ] o.a.s.c.c.SolrZkClient Using default ZkACLProvider
[junit4] 2> 130395 INFO (TEST-DistribDocExpirationUpdateProcessorTest.test-seed#[AB6AEC9DE9E30E85]) [ ] o.a.s.s.SolrDispatchFilter Loading solr.xml from SolrHome (not found in ZooKeeper)
[junit4] 2> 130395 WARN (NIOServerCxn.Factory:0.0.0.0/0.0.0.0:0) [ ] o.a.z.s.NIOServerCnxn caught end of stream exception
[junit4] 2> EndOfStreamException: Unable to read additional data from client sessionid 0x15418bedcb30002, likely client has closed socket
[junit4] 2> at org.apache.zookeeper.server.NIOServerCnxn.doIO(NIOServerCnxn.java:228)
[junit4] 2> at org.apache.zookeeper.server.NIOServerCnxnFactory.run(NIOServerCnxnFactory.java:208)
[junit4] 2> at java.lang.Thread.run(Thread.java:745)
[junit4] 2> 130397 INFO (TEST-DistribDocExpirationUpdateProcessorTest.test-seed#[AB6AEC9DE9E30E85]) [ ] o.a.s.c.SolrXmlConfig Loading container configuration from C:\Users\jenkins\workspace\Lucene-Solr-6.0-Windows\solr\build\solr-core\test\J0\temp\solr.cloud.DistribDocExpirationUpdateProcessorTest_AB6AEC9DE9E30E85-001\control-001\solr.xml
[junit4] 2> 130413 INFO (TEST-DistribDocExpirationUpdateProcessorTest.test-seed#[AB6AEC9DE9E30E85]) [ ] o.a.s.c.CorePropertiesLocator Config-defined core root directory: C:\Users\jenkins\workspace\Lucene-Solr-6.0-Windows\solr\build\solr-core\test\J0\temp\solr.cloud.DistribDocExpirationUpdateProcessorTest_AB6AEC9DE9E30E85-001\control-001\cores
[junit4] 2> 130413 INFO (TEST-DistribDocExpirationUpdateProcessorTest.test-seed#[AB6AEC9DE9E30E85]) [ ] o.a.s.c.CoreContainer New CoreContainer 16359251
[junit4] 2> 130413 INFO (TEST-DistribDocExpirationUpdateProcessorTest.test-seed#[AB6AEC9DE9E30E85]) [ ] o.a.s.c.CoreContainer Loading cores into CoreContainer [instanceDir=C:\Users\jenkins\workspace\Lucene-Solr-6.0-Windows\solr\build\solr-core\test\J0\temp\solr.cloud.DistribDocExpirationUpdateProcessorTest_AB6AEC9DE9E30E85-001\control-001]
[junit4] 2> 130413 WARN (TEST-DistribDocExpirationUpdateProcessorTest.test-seed#[AB6AEC9DE9E30E85]) [ ] o.a.s.c.CoreContainer Couldn't add files from C:\Users\jenkins\workspace\Lucene-Solr-6.0-Windows\solr\build\solr-core\test\J0\temp\solr.cloud.DistribDocExpirationUpdateProcessorTest_AB6AEC9DE9E30E85-001\control-001\lib to classpath: C:\Users\jenkins\workspace\Lucene-Solr-6.0-Windows\solr\build\solr-core\test\J0\temp\solr.cloud.DistribDocExpirationUpdateProcessorTest_AB6AEC9DE9E30E85-001\control-001\lib
[junit4] 2> 130413 INFO (TEST-DistribDocExpirationUpdateProcessorTest.test-seed#[AB6AEC9DE9E30E85]) [ ] o.a.s.h.c.HttpShardHandlerFactory created with socketTimeout : 90000,urlScheme : ,connTimeout : 15000,maxConnectionsPerHost : 20,maxConnections : 10000,corePoolSize : 0,maximumPoolSize : 2147483647,maxThreadIdleTime : 5,sizeOfQueue : -1,fairnessPolicy : false,useRetries : false,
[junit4] 2> 130415 INFO (TEST-DistribDocExpirationUpdateProcessorTest.test-seed#[AB6AEC9DE9E30E85]) [ ] o.a.s.u.UpdateShardHandler Creating UpdateShardHandler HTTP client with params: socketTimeout=340000&connTimeout=45000&retry=true
[junit4] 2> 130417 INFO (TEST-DistribDocExpirationUpdateProcessorTest.test-seed#[AB6AEC9DE9E30E85]) [ ] o.a.s.l.LogWatcher SLF4J impl is org.slf4j.impl.Log4jLoggerFactory
[junit4] 2> 130417 INFO (TEST-DistribDocExpirationUpdateProcessorTest.test-seed#[AB6AEC9DE9E30E85]) [ ] o.a.s.l.LogWatcher Registering Log Listener [Log4j (org.slf4j.impl.Log4jLoggerFactory)]
[junit4] 2> 130417 INFO (TEST-DistribDocExpirationUpdateProcessorTest.test-seed#[AB6AEC9DE9E30E85]) [ ] o.a.s.c.ZkContainer Zookeeper client=127.0.0.1:64487/solr
[junit4] 2> 130417 INFO (TEST-DistribDocExpirationUpdateProcessorTest.test-seed#[AB6AEC9DE9E30E85]) [ ] o.a.s.c.ZkController zkHost includes chroot
[junit4] 2> 130417 INFO (TEST-DistribDocExpirationUpdateProcessorTest.test-seed#[AB6AEC9DE9E30E85]) [ ] o.a.s.c.c.SolrZkClient Using default ZkCredentialsProvider
[junit4] 2> 130418 INFO (TEST-DistribDocExpirationUpdateProcessorTest.test-seed#[AB6AEC9DE9E30E85]) [ ] o.a.s.c.c.ConnectionManager Waiting for client to connect to ZooKeeper
[junit4] 2> 130421 INFO (zkCallback-123-thread-1) [ ] o.a.s.c.c.ConnectionManager Watcher org.apache.solr.common.cloud.ConnectionManager@16d9b63 name:ZooKeeperConnection Watcher:127.0.0.1:64487 got event WatchedEvent state:SyncConnected type:None path:null path:null type:None
[junit4] 2> 130421 INFO (TEST-DistribDocExpirationUpdateProcessorTest.test-seed#[AB6AEC9DE9E30E85]) [ ] o.a.s.c.c.ConnectionManager Client is connected to ZooKeeper
[junit4] 2> 130421 INFO (TEST-DistribDocExpirationUpdateProcessorTest.test-seed#[AB6AEC9DE9E30E85]) [ ] o.a.s.c.c.SolrZkClient Using default ZkACLProvider
[junit4] 2> 130427 INFO (TEST-DistribDocExpirationUpdateProcessorTest.test-seed#[AB6AEC9DE9E30E85]) [n:127.0.0.1:64494_d ] o.a.s.c.c.ConnectionManager Waiting for client to connect to ZooKeeper
[junit4] 2> 130429 INFO (zkCallback-124-thread-1-processing-n:127.0.0.1:64494_d) [n:127.0.0.1:64494_d ] o.a.s.c.c.ConnectionManager Watcher org.apache.solr.common.cloud.ConnectionManager@133b40d name:ZooKeeperConnection Watcher:127.0.0.1:64487/solr got event WatchedEvent state:SyncConnected type:None path:null path:null type:None
[junit4] 2> 130430 INFO (TEST-DistribDocExpirationUpdateProcessorTest.test-seed#[AB6AEC9DE9E30E85]) [n:127.0.0.1:64494_d ] o.a.s.c.c.ConnectionManager Client is connected to ZooKeeper
[junit4] 2> 130434 INFO (TEST-DistribDocExpirationUpdateProcessorTest.test-seed#[AB6AEC9DE9E30E85]) [n:127.0.0.1:64494_d ] o.a.s.c.c.SolrZkClient makePath: /overseer/queue
[junit4] 2> 130440 INFO (TEST-DistribDocExpirationUpdateProcessorTest.test-seed#[AB6AEC9DE9E30E85]) [n:127.0.0.1:64494_d ] o.a.s.c.c.SolrZkClient makePath: /overseer/collection-queue-work
[junit4] 2> 130449 INFO (TEST-DistribDocExpirationUpdateProcessorTest.test-seed#[AB6AEC9DE9E30E85]) [n:127.0.0.1:64494_d ] o.a.s.c.c.SolrZkClient makePath: /overseer/collection-map-running
[junit4] 2> 130455 INFO (TEST-DistribDocExpirationUpdateProcessorTest.test-seed#[AB6AEC9DE9E30E85]) [n:127.0.0.1:64494_d ] o.a.s.c.c.SolrZkClient makePath: /overseer/collection-map-completed
[junit4] 2> 130465 INFO (TEST-DistribDocExpirationUpdateProcessorTest.test-seed#[AB6AEC9DE9E30E85]) [n:127.0.0.1:64494_d ] o.a.s.c.c.SolrZkClient makePath: /overseer/collection-map-failure
[junit4] 2> 130469 INFO (TEST-DistribDocExpirationUpdateProcessorTest.test-seed#[AB6AEC9DE9E30E85]) [n:127.0.0.1:64494_d ] o.a.s.c.c.SolrZkClient makePath: /live_nodes
[junit4] 2> 130477 INFO (TEST-DistribDocExpirationUpdateProcessorTest.test-seed#[AB6AEC9DE9E30E85]) [n:127.0.0.1:64494_d ] o.a.s.c.c.SolrZkClient makePath: /aliases.json
[junit4] 2> 130482 INFO (TEST-DistribDocExpirationUpdateProcessorTest.test-seed#[AB6AEC9DE9E30E85]) [n:127.0.0.1:64494_d ] o.a.s.c.c.SolrZkClient makePath: /clusterstate.json
[junit4] 2> 130489 INFO (TEST-DistribDocExpirationUpdateProcessorTest.test-seed#[AB6AEC9DE9E30E85]) [n:127.0.0.1:64494_d ] o.a.s.c.c.SolrZkClient makePath: /security.json
[junit4] 2> 130495 INFO (TEST-DistribDocExpirationUpdateProcessorTest.test-seed#[AB6AEC9DE9E30E85]) [n:127.0.0.1:64494_d ] o.a.s.c.c.ZkStateReader Updating cluster state from ZooKeeper...
[junit4] 2> 130504 INFO (TEST-DistribDocExpirationUpdateProcessorTest.test-seed#[AB6AEC9DE9E30E85]) [n:127.0.0.1:64494_d ] o.a.s.c.c.ZkStateReader Updated live nodes from ZooKeeper... (0) -> (0)
[junit4] 2> 130509 INFO (TEST-DistribDocExpirationUpdateProcessorTest.test-seed#[AB6AEC9DE9E30E85]) [n:127.0.0.1:64494_d ] o.a.s.c.c.SolrZkClient makePath: /overseer_elect
[junit4] 2> 130511 INFO (TEST-DistribDocExpirationUpdateProcessorTest.test-seed#[AB6AEC9DE9E30E85]) [n:127.0.0.1:64494_d ] o.a.s.c.c.SolrZkClient makePath: /overseer_elect/election
[junit4] 2> 130514 INFO (TEST-DistribDocExpirationUpdateProcessorTest.test-seed#[AB6AEC9DE9E30E85]) [n:127.0.0.1:64494_d ] o.a.s.c.Overseer Overseer (id=null) closing
[junit4] 2> 130515 INFO (TEST-DistribDocExpirationUpdateProcessorTest.test-seed#[AB6AEC9DE9E30E85]) [n:127.0.0.1:64494_d ] o.a.s.c.LeaderElector Joined leadership election with path: /overseer_elect/election/95728700107194372-127.0.0.1:64494_d-n_0000000000
[junit4] 2> 130515 INFO (TEST-DistribDocExpirationUpdateProcessorTest.test-seed#[AB6AEC9DE9E30E85]) [n:127.0.0.1:64494_d ] o.a.s.c.OverseerElectionContext I am going to be the leader 127.0.0.1:64494_d
[junit4] 2> 130515 INFO (TEST-DistribDocExpirationUpdateProcessorTest.test-seed#[AB6AEC9DE9E30E85]) [n:127.0.0.1:64494_d ] o.a.s.c.c.SolrZkClient makePath: /overseer_elect/leader
[junit4] 2> 130519 INFO (TEST-DistribDocExpirationUpdateProcessorTest.test-seed#[AB6AEC9DE9E30E85]) [n:127.0.0.1:64494_d ] o.a.s.c.Overseer Overseer (id=95728700107194372-127.0.0.1:64494_d-n_0000000000) starting
[junit4] 2> 130522 INFO (TEST-DistribDocExpirationUpdateProcessorTest.test-seed#[AB6AEC9DE9E30E85]) [n:127.0.0.1:64494_d ] o.a.s.c.c.SolrZkClient makePath: /overseer/queue-work
[junit4] 2> 130535 INFO (TEST-DistribDocExpirationUpdateProcessorTest.test-seed#[AB6AEC9DE9E30E85]) [n:127.0.0.1:64494_d ] o.a.s.c.OverseerAutoReplicaFailoverThread Starting OverseerAutoReplicaFailoverThread autoReplicaFailoverWorkLoopDelay=10000 autoReplicaFailoverWaitAfterExpiration=30000 autoReplicaFailoverBadNodeExpiration=60000
[junit4] 2> 130536 INFO (OverseerCollectionConfigSetProcessor-95728700107194372-127.0.0.1:64494_d-n_0000000000) [n:127.0.0.1:64494_d ] o.a.s.c.OverseerTaskProcessor Process current queue of overseer operations
[junit4] 2> 130536 INFO (TEST-DistribDocExpirationUpdateProcessorTest.test-seed#[AB6AEC9DE9E30E85]) [n:127.0.0.1:64494_d ] o.a.s.c.ZkController Register node as live in ZooKeeper:/live_nodes/127.0.0.1:64494_d
[junit4] 2> 130537 INFO (OverseerStateUpdate-95728700107194372-127.0.0.1:64494_d-n_0000000000) [n:127.0.0.1:64494_d ] o.a.s.c.Overseer Starting to work on the main queue
[junit4] 2> 130539 INFO (TEST-DistribDocExpirationUpdateProcessorTest.test-seed#[AB6AEC9DE9E30E85]) [n:127.0.0.1:64494_d ] o.a.s.c.c.SolrZkClient makePath: /live_nodes/127.0.0.1:64494_d
[junit4] 2> 130544 INFO (zkCallback-124-thread-1-processing-n:127.0.0.1:64494_d) [n:127.0.0.1:64494_d ] o.a.s.c.c.ZkStateReader A live node change: [WatchedEvent state:SyncConnected type:NodeChildrenChanged path:/live_nodes], has occurred - updating... (live nodes size: [0])
[junit4] 2> 130545 INFO (OverseerStateUpdate-95728700107194372-127.0.0.1:64494_d-n_0000000000) [n:127.0.0.1:64494_d ] o.a.s.c.c.ZkStateReader Updated live nodes from ZooKeeper... (0) -> (1)
[junit4] 2> 130553 INFO (zkCallback-124-thread-1-processing-n:127.0.0.1:64494_d) [n:127.0.0.1:64494_d ] o.a.s.c.c.ZkStateReader Updated live nodes from ZooKeeper... (1) -> (1)
[junit4] 2> 130572 INFO (TEST-DistribDocExpirationUpdateProcessorTest.test-seed#[AB6AEC9DE9E30E85]) [n:127.0.0.1:64494_d ] o.a.s.c.CoreContainer Security conf doesn't exist. Skipping setup for authorization module.
[junit4] 2> 130572 INFO (TEST-DistribDocExpirationUpdateProcessorTest.test-seed#[AB6AEC9DE9E30E85]) [n:127.0.0.1:64494_d ] o.a.s.c.CoreContainer No authentication plugin used.
[junit4] 2> 130573 INFO (TEST-DistribDocExpirationUpdateProcessorTest.test-seed#[AB6AEC9DE9E30E85]) [n:127.0.0.1:64494_d ] o.a.s.c.CorePropertiesLocator Looking for core definitions underneath C:\Users\jenkins\workspace\Lucene-Solr-6.0-Windows\solr\build\solr-core\test\J0\temp\solr.cloud.DistribDocExpirationUpdateProcessorTest_AB6AEC9DE9E30E85-001\control-001\cores
[junit4] 2> 130574 INFO (TEST-DistribDocExpirationUpdateProcessorTest.test-seed#[AB6AEC9DE9E30E85]) [n:127.0.0.1:64494_d ] o.a.s.c.CoreDescriptor Created CoreDescriptor: {name=collection1, config=solrconfig.xml, transient=false, schema=schema.xml, loadOnStartup=true, configSetProperties=configsetprops.json, collection=control_collection, coreNodeName=, dataDir=data\, shard=}
[junit4] 2> 130574 INFO (TEST-DistribDocExpirationUpdateProcessorTest.test-seed#[AB6AEC9DE9E30E85]) [n:127.0.0.1:64494_d ] o.a.s.c.CorePropertiesLocator Found core collection1 in C:\Users\jenkins\workspace\Lucene-Solr-6.0-Windows\solr\build\solr-core\test\J0\temp\solr.cloud.DistribDocExpirationUpdateProcessorTest_AB6AEC9DE9E30E85-001\control-001\cores\collection1
[junit4] 2> 130575 INFO (TEST-DistribDocExpirationUpdateProcessorTest.test-seed#[AB6AEC9DE9E30E85]) [n:127.0.0.1:64494_d ] o.a.s.c.CorePropertiesLocator Found 1 core definitions
[junit4] 2> 130577 INFO (TEST-DistribDocExpirationUpdateProcessorTest.test-seed#[AB6AEC9DE9E30E85]) [n:127.0.0.1:64494_d ] o.a.s.s.SolrDispatchFilter user.dir=C:\Users\jenkins\workspace\Lucene-Solr-6.0-Windows\solr\build\solr-core\test\J0
[junit4] 2> 130577 INFO (TEST-DistribDocExpirationUpdateProcessorTest.test-seed#[AB6AEC9DE9E30E85]) [n:127.0.0.1:64494_d ] o.a.s.s.SolrDispatchFilter SolrDispatchFilter.init() done
[junit4] 2> 130580 INFO (coreLoadExecutor-422-thread-1-processing-n:127.0.0.1:64494_d) [n:127.0.0.1:64494_d c:control_collection x:collection1] o.a.s.c.ZkController publishing state=down
[junit4] 2> 130580 INFO (coreLoadExecutor-422-thread-1-processing-n:127.0.0.1:64494_d) [n:127.0.0.1:64494_d c:control_collection x:collection1] o.a.s.c.ZkController numShards not found on descriptor - reading it from system property
[junit4] 2> 130584 INFO (OverseerStateUpdate-95728700107194372-127.0.0.1:64494_d-n_0000000000) [n:127.0.0.1:64494_d ] o.a.s.c.Overseer processMessage: queueSize: 1, message = {
[junit4] 2> "core":"collection1",
[junit4] 2> "roles":null,
[junit4] 2> "base_url":"http://127.0.0.1:64494/d",
[junit4] 2> "node_name":"127.0.0.1:64494_d",
[junit4] 2> "numShards":"1",
[junit4] 2> "state":"down",
[junit4] 2> "shard":null,
[junit4] 2> "collection":"control_collection",
[junit4] 2> "operation":"state"} current state version: 0
[junit4] 2> 130585 INFO (coreLoadExecutor-422-thread-1-processing-n:127.0.0.1:64494_d) [n:127.0.0.1:64494_d c:control_collection x:collection1] o.a.s.c.ZkController look for our core node name
[junit4] 2> 130585 INFO (OverseerStateUpdate-95728700107194372-127.0.0.1:64494_d-n_0000000000) [n:127.0.0.1:64494_d ] o.a.s.c.o.ReplicaMutator Update state numShards=1 message={
[junit4] 2> "core":"collection1",
[junit4] 2> "roles":null,
[junit4] 2> "base_url":"http://127.0.0.1:64494/d",
[junit4] 2> "node_name":"127.0.0.1:64494_d",
[junit4] 2> "numShards":"1",
[junit4] 2> "state":"down",
[junit4] 2> "shard":null,
[junit4] 2> "collection":"control_collection",
[junit4] 2> "operation":"state"}
[junit4] 2> 130588 INFO (OverseerStateUpdate-95728700107194372-127.0.0.1:64494_d-n_0000000000) [n:127.0.0.1:64494_d ] o.a.s.c.o.ClusterStateMutator building a new cName: control_collection
[junit4] 2> 130589 INFO (OverseerStateUpdate-95728700107194372-127.0.0.1:64494_d-n_0000000000) [n:127.0.0.1:64494_d ] o.a.s.c.o.ReplicaMutator Assigning new node to shard shard=shard1
[junit4] 2> 130593 INFO (zkCallback-124-thread-1-processing-n:127.0.0.1:64494_d) [n:127.0.0.1:64494_d ] o.a.s.c.c.ZkStateReader A cluster state change: [WatchedEvent state:SyncConnected type:NodeDataChanged path:/clusterstate.json], has occurred - updating... (live nodes size: [1])
[junit4] 2> 131587 INFO (coreLoadExecutor-422-thread-1-processing-n:127.0.0.1:64494_d) [n:127.0.0.1:64494_d c:control_collection x:collection1] o.a.s.c.ZkController waiting to find shard id in clusterstate for collection1
[junit4] 2> 131587 INFO (coreLoadExecutor-422-thread-1-processing-n:127.0.0.1:64494_d) [n:127.0.0.1:64494_d c:control_collection x:collection1] o.a.s.c.ZkController Check for collection zkNode:control_collection
[junit4] 2> 131587 INFO (coreLoadExecutor-422-thread-1-processing-n:127.0.0.1:64494_d) [n:127.0.0.1:64494_d c:control_collection x:collection1] o.a.s.c.ZkController Collection zkNode exists
[junit4] 2> 131587 INFO (coreLoadExecutor-422-thread-1-processing-n:127.0.0.1:64494_d) [n:127.0.0.1:64494_d c:control_collection x:collection1] o.a.s.c.c.ZkStateReader Load collection config from: [/collections/control_collection]
[junit4] 2> 131589 INFO (coreLoadExecutor-422-thread-1-processing-n:127.0.0.1:64494_d) [n:127.0.0.1:64494_d c:control_collection x:collection1] o.a.s.c.c.ZkStateReader path=[/collections/control_collection] [configName]=[conf1] specified config exists in ZooKeeper
[junit4] 2> 131589 INFO (coreLoadExecutor-422-thread-1-processing-n:127.0.0.1:64494_d) [n:127.0.0.1:64494_d c:control_collection x:collection1] o.a.s.c.SolrResourceLoader new SolrResourceLoader for directory: 'C:\Users\jenkins\workspace\Lucene-Solr-6.0-Windows\solr\build\solr-core\test\J0\temp\solr.cloud.DistribDocExpirationUpdateProcessorTest_AB6AEC9DE9E30E85-001\control-001\cores\collection1'
[junit4] 2> 131589 INFO (coreLoadExecutor-422-thread-1-processing-n:127.0.0.1:64494_d) [n:127.0.0.1:64494_d c:control_collection x:collection1] o.a.s.c.SolrResourceLoader JNDI not configured for solr (NoInitialContextEx)
[junit4] 2> 131589 INFO (coreLoadExecutor-422-thread-1-processing-n:127.0.0.1:64494_d) [n:127.0.0.1:64494_d c:control_collection x:collection1] o.a.s.c.SolrResourceLoader solr home defaulted to 'solr/' (could not find system property or JNDI)
[junit4] 2> 131594 INFO (coreLoadExecutor-422-thread-1-processing-n:127.0.0.1:64494_d) [n:127.0.0.1:64494_d c:control_collection x:collection1] o.a.s.c.Config loaded config solrconfig.xml with version 0
[junit4] 2> 131610 INFO (coreLoadExecutor-422-thread-1-processing-n:127.0.0.1:64494_d) [n:127.0.0.1:64494_d c:control_collection x:collection1] o.a.s.c.SolrConfig current version of requestparams : -1
[junit4] 2> 131620 INFO (coreLoadExecutor-422-thread-1-processing-n:127.0.0.1:64494_d) [n:127.0.0.1:64494_d c:control_collection x:collection1] o.a.s.c.SolrConfig Using Lucene MatchVersion: 6.0.0
[junit4] 2> 131631 INFO (coreLoadExecutor-422-thread-1-processing-n:127.0.0.1:64494_d) [n:127.0.0.1:64494_d c:control_collection x:collection1] o.a.s.c.SolrConfig Loaded SolrConfig: solrconfig.xml
[junit4] 2> 131664 INFO (coreLoadExecutor-422-thread-1-processing-n:127.0.0.1:64494_d) [n:127.0.0.1:64494_d c:control_collection x:collection1] o.a.s.s.IndexSchema [collection1] Schema name=test
[junit4] 2> 131766 INFO (coreLoadExecutor-422-thread-1-processing-n:127.0.0.1:64494_d) [n:127.0.0.1:64494_d c:control_collection x:collection1] o.a.s.s.IndexSchema default search field in schema is text
[junit4] 2> 131767 INFO (coreLoadExecutor-422-thread-1-processing-n:127.0.0.1:64494_d) [n:127.0.0.1:64494_d c:control_collection x:collection1] o.a.s.s.IndexSchema unique key field: id
[junit4] 2> 131768 INFO (coreLoadExecutor-422-thread-1-processing-n:127.0.0.1:64494_d) [n:127.0.0.1:64494_d c:control_collection x:collection1] o.a.s.s.FileExchangeRateProvider Reloading exchange rates from file currency.xml
[junit4] 2> 131772 INFO (coreLoadExecutor-422-thread-1-processing-n:127.0.0.1:64494_d) [n:127.0.0.1:64494_d c:control_collection x:collection1] o.a.s.s.FileExchangeRateProvider Reloading exchange rates from file currency.xml
[junit4] 2> 131812 INFO (coreLoadExecutor-422-thread-1-processing-n:127.0.0.1:64494_d) [n:127.0.0.1:64494_d c:control_collection x:collection1] o.a.s.c.ConfigSetProperties Did not find ConfigSet properties, assuming default properties: Can't find resource 'configsetprops.json' in classpath or '/configs/conf1', cwd=C:\Users\jenkins\workspace\Lucene-Solr-6.0-Windows\solr\build\solr-core\test\J0
[junit4] 2> 131812 INFO (coreLoadExecutor-422-thread-1-processing-n:127.0.0.1:64494_d) [n:127.0.0.1:64494_d c:control_collection x:collection1] o.a.s.c.CoreContainer Creating SolrCore 'collection1' using configuration from collection control_collection
[junit4] 2> 131812 INFO (coreLoadExecutor-422-thread-1-processing-n:127.0.0.1:64494_d) [n:127.0.0.1:64494_d c:control_collection s:shard1 r:core_node1 x:collection1] o.a.s.c.SolrCore org.apache.solr.core.MockDirectoryFactory
[junit4] 2> 131812 INFO (coreLoadExecutor-422-thread-1-processing-n:127.0.0.1:64494_d) [n:127.0.0.1:64494_d c:control_collection s:shard1 r:core_node1 x:collection1] o.a.s.c.SolrCore [[collection1] ] Opening new SolrCore at [C:\Users\jenkins\workspace\Lucene-Solr-6.0-Windows\solr\build\solr-core\test\J0\temp\solr.cloud.DistribDocExpirationUpdateProcessorTest_AB6AEC9DE9E30E85-001\control-001\cores\collection1], dataDir=[C:\Users\jenkins\workspace\Lucene-Solr-6.0-Windows\solr\build\solr-core\test\J0\temp\solr.cloud.DistribDocExpirationUpdateProcessorTest_AB6AEC9DE9E30E85-001\control-001\cores\collection1\data\]
[junit4] 2> 131813 INFO (coreLoadExecutor-422-thread-1-processing-n:127.0.0.1:64494_d) [n:127.0.0.1:64494_d c:control_collection s:shard1 r:core_node1 x:collection1] o.a.s.c.SolrCore JMX monitoring not detected for core: collection1
[junit4] 2> 131813 INFO (coreLoadExecutor-422-thread-1-processing-n:127.0.0.1:64494_d) [n:127.0.0.1:64494_d c:control_collection s:shard1 r:core_node1 x:collection1] o.a.s.c.CachingDirectoryFactory return new directory for C:\Users\jenkins\workspace\Lucene-Solr-6.0-Windows\solr\build\solr-core\test\J0\temp\solr.cloud.DistribDocExpirationUpdateProcessorTest_AB6AEC9DE9E30E85-001\control-001\cores\collection1\data\
[junit4] 2> 131813 INFO (coreLoadExecutor-422-thread-1-processing-n:127.0.0.1:64494_d) [n:127.0.0.1:64494_d c:control_collection s:shard1 r:core_node1 x:collection1] o.a.s.c.SolrCore New index directory detected: old=null new=C:\Users\jenkins\workspace\Lucene-Solr-6.0-Windows\solr\build\solr-core\test\J0\temp\solr.cloud.DistribDocExpirationUpdateProcessorTest_AB6AEC9DE9E30E85-001\control-001\cores\collection1\data\index/
[junit4] 2> 131813 WARN (coreLoadExecutor-422-thread-1-processing-n:127.0.0.1:64494_d) [n:127.0.0.1:64494_d c:control_collection s:shard1 r:core_node1 x:collection1] o.a.s.c.SolrCore [collection1] Solr index directory 'C:\Users\jenkins\workspace\Lucene-Solr-6.0-Windows\solr\build\solr-core\test\J0\temp\solr.cloud.DistribDocExpirationUpdateProcessorTest_AB6AEC9DE9E30E85-001\control-001\cores\collection1\data\index' doesn't exist. Creating new index...
[junit4] 2> 131813 INFO (coreLoadExecutor-422-thread-1-processing-n:127.0.0.1:64494_d) [n:127.0.0.1:64494_d c:control_collection s:shard1 r:core_node1 x:collection1] o.a.s.c.CachingDirectoryFactory return new directory for C:\Users\jenkins\workspace\Lucene-Solr-6.0-Windows\solr\build\solr-core\test\J0\temp\solr.cloud.DistribDocExpirationUpdateProcessorTest_AB6AEC9DE9E30E85-001\control-001\cores\collection1\data\index
[junit4] 2> 131814 INFO (coreLoadExecutor-422-thread-1-processing-n:127.0.0.1:64494_d) [n:127.0.0.1:64494_d c:control_collection s:shard1 r:core_node1 x:collection1] o.a.s.u.RandomMergePolicy RandomMergePolicy wrapping class org.apache.lucene.index.TieredMergePolicy: [TieredMergePolicy: maxMergeAtOnce=26, maxMergeAtOnceExplicit=16, maxMergedSegmentMB=92.064453125, floorSegmentMB=1.6650390625, forceMergeDeletesPctAllowed=2.5380131685258633, segmentsPerTier=45.0, maxCFSSegmentSizeMB=8.796093022207999E12, noCFSRatio=0.0
[junit4] 2> 131814 INFO (coreLoadExecutor-422-thread-1-processing-n:127.0.0.1:64494_d) [n:127.0.0.1:64494_d c:control_collection s:shard1 r:core_node1 x:collection1] o.a.s.c.SolrDeletionPolicy SolrDeletionPolicy.onCommit: commits: num=1
[junit4] 2> commit{dir=MockDirectoryWrapper(RAMDirectory@fbcd00 lockFactory=org.apache.lucene.store.SingleInstanceLockFactory@1070e48),segFN=segments_1,generation=1}
[junit4] 2> 131814 INFO (coreLoadExecutor-422-thread-1-processing-n:127.0.0.1:64494_d) [n:127.0.0.1:64494_d c:control_collection s:shard1 r:core_node1 x:collection1] o.a.s.c.SolrDeletionPolicy newest commit generation = 1
[junit4] 2> 131815 INFO (OldIndexDirectoryCleanupThreadForCore-collection1) [n:127.0.0.1:64494_d c:control_collection s:shard1 r:core_node1 x:collection1] o.a.s.c.SolrCore Looking for old index directories to cleanup for core collection1 in C:\Users\jenkins\workspace\Lucene-Solr-6.0-Windows\solr\build\solr-core\test\J0\temp\solr.cloud.DistribDocExpirationUpdateProcessorTest_AB6AEC9DE9E30E85-001\control-001\cores\collection1\data\
[junit4] 2> 131816 INFO (coreLoadExecutor-422-thread-1-processing-n:127.0.0.1:64494_d) [n:127.0.0.1:64494_d c:control_collection s:shard1 r:core_node1 x:collection1] o.a.s.u.p.UpdateRequestProcessorChain creating updateRequestProcessorChain "convert-ttl-defaults"
[junit4] 2> 131816 WARN (OldIndexDirectoryCleanupThreadForCore-collection1) [n:127.0.0.1:64494_d c:control_collection s:shard1 r:core_node1 x:collection1] o.a.s.c.DirectoryFactory C:\Users\jenkins\workspace\Lucene-Solr-6.0-Windows\solr\build\solr-core\test\J0\temp\solr.cloud.DistribDocExpirationUpdateProcessorTest_AB6AEC9DE9E30E85-001\control-001\cores\collection1\data\ does not point to a valid data directory; skipping clean-up of old index directories.
[junit4] 2> 131850 INFO (coreLoadExecutor-422-thread-1-processing-n:127.0.0.1:64494_d) [n:127.0.0.1:64494_d c:control_collection s:shard1 r:core_node1 x:collection1] o.a.s.u.p.UpdateRequestProcessorChain creating updateRequestProcessorChain "convert-ttl-field"
[junit4] 2> 131889 INFO (coreLoadExecutor-422-thread-1-processing-n:127.0.0.1:64494_d) [n:127.0.0.1:64494_d c:control_collection s:shard1 r:core_node1 x:collection1] o.a.s.u.p.UpdateRequestProcessorChain creating updateRequestProcessorChain "convert-ttl-param"
[junit4] 2> 131889 INFO (coreLoadExecutor-422-thread-1-processing-n:127.0.0.1:64494_d) [n:127.0.0.1:64494_d c:control_collection s:shard1 r:core_node1 x:collection1] o.a.s.u.p.UpdateRequestProcessorChain creating updateRequestProcessorChain "convert-ttl-field-with-param-default"
[junit4] 2> 131889 INFO (coreLoadExecutor-422-thread-1-processing-n:127.0.0.1:64494_d) [n:127.0.0.1:64494_d c:control_collection s:shard1 r:core_node1 x:collection1] o.a.s.u.p.UpdateRequestProcessorChain creating updateRequestProcessorChain "scheduled-delete" (default)
[junit4] 2> 131959 INFO (coreLoadExecutor-422-thread-1-processing-n:127.0.0.1:64494_d) [n:127.0.0.1:64494_d c:control_collection s:shard1 r:core_node1 x:collection1] o.a.s.u.p.UpdateRequestProcessorChain inserting DistributedUpdateProcessorFactory into updateRequestProcessorChain "scheduled-delete" (default)
[junit4] 2> 131965 INFO (coreLoadExecutor-422-thread-1-processing-n:127.0.0.1:64494_d) [n:127.0.0.1:64494_d c:control_collection s:shard1 r:core_node1 x:collection1] o.a.s.h.l.XMLLoader xsltCacheLifetimeSeconds=60
[junit4] 2> 131967 INFO (coreLoadExecutor-422-thread-1-processing-n:127.0.0.1:64494_d) [n:127.0.0.1:64494_d c:control_collection s:shard1 r:core_node1 x:collection1] o.a.s.h.l.XMLLoader xsltCacheLifetimeSeconds=60
[junit4] 2> 131968 INFO (coreLoadExecutor-422-thread-1-processing-n:127.0.0.1:64494_d) [n:127.0.0.1:64494_d c:control_collection s:shard1 r:core_node1 x:collection1] o.a.s.h.l.XMLLoader xsltCacheLifetimeSeconds=60
[junit4] 2> 131970 INFO (coreLoadExecutor-422-thread-1-processing-n:127.0.0.1:64494_d) [n:127.0.0.1:64494_d c:control_collection s:shard1 r:core_node1 x:collection1] o.a.s.h.l.XMLLoader xsltCacheLifetimeSeconds=60
[junit4] 2> 131972 INFO (coreLoadExecutor-422-thread-1-processing-n:127.0.0.1:64494_d) [n:127.0.0.1:64494_d c:control_collection s:shard1 r:core_node1 x:collection1] o.a.s.c.RequestHandlers Registered paths: /admin/mbeans,,/update/csv,/sql,/update/json/docs,/admin/luke,/export,/select,/admin/segments,/get,/admin/system,/replication,/admin/properties,/config,/stream,/schema,/admin/plugins,/admin/logging,/update/json,/admin/ping,/admin/threads,/update,/admin/file
[junit4] 2> 131972 INFO (coreLoadExecutor-422-thread-1-processing-n:127.0.0.1:64494_d) [n:127.0.0.1:64494_d c:control_collection s:shard1 r:core_node1 x:collection1] o.a.s.c.SolrCore Using default statsCache cache: org.apache.solr.search.stats.LocalStatsCache
[junit4] 2> 131973 INFO (coreLoadExecutor-422-thread-1-processing-n:127.0.0.1:64494_d) [n:127.0.0.1:64494_d c:control_collection s:shard1 r:core_node1 x:collection1] o.a.s.u.UpdateHandler Using UpdateLog implementation: org.apache.solr.update.UpdateLog
[junit4] 2> 131973 INFO (coreLoadExecutor-422-thread-1-processing-n:127.0.0.1:64494_d) [n:127.0.0.1:64494_d c:control_collection s:shard1 r:core_node1 x:collection1] o.a.s.u.UpdateLog Initializing UpdateLog: dataDir= defaultSyncLevel=FLUSH numRecordsToKeep=100 maxNumLogsToKeep=10 numVersionBuckets=65536
[junit4] 2> 131975 INFO (coreLoadExecutor-422-thread-1-processing-n:127.0.0.1:64494_d) [n:127.0.0.1:64494_d c:control_collection s:shard1 r:core_node1 x:collection1] o.a.s.u.CommitTracker Hard AutoCommit: disabled
[junit4] 2> 131975 INFO (coreLoadExecutor-422-thread-1-processing-n:127.0.0.1:64494_d) [n:127.0.0.1:64494_d c:control_collection s:shard1 r:core_node1 x:collection1] o.a.s.u.CommitTracker Soft AutoCommit: disabled
[junit4] 2> 131976 INFO (coreLoadExecutor-422-thread-1-processing-n:127.0.0.1:64494_d) [n:127.0.0.1:64494_d c:control_collection s:shard1 r:core_node1 x:collection1] o.a.s.u.RandomMergePolicy RandomMergePolicy wrapping class org.apache.lucene.index.LogDocMergePolicy: [LogDocMergePolicy: minMergeSize=1000, mergeFactor=34, maxMergeSize=9223372036854775807, maxMergeSizeForForcedMerge=9223372036854775807, calibrateSizeByDeletes=true, maxMergeDocs=2147483647, maxCFSSegmentSizeMB=8.796093022207999E12, noCFSRatio=0.6638267746437821]
[junit4] 2> 131976 INFO (coreLoadExecutor-422-thread-1-processing-n:127.0.0.1:64494_d) [n:127.0.0.1:64494_d c:control_collection s:shard1 r:core_node1 x:collection1] o.a.s.c.SolrDeletionPolicy SolrDeletionPolicy.onInit: commits: num=1
[junit4] 2> commit{dir=MockDirectoryWrapper(RAMDirectory@fbcd00 lockFactory=org.apache.lucene.store.SingleInstanceLockFactory@1070e48),segFN=segments_1,generation=1}
[junit4] 2> 131976 INFO (coreLoadExecutor-422-thread-1-processing-n:127.0.0.1:64494_d) [n:127.0.0.1:64494_d c:control_collection s:shard1 r:core_node1 x:collection1] o.a.s.c.SolrDeletionPolicy newest commit generation = 1
[junit4] 2> 131976 INFO (coreLoadExecutor-422-thread-1-processing-n:127.0.0.1:64494_d) [n:127.0.0.1:64494_d c:control_collection s:shard1 r:core_node1 x:collection1] o.a.s.s.SolrIndexSearcher Opening [Searcher@70c30a[collection1] main]
[junit4] 2> 131977 INFO (coreLoadExecutor-422-thread-1-processing-n:127.0.0.1:64494_d) [n:127.0.0.1:64494_d c:control_collection s:shard1 r:core_node1 x:collection1] o.a.s.c.c.ZkStateReader Load collection config from: [/collections/control_collection]
[junit4] 2> 131978 INFO (coreLoadExecutor-422-thread-1-processing-n:127.0.0.1:64494_d) [n:127.0.0.1:64494_d c:control_collection s:shard1 r:core_node1 x:collection1] o.a.s.c.c.ZkStateReader path=[/collections/control_collection] [configName]=[conf1] specified config exists in ZooKeeper
[junit4] 2> 131978 INFO (coreLoadExecutor-422-thread-1-processing-n:127.0.0.1:64494_d) [n:127.0.0.1:64494_d c:control_collection s:shard1 r:core_node1 x:collection1] o.a.s.r.ManagedResourceStorage Setting up ZooKeeper-based storage for the RestManager with znodeBase: /configs/conf1
[junit4] 2> 131979 INFO (coreLoadExecutor-422-thread-1-processing-n:127.0.0.1:64494_d) [n:127.0.0.1:64494_d c:control_collection s:shard1 r:core_node1 x:collection1] o.a.s.r.ManagedResourceStorage Configured ZooKeeperStorageIO with znodeBase: /configs/conf1
[junit4] 2> 131979 INFO (coreLoadExecutor-422-thread-1-processing-n:127.0.0.1:64494_d) [n:127.0.0.1:64494_d c:control_collection s:shard1 r:core_node1 x:collection1] o.a.s.r.RestManager Initializing RestManager with initArgs: {}
[junit4] 2> 131979 INFO (coreLoadExecutor-422-thread-1-processing-n:127.0.0.1:64494_d) [n:127.0.0.1:64494_d c:control_collection s:shard1 r:core_node1 x:collection1] o.a.s.r.ManagedResourceStorage Reading _rest_managed.json using ZooKeeperStorageIO:path=/configs/conf1
[junit4] 2> 131979 INFO (coreLoadExecutor-422-thread-1-processing-n:127.0.0.1:64494_d) [n:127.0.0.1:64494_d c:control_collection s:shard1 r:core_node1 x:collection1] o.a.s.r.ManagedResourceStorage No data found for znode /configs/conf1/_rest_managed.json
[junit4] 2> 131979 INFO (coreLoadExecutor-422-thread-1-processing-n:127.0.0.1:64494_d) [n:127.0.0.1:64494_d c:control_collection s:shard1 r:core_node1 x:collection1] o.a.s.r.ManagedResourceStorage Loaded null at path _rest_managed.json using ZooKeeperStorageIO:path=/configs/conf1
[junit4] 2> 131979 INFO (coreLoadExecutor-422-thread-1-processing-n:127.0.0.1:64494_d) [n:127.0.0.1:64494_d c:control_collection s:shard1 r:core_node1 x:collection1] o.a.s.r.RestManager Initializing 0 registered ManagedResources
[junit4] 2> 131987 INFO (coreLoadExecutor-422-thread-1-processing-n:127.0.0.1:64494_d) [n:127.0.0.1:64494_d c:control_collection s:shard1 r:core_node1 x:collection1] o.a.s.h.ReplicationHandler Commits will be reserved for 10000
[junit4] 2> 131987 INFO (searcherExecutor-423-thread-1-processing-n:127.0.0.1:64494_d x:collection1 s:shard1 c:control_collection r:core_node1) [n:127.0.0.1:64494_d c:control_collection s:shard1 r:core_node1 x:collection1] o.a.s.c.SolrCore [collection1] Registered new searcher Searcher@70c30a[collection1] main{ExitableDirectoryReader(UninvertingDirectoryReader())}
[junit4] 2> 131987 INFO (coreLoadExecutor-422-thread-1-processing-n:127.0.0.1:64494_d) [n:127.0.0.1:64494_d c:control_collection s:shard1 r:core_node1 x:collection1] o.a.s.u.UpdateLog Looking up max value of version field to seed version buckets
[junit4] 2> 131987 INFO (coreLoadExecutor-422-thread-1-processing-n:127.0.0.1:64494_d) [n:127.0.0.1:64494_d c:control_collection s:shard1 r:core_node1 x:collection1] o.a.s.u.VersionInfo Refreshing highest value of _version_ for 65536 version buckets from index
[junit4] 2> 131987 INFO (coreLoadExecutor-422-thread-1-processing-n:127.0.0.1:64494_d) [n:127.0.0.1:64494_d c:control_collection s:shard1 r:core_node1 x:collection1] o.a.s.u.VersionInfo No terms found for _version_, cannot seed version bucket highest value from index
[junit4] 2> 131987 INFO (coreLoadExecutor-422-thread-1-processing-n:127.0.0.1:64494_d) [n:127.0.0.1:64494_d c:control_collection s:shard1 r:core_node1 x:collection1] o.a.s.u.UpdateLog Could not find max version in index or recent updates, using new clock 1531659204043997184
[junit4] 2> 131990 INFO (coreLoadExecutor-422-thread-1-processing-n:127.0.0.1:64494_d) [n:127.0.0.1:64494_d c:control_collection s:shard1 r:core_node1 x:collection1] o.a.s.u.UpdateLog Took 2.0ms to seed version buckets with highest version 1531659204043997184
[junit4] 2> 131990 INFO (coreLoadExecutor-422-thread-1-processing-n:127.0.0.1:64494_d) [n:127.0.0.1:64494_d c:control_collection s:shard1 r:core_node1 x:collection1] o.a.s.c.ZkController watch zkdir /configs/conf1
[junit4] 2> 131990 INFO (coreLoadExecutor-422-thread-1-processing-n:127.0.0.1:64494_d) [n:127.0.0.1:64494_d c:control_collection s:shard1 r:core_node1 x:collection1] o.a.s.c.CoreContainer registering core: collection1
[junit4] 2> 131991 INFO (coreZkRegister-416-thread-1-processing-n:127.0.0.1:64494_d x:collection1 s:shard1 c:control_collection r:core_node1) [n:127.0.0.1:64494_d c:control_collection s:shard1 r:core_node1 x:collection1] o.a.s.c.ZkController Register replica - core:collection1 address:http://127.0.0.1:64494/d collection:control_collection shard:shard1
[junit4] 2> 131993 INFO (coreZkRegister-416-thread-1-processing-n:127.0.0.1:64494_d x:collection1 s:shard1 c:control_collection r:core_node1) [n:127.0.0.1:64494_d c:control_collection s:shard1 r:core_node1 x:collection1] o.a.s.c.c.SolrZkClient makePath: /collections/control_collection/leader_elect/shard1/election
[junit4] 2> 131998 INFO (coreZkRegister-416-thread-1-processing-n:127.0.0.1:64494_d x:collection1 s:shard1 c:control_collection r:core_node1) [n:127.0.0.1:64494_d c:control_collection s:shard1 r:core_node1 x:collection1] o.a.s.c.LeaderElector Joined leadership election with path: /collections/control_collection/leader_elect/shard1/election/95728700107194372-core_node1-n_0000000000
[junit4] 2> 131999 INFO (coreZkRegister-416-thread-1-processing-n:127.0.0.1:64494_d x:collection1 s:shard1 c:control_collection r:core_node1) [n:127.0.0.1:64494_d c:control_collection s:shard1 r:core_node1 x:collection1] o.a.s.c.ShardLeaderElectionContext Running the leader process for shard=shard1 and weAreReplacement=false and leaderVoteWait=10000
[junit4] 2> 132002 INFO (coreZkRegister-416-thread-1-processing-n:127.0.0.1:64494_d x:collection1 s:shard1 c:control_collection r:core_node1) [n:127.0.0.1:64494_d c:control_collection s:shard1 r:core_node1 x:collection1] o.a.s.c.ShardLeaderElectionContext Enough replicas found to continue.
[junit4] 2> 132002 INFO (coreZkRegister-416-thread-1-processing-n:127.0.0.1:64494_d x:collection1 s:shard1 c:control_collection r:core_node1) [n:127.0.0.1:64494_d c:control_collection s:shard1 r:core_node1 x:collection1] o.a.s.c.ShardLeaderElectionContext I may be the new leader - try and sync
[junit4] 2> 132002 INFO (coreZkRegister-416-thread-1-processing-n:127.0.0.1:64494_d x:collection1 s:shard1 c:control_collection r:core_node1) [n:127.0.0.1:64494_d c:control_collection s:shard1 r:core_node1 x:collection1] o.a.s.c.SyncStrategy Sync replicas to http://127.0.0.1:64494/d/collection1/
[junit4] 2> 132003 INFO (coreZkRegister-416-thread-1-processing-n:127.0.0.1:64494_d x:collection1 s:shard1 c:control_collection r:core_node1) [n:127.0.0.1:64494_d c:control_collection s:shard1 r:core_node1 x:collection1] o.a.s.c.SyncStrategy Sync Success - now sync replicas to me
[junit4] 2> 132003 INFO (coreZkRegister-416-thread-1-processing-n:127.0.0.1:64494_d x:collection1 s:shard1 c:control_collection r:core_node1) [n:127.0.0.1:64494_d c:control_collection s:shard1 r:core_node1 x:collection1] o.a.s.c.SyncStrategy http://127.0.0.1:64494/d/collection1/ has no replicas
[junit4] 2> 132003 INFO (OverseerStateUpdate-95728700107194372-127.0.0.1:64494_d-n_0000000000) [n:127.0.0.1:64494_d ] o.a.s.c.Overseer processMessage: queueSize: 1, message = {
[junit4] 2> "operation":"leader",
[junit4] 2> "shard":"shard1",
[junit4] 2> "collection":"control_collection"} current state version: 1
[junit4] 2> 132004 INFO (coreZkRegister-416-thread-1-processing-n:127.0.0.1:64494_d x:collection1 s:shard1 c:control_collection r:core_node1) [n:127.0.0.1:64494_d c:control_collection s:shard1 r:core_node1 x:collection1] o.a.s.c.c.SolrZkClient makePath: /collections/control_collection/leaders/shard1
[junit4] 2> 132008 INFO (coreZkRegister-416-thread-1-processing-n:127.0.0.1:64494_d x:collection1 s:shard1 c:control_collection r:core_node1) [n:127.0.0.1:64494_d c:control_collection s:shard1 r:core_node1 x:collection1] o.a.s.c.ShardLeaderElectionContextBase Creating leader registration node /collections/control_collection/leaders/shard1/leader after winning as /collections/control_collection/leader_elect/shard1/election/95728700107194372-core_node1-n_0000000000
[junit4] 2> 132011 INFO (coreZkRegister-416-thread-1-processing-n:127.0.0.1:64494_d x:collection1 s:shard1 c:control_collection r:core_node1) [n:127.0.0.1:64494_d c:control_collection s:shard1 r:core_node1 x:collection1] o.a.s.c.ShardLeaderElectionContext I am the new leader: http://127.0.0.1:64494/d/collection1/ shard1
[junit4] 2> 132012 INFO (OverseerStateUpdate-95728700107194372-127.0.0.1:64494_d-n_0000000000) [n:127.0.0.1:64494_d ] o.a.s.c.Overseer processMessage: queueSize: 1, message = {
[junit4] 2> "operation":"leader",
[junit4] 2> "shard":"shard1",
[junit4] 2> "collection":"control_collection",
[junit4] 2> "base_url":"http://127.0.0.1:64494/d",
[junit4] 2> "core":"collection1",
[junit4] 2> "state":"active"} current state version: 1
[junit4] 2> 132082 INFO (TEST-DistribDocExpirationUpdateProcessorTest.test-seed#[AB6AEC9DE9E30E85]) [ ] o.a.s.c.c.SolrZkClient Using default ZkCredentialsProvider
[junit4] 2> 132083 INFO (TEST-DistribDocExpirationUpdateProcessorTest.test-seed#[AB6AEC9DE9E30E85]) [ ] o.a.s.c.c.ConnectionManager Waiting for client to connect to ZooKeeper
[junit4] 2> 132085 INFO (zkCallback-126-thread-1) [ ] o.a.s.c.c.ConnectionManager Watcher org.apache.solr.common.cloud.ConnectionManager@39c7c6 name:ZooKeeperConnection Watcher:127.0.0.1:64487/solr got event WatchedEvent state:SyncConnected type:None path:null path:null type:None
[junit4] 2> 132085 INFO (TEST-DistribDocExpirationUpdateProcessorTest.test-seed#[AB6AEC9DE9E30E85]) [ ] o.a.s.c.c.ConnectionManager Client is connected to ZooKeeper
[junit4] 2> 132085 INFO (TEST-DistribDocExpirationUpdateProcessorTest.test-seed#[AB6AEC9DE9E30E85]) [ ] o.a.s.c.c.SolrZkClient Using default ZkACLProvider
[junit4] 2> 132085 INFO (TEST-DistribDocExpirationUpdateProcessorTest.test-seed#[AB6AEC9DE9E30E85]) [ ] o.a.s.c.c.ZkStateReader Updating cluster state from ZooKeeper...
[junit4] 2> 132088 INFO (TEST-DistribDocExpirationUpdateProcessorTest.test-seed#[AB6AEC9DE9E30E85]) [ ] o.a.s.c.c.ZkStateReader Updated live nodes from ZooKeeper... (0) -> (1)
[junit4] 2> 132089 INFO (TEST-DistribDocExpirationUpdateProcessorTest.test-seed#[AB6AEC9DE9E30E85]) [ ] o.a.s.c.ChaosMonkey monkey: init - expire sessions:false cause connection loss:false
[junit4] 2> 132117 INFO (zkCallback-126-thread-1) [ ] o.a.s.c.c.ZkStateReader A cluster state change: [WatchedEvent state:SyncConnected type:NodeDataChanged path:/clusterstate.json], has occurred - updating... (live nodes size: [1])
[junit4] 2> 132118 INFO (zkCallback-124-thread-1-processing-n:127.0.0.1:64494_d) [n:127.0.0.1:64494_d ] o.a.s.c.c.ZkStateReader A cluster state change: [WatchedEvent state:SyncConnected type:NodeDataChanged path:/clusterstate.json], has occurred - updating... (live nodes size: [1])
[junit4] 2> 132162 INFO (coreZkRegister-416-thread-1-processing-n:127.0.0.1:64494_d x:collection1 s:shard1 c:control_collection r:core_node1) [n:127.0.0.1:64494_d c:control_collection s:shard1 r:core_node1 x:collection1] o.a.s.c.ZkController We are http://127.0.0.1:64494/d/collection1/ and leader is http://127.0.0.1:64494/d/collection1/
[junit4] 2> 132162 INFO (coreZkRegister-416-thread-1-processing-n:127.0.0.1:64494_d x:collection1 s:shard1 c:control_collection r:core_node1) [n:127.0.0.1:64494_d c:control_collection s:shard1 r:core_node1 x:collection1] o.a.s.c.ZkController No LogReplay needed for core=collection1 baseURL=http://127.0.0.1:64494/d
[junit4] 2> 132162 INFO (coreZkRegister-416-thread-1-processing-n:127.0.0.1:64494_d x:collection1 s:shard1 c:control_collection r:core_node1) [n:127.0.0.1:64494_d c:control_collection s:shard1 r:core_node1 x:collection1] o.a.s.c.ZkController I am the leader, no recovery necessary
[junit4] 2> 132162 INFO (coreZkRegister-416-thread-1-processing-n:127.0.0.1:64494_d x:collection1 s:shard1 c:control_collection r:core_node1) [n:127.0.0.1:64494_d c:control_collection s:shard1 r:core_node1 x:collection1] o.a.s.c.ZkController publishing state=active
[junit4] 2> 132162 INFO (coreZkRegister-416-thread-1-processing-n:127.0.0.1:64494_d x:collection1 s:shard1 c:control_collection r:core_node1) [n:127.0.0.1:64494_d c:control_collection s:shard1 r:core_node1 x:collection1] o.a.s.c.ZkController numShards not found on descriptor - reading it from system property
[junit4] 2> 132166 INFO (OverseerStateUpdate-95728700107194372-127.0.0.1:64494_d-n_0000000000) [n:127.0.0.1:64494_d ] o.a.s.c.Overseer processMessage: queueSize: 1, message = {
[junit4] 2> "core":"collection1",
[junit4] 2> "core_node_name":"core_node1",
[junit4] 2> "roles":null,
[junit4] 2> "base_url":"http://127.0.0.1:64494/d",
[junit4] 2> "node_name":"127.0.0.1:64494_d",
[junit4] 2> "numShards":"2",
[junit4] 2> "state":"active",
[junit4] 2> "shard":"shard1",
[junit4] 2> "collection":"control_collection",
[junit4] 2> "operation":"state"} current state version: 2
[junit4] 2> 132167 INFO (coreZkRegister-416-thread-1-processing-n:127.0.0.1:64494_d x:collection1 s:shard1 c:control_collection r:core_node1) [n:127.0.0.1:64494_d c:control_collection s:shard1 r:core_node1 x:collection1] o.a.s.c.c.ZkStateReader Updated live nodes from ZooKeeper... (1) -> (1)
[junit4] 2> 132168 INFO (OverseerStateUpdate-95728700107194372-127.0.0.1:64494_d-n_0000000000) [n:127.0.0.1:64494_d ] o.a.s.c.o.ReplicaMutator Update state numShards=2 message={
[junit4] 2> "core":"collection1",
[junit4] 2> "core_node_name":"core_node1",
[junit4] 2> "roles":null,
[junit4] 2> "base_url":"http://127.0.0.1:64494/d",
[junit4] 2> "node_name":"127.0.0.1:64494_d",
[junit4] 2> "numShards":"2",
[junit4] 2> "state":"active",
[junit4] 2> "shard":"shard1",
[junit4] 2> "collection":"control_collection",
[junit4] 2> "operation":"state"}
[junit4] 2> 132273 INFO (zkCallback-124-thread-1-processing-n:127.0.0.1:64494_d) [n:127.0.0.1:64494_d ] o.a.s.c.c.ZkStateReader A cluster state change: [WatchedEvent state:SyncConnected type:NodeDataChanged path:/clusterstate.json], has occurred - updating... (live nodes size: [1])
[junit4] 2> 132273 INFO (zkCallback-126-thread-1) [ ] o.a.s.c.c.ZkStateReader A cluster state change: [WatchedEvent state:SyncConnected type:NodeDataChanged path:/clusterstate.json], has occurred - updating... (live nodes size: [1])
[junit4] 2> 132505 INFO (TEST-DistribDocExpirationUpdateProcessorTest.test-seed#[AB6AEC9DE9E30E85]) [ ] o.a.s.SolrTestCaseJ4 Writing core.properties file to C:\Users\jenkins\workspace\Lucene-Solr-6.0-Windows\solr\build\solr-core\test\J0\temp\solr.cloud.DistribDocExpirationUpdateProcessorTest_AB6AEC9DE9E30E85-001\shard-1-001\cores\collection1
[junit4] 2> 132508 INFO (TEST-DistribDocExpirationUpdateProcessorTest.test-seed#[AB6AEC9DE9E30E85]) [ ] o.a.s.c.AbstractFullDistribZkTestBase create jetty 1 in directory C:\Users\jenkins\workspace\Lucene-Solr-6.0-Windows\solr\build\solr-core\test\J0\temp\solr.cloud.DistribDocExpirationUpdateProcessorTest_AB6AEC9DE9E30E85-001\shard-1-001
[junit4] 2> 132509 INFO (TEST-DistribDocExpirationUpdateProcessorTest.test-seed#[AB6AEC9DE9E30E85]) [ ] o.e.j.s.Server jetty-9.3.8.v20160314
[junit4] 2> 132510 INFO (TEST-DistribDocExpirationUpdateProcessorTest.test-seed#[AB6AEC9DE9E30E85]) [ ] o.e.j.s.h.ContextHandler Started o.e.j.s.ServletContextHandler@15566f1{/d,null,AVAILABLE}
[junit4] 2> 132511 INFO (TEST-DistribDocExpirationUpdateProcessorTest.test-seed#[AB6AEC9DE9E30E85]) [ ] o.e.j.s.ServerConnector Started ServerConnector@1a9f68d{HTTP/1.1,[http/1.1]}{127.0.0.1:64522}
[junit4] 2> 132512 INFO (TEST-DistribDocExpirationUpdateProcessorTest.test-seed#[AB6AEC9DE9E30E85]) [ ] o.e.j.s.Server Started @135757ms
[junit4] 2> 132512 INFO (TEST-DistribDocExpirationUpdateProcessorTest.test-seed#[AB6AEC9DE9E30E85]) [ ] o.a.s.c.s.e.JettySolrRunner Jetty properties: {solr.data.dir=C:\Users\jenkins\workspace\Lucene-Solr-6.0-Windows\solr\build\solr-core\test\J0\temp\solr.cloud.DistribDocExpirationUpdateProcessorTest_AB6AEC9DE9E30E85-001\tempDir-001/jetty1, solrconfig=solrconfig.xml, hostContext=/d, hostPort=64522, coreRootDirectory=C:\Users\jenkins\workspace\Lucene-Solr-6.0-Windows\solr\build\solr-core\test\J0\temp\solr.cloud.DistribDocExpirationUpdateProcessorTest_AB6AEC9DE9E30E85-001\shard-1-001\cores}
[junit4] 2> 132512 INFO (TEST-DistribDocExpirationUpdateProcessorTest.test-seed#[AB6AEC9DE9E30E85]) [ ] o.a.s.s.SolrDispatchFilter SolrDispatchFilter.init(): sun.misc.Launcher$AppClassLoader@1d16e93
[junit4] 2> 132512 INFO (TEST-DistribDocExpirationUpdateProcessorTest.test-seed#[AB6AEC9DE9E30E85]) [ ] o.a.s.c.SolrResourceLoader new SolrResourceLoader for directory: 'C:\Users\jenkins\workspace\Lucene-Solr-6.0-Windows\solr\build\solr-core\test\J0\temp\solr.cloud.DistribDocExpirationUpdateProcessorTest_AB6AEC9DE9E30E85-001\shard-1-001'
[junit4] 2> 132512 INFO (TEST-DistribDocExpirationUpdateProcessorTest.test-seed#[AB6AEC9DE9E30E85]) [ ] o.a.s.c.SolrResourceLoader JNDI not configured for solr (NoInitialContextEx)
[junit4] 2> 132512 INFO (TEST-DistribDocExpirationUpdateProcessorTest.test-seed#[AB6AEC9DE9E30E85]) [ ] o.a.s.c.SolrResourceLoader solr home defaulted to 'solr/' (could not find system property or JNDI)
[junit4] 2> 132513 INFO (TEST-DistribDocExpirationUpdateProcessorTest.test-seed#[AB6AEC9DE9E30E85]) [ ] o.a.s.c.c.SolrZkClient Using default ZkCredentialsProvider
[junit4] 2> 132514 INFO (TEST-DistribDocExpirationUpdateProcessorTest.test-seed#[AB6AEC9DE9E30E85]) [ ] o.a.s.c.c.ConnectionManager Waiting for client to connect to ZooKeeper
[junit4] 2> 132515 INFO (zkCallback-127-thread-1) [ ] o.a.s.c.c.ConnectionManager Watcher org.apache.solr.common.cloud.ConnectionManager@18f7c27 name:ZooKeeperConnection Watcher:127.0.0.1:64487/solr got event WatchedEvent state:SyncConnected type:None path:null path:null type:None
[junit4] 2> 132515 INFO (TEST-DistribDocExpirationUpdateProcessorTest.test-seed#[AB6AEC9DE9E30E85]) [ ] o.a.s.c.c.ConnectionManager Client is connected to ZooKeeper
[junit4] 2> 132515 INFO (TEST-DistribDocExpirationUpdateProcessorTest.test-seed#[AB6AEC9DE9E30E85]) [ ] o.a.s.c.c.SolrZkClient Using default ZkACLProvider
[junit4] 2> 132519 INFO (TEST-DistribDocExpirationUpdateProcessorTest.test-seed#[AB6AEC9DE9E30E85]) [ ] o.a.s.s.SolrDispatchFilter Loading solr.xml from SolrHome (not found in ZooKeeper)
[junit4] 2> 132520 INFO (TEST-DistribDocExpirationUpdateProcessorTest.test-seed#[AB6AEC9DE9E30E85]) [ ] o.a.s.c.SolrXmlConfig Loading container configuration from C:\Users\jenkins\workspace\Lucene-Solr-6.0-Windows\solr\build\solr-core\test\J0\temp\solr.cloud.DistribDocExpirationUpdateProcessorTest_AB6AEC9DE9E30E85-001\shard-1-001\solr.xml
[junit4] 2> 132532 INFO (TEST-DistribDocExpirationUpdateProcessorTest.test-seed#[AB6AEC9DE9E30E85]) [ ] o.a.s.c.CorePropertiesLocator Config-defined core root directory: C:\Users\jenkins\workspace\Lucene-Solr-6.0-Windows\solr\build\solr-core\test\J0\temp\solr.cloud.DistribDocExpirationUpdateProcessorTest_AB6AEC9DE9E30E85-001\shard-1-001\cores
[junit4] 2> 132532 INFO (TEST-DistribDocExpirationUpdateProcessorTest.test-seed#[AB6AEC9DE9E30E85]) [ ] o.a.s.c.CoreContainer New CoreContainer 9394635
[junit4] 2> 132532 INFO (TEST-DistribDocExpirationUpdateProcessorTest.test-seed#[AB6AEC9DE9E30E85]) [ ] o.a.s.c.CoreContainer Loading cores into CoreContainer [instanceDir=C:\Users\jenkins\workspace\Lucene-Solr-6.0-Windows\solr\build\solr-core\test\J0\temp\solr.cloud.DistribDocExpirationUpdateProcessorTest_AB6AEC9DE9E30E85-001\shard-1-001]
[junit4] 2> 132532 WARN (TEST-DistribDocExpirationUpdateProcessorTest.test-seed#[AB6AEC9DE9E30E85]) [ ] o.a.s.c.CoreContainer Couldn't add files from C:\Users\jenkins\workspace\Lucene-Solr-6.0-Windows\solr\build\solr-core\test\J0\temp\solr.cloud.DistribDocExpirationUpdateProcessorTest_AB6AEC9DE9E30E85-001\shard-1-001\lib to classpath: C:\Users\jenkins\workspace\Lucene-Solr-6.0-Windows\solr\build\solr-core\test\J0\temp\solr.cloud.DistribDocExpirationUpdateProcessorTest_AB6AEC9DE9E30E85-001\shard-1-001\lib
[junit4] 2> 132532 INFO (TEST-DistribDocExpirationUpdateProcessorTest.test-seed#[AB6AEC9DE9E30E85]) [ ] o.a.s.h.c.HttpShardHandlerFactory created with socketTimeout : 90000,urlScheme : ,connTimeout : 15000,maxConnectionsPerHost : 20,maxConnections : 10000,corePoolSize : 0,maximumPoolSize : 2147483647,maxThreadIdleTime : 5,sizeOfQueue : -1,fairnessPolicy : false,useRetries : false,
[junit4] 2> 132535 INFO (TEST-DistribDocExpirationUpdateProcessorTest.test-seed#[AB6AEC9DE9E30E85]) [ ] o.a.s.u.UpdateShardHandler Creating UpdateShardHandler HTTP client with params: socketTimeout=340000&connTimeout=45000&retry=true
[junit4] 2> 132536 INFO (TEST-DistribDocExpirationUpdateProcessorTest.test-seed#[AB6AEC9DE9E30E85]) [ ] o.a.s.l.LogWatcher SLF4J impl is org.slf4j.impl.Log4jLoggerFactory
[junit4] 2> 132536 INFO (TEST-DistribDocExpirationUpdateProcessorTest.test-seed#[AB6AEC9DE9E30E85]) [ ] o.a.s.l.LogWatcher Registering Log Listener [Log4j (org.slf4j.impl.Log4jLoggerFactory)]
[junit4] 2> 132536 INFO (TEST-DistribDocExpirationUpdateProcessorTest.test-seed#[AB6AEC9DE9E30E85]) [ ] o.a.s.c.ZkContainer Zookeeper client=127.0.0.1:64487/solr
[junit4] 2> 132536 INFO (TEST-DistribDocExpirationUpdateProcessorTest.test-seed#[AB6AEC9DE9E30E85]) [ ] o.a.s.c.ZkController zkHost includes chroot
[junit4] 2> 132536 INFO (TEST-DistribDocExpirationUpdateProcessorTest.test-seed#[AB6AEC9DE9E30E85]) [ ] o.a.s.c.c.SolrZkClient Using default ZkCredentialsProvider
[junit4] 2> 132537 INFO (TEST-DistribDocExpirationUpdateProcessorTest.test-seed#[AB6AEC9DE9E30E85]) [ ] o.a.s.c.c.ConnectionManager Waiting for client to connect to ZooKeeper
[junit4] 2> 132539 INFO (zkCallback-130-thread-1) [ ] o.a.s.c.c.ConnectionManager Watcher org.apache.solr.common.cloud.ConnectionManager@8b6b71 name:ZooKeeperConnection Watcher:127.0.0.1:64487 got event WatchedEvent state:SyncConnected type:None path:null path:null type:None
[junit4] 2> 132539 INFO (TEST-DistribDocExpirationUpdateProcessorTest.test-seed#[AB6AEC9DE9E30E85]) [ ] o.a.s.c.c.ConnectionManager Client is connected to ZooKeeper
[junit4] 2> 132540 INFO (TEST-DistribDocExpirationUpdateProcessorTest.test-seed#[AB6AEC9DE9E30E85]) [ ] o.a.s.c.c.SolrZkClient Using default ZkACLProvider
[junit4] 2> 132546 INFO (TEST-DistribDocExpirationUpdateProcessorTest.test-seed#[AB6AEC9DE9E30E85]) [n:127.0.0.1:64522_d ] o.a.s.c.c.ConnectionManager Waiting for client to connect to ZooKeeper
[junit4] 2> 132548 INFO (zkCallback-131-thread-1-processing-n:127.0.0.1:64522_d) [n:127.0.0.1:64522_d ] o.a.s.c.c.ConnectionManager Watcher org.apache.solr.common.cloud.ConnectionManager@2c142 name:ZooKeeperConnection Watcher:127.0.0.1:64487/solr got event WatchedEvent state:SyncConnected type:None path:null path:null type:None
[junit4] 2> 132548 INFO (TEST-DistribDocExpirationUpdateProcessorTest.test-seed#[AB6AEC9DE9E30E85]) [n:127.0.0.1:64522_d ] o.a.s.c.c.ConnectionManager Client is connected to ZooKeeper
[junit4] 2> 132560 INFO (TEST-DistribDocExpirationUpdateProcessorTest.test-seed#[AB6AEC9DE9E30E85]) [n:127.0.0.1:64522_d ] o.a.s.c.c.ZkStateReader Updating cluster state from ZooKeeper...
[junit4] 2> 132562 INFO (TEST-DistribDocExpirationUpdateProcessorTest.test-seed#[AB6AEC9DE9E30E85]) [n:127.0.0.1:64522_d ] o.a.s.c.c.ZkStateReader Updated live nodes from ZooKeeper... (0) -> (1)
[junit4] 2> 132567 INFO (TEST-DistribDocExpirationUpdateProcessorTest.test-seed#[AB6AEC9DE9E30E85]) [n:127.0.0.1:64522_d ] o.a.s.c.Overseer Overseer (id=null) closing
[junit4] 2> 132567 INFO (TEST-DistribDocExpirationUpdateProcessorTest.test-seed#[AB6AEC9DE9E30E85]) [n:127.0.0.1:64522_d ] o.a.s.c.LeaderElector Joined leadership election with path: /overseer_elect/election/95728700107194376-127.0.0.1:64522_d-n_0000000001
[junit4] 2> 132569 INFO (TEST-DistribDocExpirationUpdateProcessorTest.test-seed#[AB6AEC9DE9E30E85]) [n:127.0.0.1:64522_d ] o.a.s.c.LeaderElector Watching path /overseer_elect/election/95728700107194372-127.0.0.1:64494_d-n_0000000000 to know if I could be the leader
[junit4] 2> 132569 INFO (TEST-DistribDocExpirationUpdateProcessorTest.test-seed#[AB6AEC9DE9E30E85]) [n:127.0.0.1:64522_d ] o.a.s.c.ZkController Publish node=127.0.0.1:64522_d as DOWN
[junit4] 2> 132572 INFO (OverseerStateUpdate-95728700107194372-127.0.0.1:64494_d-n_0000000000) [n:127.0.0.1:64494_d ] o.a.s.c.Overseer processMessage: queueSize: 1, message = {
[junit4] 2> "operation":"downnode",
[junit4] 2> "node_name":"127.0.0.1:64522_d"} current state version: 3
[junit4] 2> 132572 INFO (OverseerStateUpdate-95728700107194372-127.0.0.1:64494_d-n_0000000000) [n:127.0.0.1:64494_d ] o.a.s.c.o.NodeMutator DownNode state invoked for node: 127.0.0.1:64522_d
[junit4] 2> 132675 INFO (zkCallback-126-thread-1) [ ] o.a.s.c.c.ZkStateReader A cluster state change: [WatchedEvent state:SyncConnected type:NodeDataChanged path:/clusterstate.json], has occurred - updating... (live nodes size: [1])
[junit4] 2> 132675 INFO (zkCallback-131-thread-1-processing-n:127.0.0.1:64522_d) [n:127.0.0.1:64522_d ] o.a.s.c.c.ZkStateReader A cluster state change: [WatchedEvent state:SyncConnected type:NodeDataChanged path:/clusterstate.json], has occurred - updating... (live nodes size: [1])
[junit4] 2> 132676 INFO (zkCallback-124-thread-1-processing-n:127.0.0.1:64494_d) [n:127.0.0.1:64494_d ] o.a.s.c.c.ZkStateReader A cluster state change: [WatchedEvent state:SyncConnected type:NodeDataChanged path:/clusterstate.json], has occurred - updating... (live nodes size: [1])
[junit4] 2> 133572 INFO (TEST-DistribDocExpirationUpdateProcessorTest.test-seed#[AB6AEC9DE9E30E85]) [n:127.0.0.1:64522_d ] o.a.s.c.ZkController Register node as live in ZooKeeper:/live_nodes/127.0.0.1:64522_d
[junit4] 2> 133574 INFO (TEST-DistribDocExpirationUpdateProcessorTest.test-seed#[AB6AEC9DE9E30E85]) [n:127.0.0.1:64522_d ] o.a.s.c.c.SolrZkClient makePath: /live_nodes/127.0.0.1:64522_d
[junit4] 2> 133580 INFO (zkCallback-124-thread-1-processing-n:127.0.0.1:64494_d) [n:127.0.0.1:64494_d ] o.a.s.c.c.ZkStateReader A live node change: [WatchedEvent state:SyncConnected type:NodeChildrenChanged path:/live_nodes], has occurred - updating... (live nodes size: [1])
[junit4] 2> 133580 INFO (zkCallback-131-thread-1-processing-n:127.0.0.1:64522_d) [n:127.0.0.1:64522_d ] o.a.s.c.c.ZkStateReader A live node change: [WatchedEvent state:SyncConnected type:NodeChildrenChanged path:/live_nodes], has occurred - updating... (live nodes size: [1])
[junit4] 2> 133581 INFO (zkCallback-126-thread-1) [ ] o.a.s.c.c.ZkStateReader A live node change: [WatchedEvent state:SyncConnected type:NodeChildrenChanged path:/live_nodes], has occurred - updating... (live nodes size: [1])
[junit4] 2> 133581 INFO (zkCallback-124-thread-1-processing-n:127.0.0.1:64494_d) [n:127.0.0.1:64494_d ] o.a.s.c.c.ZkStateReader Updated live nodes from ZooKeeper... (1) -> (2)
[junit4] 2> 133581 INFO (zkCallback-131-thread-1-processing-n:127.0.0.1:64522_d) [n:127.0.0.1:64522_d ] o.a.s.c.c.ZkStateReader Updated live nodes from ZooKeeper... (1) -> (2)
[junit4] 2> 133581 INFO (zkCallback-126-thread-1) [ ] o.a.s.c.c.ZkStateReader Updated live nodes from ZooKeeper... (1) -> (2)
[junit4] 2> 133607 INFO (TEST-DistribDocExpirationUpdateProcessorTest.test-seed#[AB6AEC9DE9E30E85]) [n:127.0.0.1:64522_d ] o.a.s.c.CoreContainer Security conf doesn't exist. Skipping setup for authorization module.
[junit4] 2> 133607 INFO (TEST-DistribDocExpirationUpdateProcessorTest.test-seed#[AB6AEC9DE9E30E85]) [n:127.0.0.1:64522_d ] o.a.s.c.CoreContainer No authentication plugin used.
[junit4] 2> 133608 INFO (TEST-DistribDocExpirationUpdateProcessorTest.test-seed#[AB6AEC9DE9E30E85]) [n:127.0.0.1:64522_d ] o.a.s.c.CorePropertiesLocator Looking for core definitions underneath C:\Users\jenkins\workspace\Lucene-Solr-6.0-Windows\solr\build\solr-core\test\J0\temp\solr.cloud.DistribDocExpirationUpdateProcessorTest_AB6AEC9DE9E30E85-001\shard-1-001\cores
[junit4] 2> 133610 INFO (TEST-DistribDocExpirationUpdateProcessorTest.test-seed#[AB6AEC9DE9E30E85]) [n:127.0.0.1:64522_d ] o.a.s.c.CoreDescriptor Created CoreDescriptor: {name=collection1, config=solrconfig.xml, transient=false, schema=schema.xml, loadOnStartup=true, configSetProperties=configsetprops.json, collection=collection1, coreNodeName=, dataDir=data\, shard=}
[junit4] 2> 133612 INFO (TEST-DistribDocExpirationUpdateProcessorTest.test-seed#[AB6AEC9DE9E30E85]) [n:127.0.0.1:64522_d ] o.a.s.c.CorePropertiesLocator Found core collection1 in C:\Users\jenkins\workspace\Lucene-Solr-6.0-Windows\solr\build\solr-core\test\J0\temp\solr.cloud.DistribDocExpirationUpdateProcessorTest_AB6AEC9DE9E30E85-001\shard-1-001\cores\collection1
[junit4] 2> 133612 INFO (TEST-DistribDocExpirationUpdateProcessorTest.test-seed#[AB6AEC9DE9E30E85]) [n:127.0.0.1:64522_d ] o.a.s.c.CorePropertiesLocator Found 1 core definitions
[junit4] 2> 133613 INFO (TEST-DistribDocExpirationUpdateProcessorTest.test-seed#[AB6AEC9DE9E30E85]) [n:127.0.0.1:64522_d ] o.a.s.s.SolrDispatchFilter user.dir=C:\Users\jenkins\workspace\Lucene-Solr-6.0-Windows\solr\build\solr-core\test\J0
[junit4] 2> 133613 INFO (TEST-DistribDocExpirationUpdateProcessorTest.test-seed#[AB6AEC9DE9E30E85]) [n:127.0.0.1:64522_d ] o.a.s.s.SolrDispatchFilter SolrDispatchFilter.init() done
[junit4] 2> 133615 INFO (coreLoadExecutor-434-thread-1-processing-n:127.0.0.1:64522_d) [n:127.0.0.1:64522_d c:collection1 x:collection1] o.a.s.c.ZkController publishing state=down
[junit4] 2> 133615 INFO (coreLoadExecutor-434-thread-1-processing-n:127.0.0.1:64522_d) [n:127.0.0.1:64522_d c:collection1 x:collection1] o.a.s.c.ZkController numShards not found on descriptor - reading it from system property
[junit4] 2> 133618 INFO (coreLoadExecutor-434-thread-1-processing-n:127.0.0.1:64522_d) [n:127.0.0.1:64522_d c:collection1 x:collection1] o.a.s.c.ZkController look for our core node name
[junit4] 2> 133618 INFO (OverseerStateUpdate-95728700107194372-127.0.0.1:64494_d-n_0000000000) [n:127.0.0.1:64494_d ] o.a.s.c.Overseer processMessage: queueSize: 1, message = {
[junit4] 2> "core":"collection1",
[junit4] 2> "roles":null,
[junit4] 2> "base_url":"http://127.0.0.1:64522/d",
[junit4] 2> "node_name":"127.0.0.1:64522_d",
[junit4] 2> "numShards":"2",
[junit4] 2> "state":"down",
[junit4] 2> "shard":null,
[junit4] 2> "collection":"collection1",
[junit4] 2> "operation":"state"} current state version: 4
[junit4] 2> 133619 INFO (OverseerStateUpdate-95728700107194372-127.0.0.1:64494_d-n_0000000000) [n:127.0.0.1:64494_d ] o.a.s.c.o.ReplicaMutator Update state numShards=2 message={
[junit4] 2> "core":"collection1",
[junit4] 2> "roles":null,
[junit4] 2> "base_url":"http://127.0.0.1:64522/d",
[junit4] 2> "node_name":"127.0.0.1:64522_d",
[junit4] 2> "numShards":"2",
[junit4] 2> "state":"down",
[junit4] 2> "shard":null,
[junit4] 2> "collection":"collection1",
[junit4] 2> "operation":"state"}
[junit4] 2> 133619 INFO (OverseerStateUpdate-95728700107194372-127.0.0.1:64494_d-n_0000000000) [n:127.0.0.1:64494_d ] o.a.s.c.o.ClusterStateMutator building a new cName: collection1
[junit4] 2> 133619 INFO (OverseerStateUpdate-95728700107194372-127.0.0.1:64494_d-n_0000000000) [n:127.0.0.1:64494_d ] o.a.s.c.o.ReplicaMutator Assigning new node to shard shard=shard2
[junit4] 2> 133724 INFO (zkCallback-126-thread-1) [ ] o.a.s.c.c.ZkStateReader A cluster state change: [WatchedEvent state:SyncConnected type:NodeDataChanged path:/clusterstate.json], has occurred - updating... (live nodes size: [2])
[junit4] 2> 133724 INFO (zkCallback-124-thread-1-processing-n:127.0.0.1:64494_d) [n:127.0.0.1:64494_d ] o.a.s.c.c.ZkStateReader A cluster state change: [WatchedEvent state:SyncConnected type:NodeDataChanged path:/clusterstate.json], has occurred - updating... (live nodes size: [2])
[junit4] 2> 133724 INFO (zkCallback-131-thread-1-processing-n:127.0.0.1:64522_d) [n:127.0.0.1:64522_d ] o.a.s.c.c.ZkStateReader A cluster state change: [WatchedEvent state:SyncConnected type:NodeDataChanged path:/clusterstate.json], has occurred - updating... (live nodes size: [2])
[junit4] 2> 134618 INFO (coreLoadExecutor-434-thread-1-processing-n:127.0.0.1:64522_d) [n:127.0.0.1:64522_d c:collection1 x:collection1] o.a.s.c.ZkController waiting to find shard id in clusterstate for collection1
[junit4] 2> 134618 INFO (coreLoadExecutor-434-thread-1-processing-n:127.0.0.1:64522_d) [n:127.0.0.1:64522_d c:collection1 x:collection1] o.a.s.c.ZkController Check for collection zkNode:collection1
[junit4] 2> 134618 INFO (coreLoadExecutor-434-thread-1-processing-n:127.0.0.1:64522_d) [n:127.0.0.1:64522_d c:collection1 x:collection1] o.a.s.c.ZkController Collection zkNode exists
[junit4] 2> 134618 INFO (coreLoadExecutor-434-thread-1-processing-n:127.0.0.1:64522_d) [n:127.0.0.1:64522_d c:collection1 x:collection1] o.a.s.c.c.ZkStateReader Load collection config from: [/collections/collection1]
[junit4] 2> 134619 INFO (coreLoadExecutor-434-thread-1-processing-n:127.0.0.1:64522_d) [n:127.0.0.1:64522_d c:collection1 x:collection1] o.a.s.c.c.ZkStateReader path=[/collections/collection1] [configName]=[conf1] specified config exists in ZooKeeper
[junit4] 2> 134620 INFO (coreLoadExecutor-434-thread-1-processing-n:127.0.0.1:64522_d) [n:127.0.0.1:64522_d c:collection1 x:collection1] o.a.s.c.SolrResourceLoader new SolrResourceLoader for directory: 'C:\Users\jenkins\workspace\Lucene-Solr-6.0-Windows\solr\build\solr-core\test\J0\temp\solr.cloud.DistribDocExpirationUpdateProcessorTest_AB6AEC9DE9E30E85-001\shard-1-001\cores\collection1'
[junit4] 2> 134620 INFO (coreLoadExecutor-434-thread-1-processing-n:127.0.0.1:64522_d) [n:127.0.0.1:64522_d c:collection1 x:collection1] o.a.s.c.SolrResourceLoader JNDI not configured for solr (NoInitialContextEx)
[junit4] 2> 134620 INFO (coreLoadExecutor-434-thread-1-processing-n:127.0.0.1:64522_d) [n:127.0.0.1:64522_d c:collection1 x:collection1] o.a.s.c.SolrResourceLoader solr home defaulted to 'solr/' (could not find system property or JNDI)
[junit4] 2> 134622 INFO (coreLoadExecutor-434-thread-1-processing-n:127.0.0.1:64522_d) [n:127.0.0.1:64522_d c:collection1 x:collection1] o.a.s.c.Config loaded config solrconfig.xml with version 0
[junit4] 2> 134634 INFO (coreLoadExecutor-434-thread-1-processing-n:127.0.0.1:64522_d) [n:127.0.0.1:64522_d c:collection1 x:collection1] o.a.s.c.SolrConfig current version of requestparams : -1
[junit4] 2> 134639 INFO (coreLoadExecutor-434-thread-1-processing-n:127.0.0.1:64522_d) [n:127.0.0.1:64522_d c:collection1 x:collection1] o.a.s.c.SolrConfig Using Lucene MatchVersion: 6.0.0
[junit4] 2> 134646 INFO (coreLoadExecutor-434-thread-1-processing-n:127.0.0.1:64522_d) [n:127.0.0.1:64522_d c:collection1 x:collection1] o.a.s.
[...truncated too long message...]
:collection1] o.a.s.c.CachingDirectoryFactory Closing directory: C:\Users\jenkins\workspace\Lucene-Solr-6.0-Windows\solr\build\solr-core\test\J1\temp\solr.search.join.BlockJoinFacetDistribTest_AB6AEC9DE9E30E85-001\tempDir-001\shard2\cores\collection1\data\index
[junit4] 2> 3323950 INFO (TEST-BlockJoinFacetDistribTest.test-seed#[AB6AEC9DE9E30E85]) [ ] o.e.j.s.h.ContextHandler Stopped o.e.j.s.ServletContextHandler@14facf2{/ucy/py,null,UNAVAILABLE}
[junit4] 2> 3324032 INFO (SUITE-BlockJoinFacetDistribTest-seed#[AB6AEC9DE9E30E85]-worker) [ ] o.a.s.SolrTestCaseJ4 ###deleteCore
[junit4] 2> NOTE: test params are: codec=CheapBastard, sim=RandomSimilarity(queryNorm=false,coord=no): {}, locale=de-LU, timezone=Asia/Bishkek
[junit4] 2> NOTE: Windows 10 10.0 x86/Oracle Corporation 1.8.0_72 (32-bit)/cpus=3,threads=1,free=144491696,total=463994880
[junit4] 2> NOTE: All tests run in this JVM: [RequestHandlersTest, TestConfigSetsAPI, TestSolrDeletionPolicy2, TestCloudPivotFacet, HdfsRecoverLeaseTest, TestCollationFieldDocValues, BlockJoinFacetRandomTest, HdfsCollectionsAPIDistributedZkTest, IndexSchemaRuntimeFieldTest, WordBreakSolrSpellCheckerTest, TestPerFieldSimilarity, PluginInfoTest, ChaosMonkeySafeLeaderTest, BJQParserTest, TestUseDocValuesAsStored2, FileUtilsTest, TestExactSharedStatsCache, LeaderInitiatedRecoveryOnCommitTest, TestSortingResponseWriter, DocExpirationUpdateProcessorFactoryTest, DistribCursorPagingTest, InfoHandlerTest, StressHdfsTest, TestLeaderInitiatedRecoveryThread, TestTrackingShardHandlerFactory, TestBinaryResponseWriter, BasicFunctionalityTest, HdfsRestartWhileUpdatingTest, DirectUpdateHandlerOptimizeTest, TestDistributedMissingSort, NotRequiredUniqueKeyTest, SolrIndexSplitterTest, TestSha256AuthenticationProvider, ConnectionReuseTest, DistributedTermsComponentTest, AnalyticsQueryTest, DataDrivenBlockJoinTest, DistanceUnitsTest, TestFuzzyAnalyzedSuggestions, DistributedQueryComponentCustomSortTest, SpellCheckComponentTest, VersionInfoTest, TestReversedWildcardFilterFactory, TestQuerySenderListener, NumericFieldsTest, TestRecoveryHdfs, TestSchemaManager, TestConfigSetProperties, DistributedIntervalFacetingTest, TestBadConfig, TestLRUStatsCache, TestRTGBase, TestReload, TestSQLHandler, LeaderElectionIntegrationTest, TestSolrQueryParserResource, DeleteShardTest, SuggesterTest, RulesTest, TestExceedMaxTermLength, CurrencyFieldOpenExchangeTest, TestNonDefinedSimilarityFactory, CollectionsAPISolrJTest, SuggestComponentTest, TestDistributedGrouping, HttpPartitionTest, DistributedExpandComponentTest, FileBasedSpellCheckerTest, TestMiniSolrCloudClusterBase, SmileWriterTest, TestScoreJoinQPScore, TestTrieFacet, DateMathParserTest, CopyFieldTest, RequestLoggingTest, TestDynamicLoading, TestComplexPhraseQParserPlugin, RAMDirectoryFactoryTest, TestQueryUtils, TestFiltering, TestSystemIdResolver, TestSolrIndexConfig, TestSchemaSimilarityResource, CheckHdfsIndexTest, OpenCloseCoreStressTest, TestSolrQueryParser, UpdateRequestProcessorFactoryTest, StatsComponentTest, CdcrVersionReplicationTest, ConjunctionSolrSpellCheckerTest, TestCharFilters, CleanupOldIndexTest, SolrCmdDistributorTest, BufferStoreTest, CSVRequestHandlerTest, TestExpandComponent, TestConfigSetsAPIZkFailure, ShowFileRequestHandlerTest, TestCSVResponseWriter, ReplicationFactorTest, BadIndexSchemaTest, TestRTimerTree, SparseHLLTest, TestJsonFacets, TestSolrDynamicMBean, CollectionTooManyReplicasTest, TestFastOutputStream, BinaryUpdateRequestHandlerTest, TestSerializedLuceneMatchVersion, MergeStrategyTest, TestConfigReload, TestSolrJ, CollectionsAPIDistributedZkTest, AnalysisErrorHandlingTest, TestExclusionRuleCollectionAccess, OutOfBoxZkACLAndCredentialsProvidersTest, TestShardHandlerFactory, TermVectorComponentTest, CacheHeaderTest, TestBM25SimilarityFactory, OutputWriterTest, BlockCacheTest, TestNoOpRegenerator, TestBulkSchemaAPI, HdfsBasicDistributedZk2Test, SynonymTokenizerTest, DateFieldTest, TestBlendedInfixSuggestions, TestSmileRequest, GraphQueryTest, SuggesterWFSTTest, AtomicUpdatesTest, TestRandomFaceting, ResourceLoaderTest, TestFieldTypeCollectionResource, FieldAnalysisRequestHandlerTest, SearchHandlerTest, ZkNodePropsTest, TestRealTimeGet, RecoveryAfterSoftCommitTest, TestFreeTextSuggestions, BasicDistributedZk2Test, UnloadDistributedZkTest, SyncSliceTest, BasicZkTest, FullSolrCloudDistribCmdsTest, ClusterStateUpdateTest, ZkSolrClientTest, TestZkChroot, ShardRoutingCustomTest, TestDistributedSearch, TestSolr4Spatial, TestGroupingSearch, ConvertedLegacyTest, TestIndexSearcher, HighlighterTest, DistributedQueryElevationComponentTest, SignatureUpdateProcessorFactoryTest, SpellCheckCollatorTest, TestFoldingMultitermQuery, DocValuesTest, TestAtomicUpdateErrorCases, DefaultValueUpdateProcessorTest, SortByFunctionTest, DocValuesMultiTest, TestSolrDeletionPolicy1, SolrInfoMBeanTest, LukeRequestHandlerTest, TestOmitPositions, DocumentBuilderTest, PathHierarchyTokenizerFactoryTest, MoreLikeThisHandlerTest, TestArbitraryIndexDir, LoggingHandlerTest, SolrPluginUtilsTest, TestCollationField, MBeansHandlerTest, JsonLoaderTest, TestComponentsName, TestLFUCache, TestLMJelinekMercerSimilarityFactory, TimeZoneUtilsTest, OpenExchangeRatesOrgProviderTest, TestSuggestSpellingConverter, CursorPagingTest, TestSimpleTrackingShardHandler, AsyncCallRequestStatusResponseTest, BaseCdcrDistributedZkTest, CdcrReplicationHandlerTest, CdcrRequestHandlerTest, CloudExitableDirectoryReaderTest, ConcurrentDeleteAndCreateCollectionTest, ConfigSetsAPITest, CustomCollectionTest, DistribJoinFromCollectionTest, DistributedVersionInfoTest, MigrateRouteKeyTest, OverriddenZkACLAndCredentialsProvidersTest, OverseerCollectionConfigSetProcessorTest, OverseerRolesTest, SSLMigrationTest, SaslZkACLProviderTest, SolrXmlInZkTest, TestCloudDeleteByQuery, TestDownShardTolerantSearch, TestMiniSolrCloudClusterSSL, TestRandomRequestDistribution, TestReplicaProperties, TestRequestForwarding, TestSizeLimitedDistributedMap, TlogReplayBufferedWhileIndexingTest, TriLevelCompositeIdRoutingTest, ZkStateWriterTest, CachingDirectoryFactoryTest, TestReplicationHandlerBackup, TestRestoreCore, TestSolrConfigHandlerCloud, DistributedFacetPivotSmallTest, DistributedQueryComponentOptimizationTest, SuggestComponentContextFilterQueryTest, TestDistributedStatsComponentCardinality, TestManagedSchema, AnalyticsMergeStrategyTest, SortSpecParsingTest, TestAddFieldRealTimeGet, TestFieldSortValues, TestFilteredDocIdSet, TestHashQParserPlugin, TestMaxScoreQueryParser, TestOverriddenPrefixQueryForCustomFieldType, TestQueryWrapperFilter, TestReRankQParserPlugin, TestSearcherReuse, TestStandardQParsers, TestStressUserVersions, TestMinMaxOnMultiValuedField, TestOrdValues, BlockJoinFacetDistribTest]
[junit4] 2> NOTE: reproduce with: ant test -Dtestcase=BlockJoinFacetDistribTest -Dtests.seed=AB6AEC9DE9E30E85 -Dtests.slow=true -Dtests.locale=de-LU -Dtests.timezone=Asia/Bishkek -Dtests.asserts=true -Dtests.file.encoding=ISO-8859-1
[junit4] ERROR 0.00s J1 | BlockJoinFacetDistribTest (suite) <<<
[junit4] > Throwable #1: java.io.IOException: Could not remove the following files (in the order of attempts):
[junit4] > C:\Users\jenkins\workspace\Lucene-Solr-6.0-Windows\solr\build\solr-core\test\J1\temp\solr.search.join.BlockJoinFacetDistribTest_AB6AEC9DE9E30E85-001\tempDir-001\shard0\collection1: java.nio.file.DirectoryNotEmptyException: C:\Users\jenkins\workspace\Lucene-Solr-6.0-Windows\solr\build\solr-core\test\J1\temp\solr.search.join.BlockJoinFacetDistribTest_AB6AEC9DE9E30E85-001\tempDir-001\shard0\collection1
[junit4] > C:\Users\jenkins\workspace\Lucene-Solr-6.0-Windows\solr\build\solr-core\test\J1\temp\solr.search.join.BlockJoinFacetDistribTest_AB6AEC9DE9E30E85-001\tempDir-001\shard0: java.nio.file.DirectoryNotEmptyException: C:\Users\jenkins\workspace\Lucene-Solr-6.0-Windows\solr\build\solr-core\test\J1\temp\solr.search.join.BlockJoinFacetDistribTest_AB6AEC9DE9E30E85-001\tempDir-001\shard0
[junit4] > C:\Users\jenkins\workspace\Lucene-Solr-6.0-Windows\solr\build\solr-core\test\J1\temp\solr.search.join.BlockJoinFacetDistribTest_AB6AEC9DE9E30E85-001\tempDir-001: java.nio.file.DirectoryNotEmptyException: C:\Users\jenkins\workspace\Lucene-Solr-6.0-Windows\solr\build\solr-core\test\J1\temp\solr.search.join.BlockJoinFacetDistribTest_AB6AEC9DE9E30E85-001\tempDir-001
[junit4] > at __randomizedtesting.SeedInfo.seed([AB6AEC9DE9E30E85]:0)
[junit4] > at org.apache.lucene.util.IOUtils.rm(IOUtils.java:323)
[junit4] > at java.lang.Thread.run(Thread.java:745)
[junit4] Completed [547/579 (2!)] on J1 in 15.08s, 1 test, 1 error <<< FAILURES!
[...truncated 113 lines...]
BUILD FAILED
C:\Users\jenkins\workspace\Lucene-Solr-6.0-Windows\build.xml:740: The following error occurred while executing this line:
C:\Users\jenkins\workspace\Lucene-Solr-6.0-Windows\build.xml:684: The following error occurred while executing this line:
C:\Users\jenkins\workspace\Lucene-Solr-6.0-Windows\build.xml:59: The following error occurred while executing this line:
C:\Users\jenkins\workspace\Lucene-Solr-6.0-Windows\solr\build.xml:233: The following error occurred while executing this line:
C:\Users\jenkins\workspace\Lucene-Solr-6.0-Windows\solr\common-build.xml:527: The following error occurred while executing this line:
C:\Users\jenkins\workspace\Lucene-Solr-6.0-Windows\lucene\common-build.xml:1457: The following error occurred while executing this line:
C:\Users\jenkins\workspace\Lucene-Solr-6.0-Windows\lucene\common-build.xml:1014: There were test failures: 579 suites (10 ignored), 2309 tests, 1 suite-level error, 1 failure, 123 ignored (79 assumptions) [seed: AB6AEC9DE9E30E85]
Total time: 75 minutes 8 seconds
Build step 'Invoke Ant' marked build as failure
Archiving artifacts
[WARNINGS] Skipping publisher since build result is FAILURE
Recording test results
Email was triggered for: Failure - Any
Sending email for trigger: Failure - Any