You are viewing a plain text version of this content. The canonical link for it is here.
Posted to dev@lucene.apache.org by Policeman Jenkins Server <je...@thetaphi.de> on 2016/03/16 17:55:25 UTC
[JENKINS-EA] Lucene-Solr-6.x-Linux (64bit/jdk-9-ea+109) - Build #
145 - Failure!
Build: http://jenkins.thetaphi.de/job/Lucene-Solr-6.x-Linux/145/
Java: 64bit/jdk-9-ea+109 -XX:+UseCompressedOops -XX:+UseG1GC
3 tests failed.
FAILED: junit.framework.TestSuite.org.apache.solr.cloud.SaslZkACLProviderTest
Error Message:
5 threads leaked from SUITE scope at org.apache.solr.cloud.SaslZkACLProviderTest: 1) Thread[id=6393, name=kdcReplayCache.data, state=TIMED_WAITING, group=TGRP-SaslZkACLProviderTest] at jdk.internal.misc.Unsafe.park(Native Method) at java.util.concurrent.locks.LockSupport.parkNanos(LockSupport.java:230) at java.util.concurrent.locks.AbstractQueuedSynchronizer$ConditionObject.awaitNanos(AbstractQueuedSynchronizer.java:2106) at java.util.concurrent.ScheduledThreadPoolExecutor$DelayedWorkQueue.take(ScheduledThreadPoolExecutor.java:1131) at java.util.concurrent.ScheduledThreadPoolExecutor$DelayedWorkQueue.take(ScheduledThreadPoolExecutor.java:848) at java.util.concurrent.ThreadPoolExecutor.getTask(ThreadPoolExecutor.java:1083) at java.util.concurrent.ThreadPoolExecutor.runWorker(ThreadPoolExecutor.java:1143) at java.util.concurrent.ThreadPoolExecutor$Worker.run(ThreadPoolExecutor.java:632) at java.lang.Thread.run(Thread.java:804) 2) Thread[id=6392, name=changePwdReplayCache.data, state=TIMED_WAITING, group=TGRP-SaslZkACLProviderTest] at jdk.internal.misc.Unsafe.park(Native Method) at java.util.concurrent.locks.LockSupport.parkNanos(LockSupport.java:230) at java.util.concurrent.locks.AbstractQueuedSynchronizer$ConditionObject.awaitNanos(AbstractQueuedSynchronizer.java:2106) at java.util.concurrent.ScheduledThreadPoolExecutor$DelayedWorkQueue.take(ScheduledThreadPoolExecutor.java:1131) at java.util.concurrent.ScheduledThreadPoolExecutor$DelayedWorkQueue.take(ScheduledThreadPoolExecutor.java:848) at java.util.concurrent.ThreadPoolExecutor.getTask(ThreadPoolExecutor.java:1083) at java.util.concurrent.ThreadPoolExecutor.runWorker(ThreadPoolExecutor.java:1143) at java.util.concurrent.ThreadPoolExecutor$Worker.run(ThreadPoolExecutor.java:632) at java.lang.Thread.run(Thread.java:804) 3) Thread[id=6390, name=apacheds, state=WAITING, group=TGRP-SaslZkACLProviderTest] at java.lang.Object.wait(Native Method) at java.lang.Object.wait(Object.java:516) at java.util.TimerThread.mainLoop(Timer.java:526) at java.util.TimerThread.run(Timer.java:505) 4) Thread[id=6391, name=groupCache.data, state=TIMED_WAITING, group=TGRP-SaslZkACLProviderTest] at jdk.internal.misc.Unsafe.park(Native Method) at java.util.concurrent.locks.LockSupport.parkNanos(LockSupport.java:230) at java.util.concurrent.locks.AbstractQueuedSynchronizer$ConditionObject.awaitNanos(AbstractQueuedSynchronizer.java:2106) at java.util.concurrent.ScheduledThreadPoolExecutor$DelayedWorkQueue.take(ScheduledThreadPoolExecutor.java:1131) at java.util.concurrent.ScheduledThreadPoolExecutor$DelayedWorkQueue.take(ScheduledThreadPoolExecutor.java:848) at java.util.concurrent.ThreadPoolExecutor.getTask(ThreadPoolExecutor.java:1083) at java.util.concurrent.ThreadPoolExecutor.runWorker(ThreadPoolExecutor.java:1143) at java.util.concurrent.ThreadPoolExecutor$Worker.run(ThreadPoolExecutor.java:632) at java.lang.Thread.run(Thread.java:804) 5) Thread[id=6394, name=ou=system.data, state=TIMED_WAITING, group=TGRP-SaslZkACLProviderTest] at jdk.internal.misc.Unsafe.park(Native Method) at java.util.concurrent.locks.LockSupport.parkNanos(LockSupport.java:230) at java.util.concurrent.locks.AbstractQueuedSynchronizer$ConditionObject.awaitNanos(AbstractQueuedSynchronizer.java:2106) at java.util.concurrent.ScheduledThreadPoolExecutor$DelayedWorkQueue.take(ScheduledThreadPoolExecutor.java:1131) at java.util.concurrent.ScheduledThreadPoolExecutor$DelayedWorkQueue.take(ScheduledThreadPoolExecutor.java:848) at java.util.concurrent.ThreadPoolExecutor.getTask(ThreadPoolExecutor.java:1083) at java.util.concurrent.ThreadPoolExecutor.runWorker(ThreadPoolExecutor.java:1143) at java.util.concurrent.ThreadPoolExecutor$Worker.run(ThreadPoolExecutor.java:632) at java.lang.Thread.run(Thread.java:804)
Stack Trace:
com.carrotsearch.randomizedtesting.ThreadLeakError: 5 threads leaked from SUITE scope at org.apache.solr.cloud.SaslZkACLProviderTest:
1) Thread[id=6393, name=kdcReplayCache.data, state=TIMED_WAITING, group=TGRP-SaslZkACLProviderTest]
at jdk.internal.misc.Unsafe.park(Native Method)
at java.util.concurrent.locks.LockSupport.parkNanos(LockSupport.java:230)
at java.util.concurrent.locks.AbstractQueuedSynchronizer$ConditionObject.awaitNanos(AbstractQueuedSynchronizer.java:2106)
at java.util.concurrent.ScheduledThreadPoolExecutor$DelayedWorkQueue.take(ScheduledThreadPoolExecutor.java:1131)
at java.util.concurrent.ScheduledThreadPoolExecutor$DelayedWorkQueue.take(ScheduledThreadPoolExecutor.java:848)
at java.util.concurrent.ThreadPoolExecutor.getTask(ThreadPoolExecutor.java:1083)
at java.util.concurrent.ThreadPoolExecutor.runWorker(ThreadPoolExecutor.java:1143)
at java.util.concurrent.ThreadPoolExecutor$Worker.run(ThreadPoolExecutor.java:632)
at java.lang.Thread.run(Thread.java:804)
2) Thread[id=6392, name=changePwdReplayCache.data, state=TIMED_WAITING, group=TGRP-SaslZkACLProviderTest]
at jdk.internal.misc.Unsafe.park(Native Method)
at java.util.concurrent.locks.LockSupport.parkNanos(LockSupport.java:230)
at java.util.concurrent.locks.AbstractQueuedSynchronizer$ConditionObject.awaitNanos(AbstractQueuedSynchronizer.java:2106)
at java.util.concurrent.ScheduledThreadPoolExecutor$DelayedWorkQueue.take(ScheduledThreadPoolExecutor.java:1131)
at java.util.concurrent.ScheduledThreadPoolExecutor$DelayedWorkQueue.take(ScheduledThreadPoolExecutor.java:848)
at java.util.concurrent.ThreadPoolExecutor.getTask(ThreadPoolExecutor.java:1083)
at java.util.concurrent.ThreadPoolExecutor.runWorker(ThreadPoolExecutor.java:1143)
at java.util.concurrent.ThreadPoolExecutor$Worker.run(ThreadPoolExecutor.java:632)
at java.lang.Thread.run(Thread.java:804)
3) Thread[id=6390, name=apacheds, state=WAITING, group=TGRP-SaslZkACLProviderTest]
at java.lang.Object.wait(Native Method)
at java.lang.Object.wait(Object.java:516)
at java.util.TimerThread.mainLoop(Timer.java:526)
at java.util.TimerThread.run(Timer.java:505)
4) Thread[id=6391, name=groupCache.data, state=TIMED_WAITING, group=TGRP-SaslZkACLProviderTest]
at jdk.internal.misc.Unsafe.park(Native Method)
at java.util.concurrent.locks.LockSupport.parkNanos(LockSupport.java:230)
at java.util.concurrent.locks.AbstractQueuedSynchronizer$ConditionObject.awaitNanos(AbstractQueuedSynchronizer.java:2106)
at java.util.concurrent.ScheduledThreadPoolExecutor$DelayedWorkQueue.take(ScheduledThreadPoolExecutor.java:1131)
at java.util.concurrent.ScheduledThreadPoolExecutor$DelayedWorkQueue.take(ScheduledThreadPoolExecutor.java:848)
at java.util.concurrent.ThreadPoolExecutor.getTask(ThreadPoolExecutor.java:1083)
at java.util.concurrent.ThreadPoolExecutor.runWorker(ThreadPoolExecutor.java:1143)
at java.util.concurrent.ThreadPoolExecutor$Worker.run(ThreadPoolExecutor.java:632)
at java.lang.Thread.run(Thread.java:804)
5) Thread[id=6394, name=ou=system.data, state=TIMED_WAITING, group=TGRP-SaslZkACLProviderTest]
at jdk.internal.misc.Unsafe.park(Native Method)
at java.util.concurrent.locks.LockSupport.parkNanos(LockSupport.java:230)
at java.util.concurrent.locks.AbstractQueuedSynchronizer$ConditionObject.awaitNanos(AbstractQueuedSynchronizer.java:2106)
at java.util.concurrent.ScheduledThreadPoolExecutor$DelayedWorkQueue.take(ScheduledThreadPoolExecutor.java:1131)
at java.util.concurrent.ScheduledThreadPoolExecutor$DelayedWorkQueue.take(ScheduledThreadPoolExecutor.java:848)
at java.util.concurrent.ThreadPoolExecutor.getTask(ThreadPoolExecutor.java:1083)
at java.util.concurrent.ThreadPoolExecutor.runWorker(ThreadPoolExecutor.java:1143)
at java.util.concurrent.ThreadPoolExecutor$Worker.run(ThreadPoolExecutor.java:632)
at java.lang.Thread.run(Thread.java:804)
at __randomizedtesting.SeedInfo.seed([C3E978CEAF38652B]:0)
FAILED: junit.framework.TestSuite.org.apache.solr.cloud.SaslZkACLProviderTest
Error Message:
There are still zombie threads that couldn't be terminated: 1) Thread[id=6393, name=kdcReplayCache.data, state=TIMED_WAITING, group=TGRP-SaslZkACLProviderTest] at jdk.internal.misc.Unsafe.park(Native Method) at java.util.concurrent.locks.LockSupport.parkNanos(LockSupport.java:230) at java.util.concurrent.locks.AbstractQueuedSynchronizer$ConditionObject.awaitNanos(AbstractQueuedSynchronizer.java:2106) at java.util.concurrent.ScheduledThreadPoolExecutor$DelayedWorkQueue.take(ScheduledThreadPoolExecutor.java:1131) at java.util.concurrent.ScheduledThreadPoolExecutor$DelayedWorkQueue.take(ScheduledThreadPoolExecutor.java:848) at java.util.concurrent.ThreadPoolExecutor.getTask(ThreadPoolExecutor.java:1083) at java.util.concurrent.ThreadPoolExecutor.runWorker(ThreadPoolExecutor.java:1143) at java.util.concurrent.ThreadPoolExecutor$Worker.run(ThreadPoolExecutor.java:632) at java.lang.Thread.run(Thread.java:804) 2) Thread[id=6392, name=changePwdReplayCache.data, state=TIMED_WAITING, group=TGRP-SaslZkACLProviderTest] at jdk.internal.misc.Unsafe.park(Native Method) at java.util.concurrent.locks.LockSupport.parkNanos(LockSupport.java:230) at java.util.concurrent.locks.AbstractQueuedSynchronizer$ConditionObject.awaitNanos(AbstractQueuedSynchronizer.java:2106) at java.util.concurrent.ScheduledThreadPoolExecutor$DelayedWorkQueue.take(ScheduledThreadPoolExecutor.java:1131) at java.util.concurrent.ScheduledThreadPoolExecutor$DelayedWorkQueue.take(ScheduledThreadPoolExecutor.java:848) at java.util.concurrent.ThreadPoolExecutor.getTask(ThreadPoolExecutor.java:1083) at java.util.concurrent.ThreadPoolExecutor.runWorker(ThreadPoolExecutor.java:1143) at java.util.concurrent.ThreadPoolExecutor$Worker.run(ThreadPoolExecutor.java:632) at java.lang.Thread.run(Thread.java:804) 3) Thread[id=6390, name=apacheds, state=WAITING, group=TGRP-SaslZkACLProviderTest] at java.lang.Object.wait(Native Method) at java.lang.Object.wait(Object.java:516) at java.util.TimerThread.mainLoop(Timer.java:526) at java.util.TimerThread.run(Timer.java:505) 4) Thread[id=6391, name=groupCache.data, state=TIMED_WAITING, group=TGRP-SaslZkACLProviderTest] at jdk.internal.misc.Unsafe.park(Native Method) at java.util.concurrent.locks.LockSupport.parkNanos(LockSupport.java:230) at java.util.concurrent.locks.AbstractQueuedSynchronizer$ConditionObject.awaitNanos(AbstractQueuedSynchronizer.java:2106) at java.util.concurrent.ScheduledThreadPoolExecutor$DelayedWorkQueue.take(ScheduledThreadPoolExecutor.java:1131) at java.util.concurrent.ScheduledThreadPoolExecutor$DelayedWorkQueue.take(ScheduledThreadPoolExecutor.java:848) at java.util.concurrent.ThreadPoolExecutor.getTask(ThreadPoolExecutor.java:1083) at java.util.concurrent.ThreadPoolExecutor.runWorker(ThreadPoolExecutor.java:1143) at java.util.concurrent.ThreadPoolExecutor$Worker.run(ThreadPoolExecutor.java:632) at java.lang.Thread.run(Thread.java:804) 5) Thread[id=6394, name=ou=system.data, state=TIMED_WAITING, group=TGRP-SaslZkACLProviderTest] at jdk.internal.misc.Unsafe.park(Native Method) at java.util.concurrent.locks.LockSupport.parkNanos(LockSupport.java:230) at java.util.concurrent.locks.AbstractQueuedSynchronizer$ConditionObject.awaitNanos(AbstractQueuedSynchronizer.java:2106) at java.util.concurrent.ScheduledThreadPoolExecutor$DelayedWorkQueue.take(ScheduledThreadPoolExecutor.java:1131) at java.util.concurrent.ScheduledThreadPoolExecutor$DelayedWorkQueue.take(ScheduledThreadPoolExecutor.java:848) at java.util.concurrent.ThreadPoolExecutor.getTask(ThreadPoolExecutor.java:1083) at java.util.concurrent.ThreadPoolExecutor.runWorker(ThreadPoolExecutor.java:1143) at java.util.concurrent.ThreadPoolExecutor$Worker.run(ThreadPoolExecutor.java:632) at java.lang.Thread.run(Thread.java:804)
Stack Trace:
com.carrotsearch.randomizedtesting.ThreadLeakError: There are still zombie threads that couldn't be terminated:
1) Thread[id=6393, name=kdcReplayCache.data, state=TIMED_WAITING, group=TGRP-SaslZkACLProviderTest]
at jdk.internal.misc.Unsafe.park(Native Method)
at java.util.concurrent.locks.LockSupport.parkNanos(LockSupport.java:230)
at java.util.concurrent.locks.AbstractQueuedSynchronizer$ConditionObject.awaitNanos(AbstractQueuedSynchronizer.java:2106)
at java.util.concurrent.ScheduledThreadPoolExecutor$DelayedWorkQueue.take(ScheduledThreadPoolExecutor.java:1131)
at java.util.concurrent.ScheduledThreadPoolExecutor$DelayedWorkQueue.take(ScheduledThreadPoolExecutor.java:848)
at java.util.concurrent.ThreadPoolExecutor.getTask(ThreadPoolExecutor.java:1083)
at java.util.concurrent.ThreadPoolExecutor.runWorker(ThreadPoolExecutor.java:1143)
at java.util.concurrent.ThreadPoolExecutor$Worker.run(ThreadPoolExecutor.java:632)
at java.lang.Thread.run(Thread.java:804)
2) Thread[id=6392, name=changePwdReplayCache.data, state=TIMED_WAITING, group=TGRP-SaslZkACLProviderTest]
at jdk.internal.misc.Unsafe.park(Native Method)
at java.util.concurrent.locks.LockSupport.parkNanos(LockSupport.java:230)
at java.util.concurrent.locks.AbstractQueuedSynchronizer$ConditionObject.awaitNanos(AbstractQueuedSynchronizer.java:2106)
at java.util.concurrent.ScheduledThreadPoolExecutor$DelayedWorkQueue.take(ScheduledThreadPoolExecutor.java:1131)
at java.util.concurrent.ScheduledThreadPoolExecutor$DelayedWorkQueue.take(ScheduledThreadPoolExecutor.java:848)
at java.util.concurrent.ThreadPoolExecutor.getTask(ThreadPoolExecutor.java:1083)
at java.util.concurrent.ThreadPoolExecutor.runWorker(ThreadPoolExecutor.java:1143)
at java.util.concurrent.ThreadPoolExecutor$Worker.run(ThreadPoolExecutor.java:632)
at java.lang.Thread.run(Thread.java:804)
3) Thread[id=6390, name=apacheds, state=WAITING, group=TGRP-SaslZkACLProviderTest]
at java.lang.Object.wait(Native Method)
at java.lang.Object.wait(Object.java:516)
at java.util.TimerThread.mainLoop(Timer.java:526)
at java.util.TimerThread.run(Timer.java:505)
4) Thread[id=6391, name=groupCache.data, state=TIMED_WAITING, group=TGRP-SaslZkACLProviderTest]
at jdk.internal.misc.Unsafe.park(Native Method)
at java.util.concurrent.locks.LockSupport.parkNanos(LockSupport.java:230)
at java.util.concurrent.locks.AbstractQueuedSynchronizer$ConditionObject.awaitNanos(AbstractQueuedSynchronizer.java:2106)
at java.util.concurrent.ScheduledThreadPoolExecutor$DelayedWorkQueue.take(ScheduledThreadPoolExecutor.java:1131)
at java.util.concurrent.ScheduledThreadPoolExecutor$DelayedWorkQueue.take(ScheduledThreadPoolExecutor.java:848)
at java.util.concurrent.ThreadPoolExecutor.getTask(ThreadPoolExecutor.java:1083)
at java.util.concurrent.ThreadPoolExecutor.runWorker(ThreadPoolExecutor.java:1143)
at java.util.concurrent.ThreadPoolExecutor$Worker.run(ThreadPoolExecutor.java:632)
at java.lang.Thread.run(Thread.java:804)
5) Thread[id=6394, name=ou=system.data, state=TIMED_WAITING, group=TGRP-SaslZkACLProviderTest]
at jdk.internal.misc.Unsafe.park(Native Method)
at java.util.concurrent.locks.LockSupport.parkNanos(LockSupport.java:230)
at java.util.concurrent.locks.AbstractQueuedSynchronizer$ConditionObject.awaitNanos(AbstractQueuedSynchronizer.java:2106)
at java.util.concurrent.ScheduledThreadPoolExecutor$DelayedWorkQueue.take(ScheduledThreadPoolExecutor.java:1131)
at java.util.concurrent.ScheduledThreadPoolExecutor$DelayedWorkQueue.take(ScheduledThreadPoolExecutor.java:848)
at java.util.concurrent.ThreadPoolExecutor.getTask(ThreadPoolExecutor.java:1083)
at java.util.concurrent.ThreadPoolExecutor.runWorker(ThreadPoolExecutor.java:1143)
at java.util.concurrent.ThreadPoolExecutor$Worker.run(ThreadPoolExecutor.java:632)
at java.lang.Thread.run(Thread.java:804)
at __randomizedtesting.SeedInfo.seed([C3E978CEAF38652B]:0)
FAILED: org.apache.solr.cloud.SaslZkACLProviderTest.testSaslZkACLProvider
Error Message:
org.apache.directory.api.ldap.model.exception.LdapOtherException: org.apache.directory.api.ldap.model.exception.LdapOtherException: ERR_04447_CANNOT_NORMALIZE_VALUE Cannot normalize the wrapped value ERR_04473_NOT_VALID_VALUE Not a valid value '20090818022733Z' for the AttributeType 'ATTRIBUTE_TYPE ( 1.3.6.1.4.1.18060.0.4.1.2.35 NAME 'schemaModifyTimestamp' DESC time which schema was modified SUP modifyTimestamp EQUALITY generalizedTimeMatch ORDERING generalizedTimeOrderingMatch SYNTAX 1.3.6.1.4.1.1466.115.121.1.24 USAGE directoryOperation ) '
Stack Trace:
java.lang.RuntimeException: org.apache.directory.api.ldap.model.exception.LdapOtherException: org.apache.directory.api.ldap.model.exception.LdapOtherException: ERR_04447_CANNOT_NORMALIZE_VALUE Cannot normalize the wrapped value ERR_04473_NOT_VALID_VALUE Not a valid value '20090818022733Z' for the AttributeType 'ATTRIBUTE_TYPE ( 1.3.6.1.4.1.18060.0.4.1.2.35
NAME 'schemaModifyTimestamp'
DESC time which schema was modified
SUP modifyTimestamp
EQUALITY generalizedTimeMatch
ORDERING generalizedTimeOrderingMatch
SYNTAX 1.3.6.1.4.1.1466.115.121.1.24
USAGE directoryOperation
)
'
at org.apache.solr.cloud.SaslZkACLProviderTest$SaslZkTestServer.run(SaslZkACLProviderTest.java:210)
at org.apache.solr.cloud.SaslZkACLProviderTest.setUp(SaslZkACLProviderTest.java:80)
at sun.reflect.GeneratedMethodAccessor4.invoke(Unknown Source)
at sun.reflect.DelegatingMethodAccessorImpl.invoke(DelegatingMethodAccessorImpl.java:43)
at java.lang.reflect.Method.invoke(Method.java:520)
at com.carrotsearch.randomizedtesting.RandomizedRunner.invoke(RandomizedRunner.java:1764)
at com.carrotsearch.randomizedtesting.RandomizedRunner$9.evaluate(RandomizedRunner.java:905)
at com.carrotsearch.randomizedtesting.RandomizedRunner$10.evaluate(RandomizedRunner.java:921)
at com.carrotsearch.randomizedtesting.rules.SystemPropertiesRestoreRule$1.evaluate(SystemPropertiesRestoreRule.java:57)
at org.apache.lucene.util.TestRuleSetupTeardownChained$1.evaluate(TestRuleSetupTeardownChained.java:49)
at org.apache.lucene.util.AbstractBeforeAfterRule$1.evaluate(AbstractBeforeAfterRule.java:45)
at org.apache.lucene.util.TestRuleThreadAndTestName$1.evaluate(TestRuleThreadAndTestName.java:48)
at org.apache.lucene.util.TestRuleIgnoreAfterMaxFailures$1.evaluate(TestRuleIgnoreAfterMaxFailures.java:64)
at org.apache.lucene.util.TestRuleMarkFailure$1.evaluate(TestRuleMarkFailure.java:47)
at com.carrotsearch.randomizedtesting.rules.StatementAdapter.evaluate(StatementAdapter.java:36)
at com.carrotsearch.randomizedtesting.ThreadLeakControl$StatementRunner.run(ThreadLeakControl.java:367)
at com.carrotsearch.randomizedtesting.ThreadLeakControl.forkTimeoutingTask(ThreadLeakControl.java:809)
at com.carrotsearch.randomizedtesting.ThreadLeakControl$3.evaluate(ThreadLeakControl.java:460)
at com.carrotsearch.randomizedtesting.RandomizedRunner.runSingleTest(RandomizedRunner.java:880)
at com.carrotsearch.randomizedtesting.RandomizedRunner$5.evaluate(RandomizedRunner.java:781)
at com.carrotsearch.randomizedtesting.RandomizedRunner$6.evaluate(RandomizedRunner.java:816)
at com.carrotsearch.randomizedtesting.RandomizedRunner$7.evaluate(RandomizedRunner.java:827)
at com.carrotsearch.randomizedtesting.rules.StatementAdapter.evaluate(StatementAdapter.java:36)
at com.carrotsearch.randomizedtesting.rules.SystemPropertiesRestoreRule$1.evaluate(SystemPropertiesRestoreRule.java:57)
at org.apache.lucene.util.AbstractBeforeAfterRule$1.evaluate(AbstractBeforeAfterRule.java:45)
at com.carrotsearch.randomizedtesting.rules.StatementAdapter.evaluate(StatementAdapter.java:36)
at org.apache.lucene.util.TestRuleStoreClassName$1.evaluate(TestRuleStoreClassName.java:41)
at com.carrotsearch.randomizedtesting.rules.NoShadowingOrOverridesOnMethodsRule$1.evaluate(NoShadowingOrOverridesOnMethodsRule.java:40)
at com.carrotsearch.randomizedtesting.rules.NoShadowingOrOverridesOnMethodsRule$1.evaluate(NoShadowingOrOverridesOnMethodsRule.java:40)
at com.carrotsearch.randomizedtesting.rules.StatementAdapter.evaluate(StatementAdapter.java:36)
at com.carrotsearch.randomizedtesting.rules.StatementAdapter.evaluate(StatementAdapter.java:36)
at com.carrotsearch.randomizedtesting.rules.StatementAdapter.evaluate(StatementAdapter.java:36)
at org.apache.lucene.util.TestRuleAssertionsRequired$1.evaluate(TestRuleAssertionsRequired.java:53)
at org.apache.lucene.util.TestRuleMarkFailure$1.evaluate(TestRuleMarkFailure.java:47)
at org.apache.lucene.util.TestRuleIgnoreAfterMaxFailures$1.evaluate(TestRuleIgnoreAfterMaxFailures.java:64)
at org.apache.lucene.util.TestRuleIgnoreTestSuites$1.evaluate(TestRuleIgnoreTestSuites.java:54)
at com.carrotsearch.randomizedtesting.rules.StatementAdapter.evaluate(StatementAdapter.java:36)
at com.carrotsearch.randomizedtesting.ThreadLeakControl$StatementRunner.run(ThreadLeakControl.java:367)
at java.lang.Thread.run(Thread.java:804)
Caused by: org.apache.directory.api.ldap.model.exception.LdapOtherException: org.apache.directory.api.ldap.model.exception.LdapOtherException: ERR_04447_CANNOT_NORMALIZE_VALUE Cannot normalize the wrapped value ERR_04473_NOT_VALID_VALUE Not a valid value '20090818022733Z' for the AttributeType 'ATTRIBUTE_TYPE ( 1.3.6.1.4.1.18060.0.4.1.2.35
NAME 'schemaModifyTimestamp'
DESC time which schema was modified
SUP modifyTimestamp
EQUALITY generalizedTimeMatch
ORDERING generalizedTimeOrderingMatch
SYNTAX 1.3.6.1.4.1.1466.115.121.1.24
USAGE directoryOperation
)
'
at org.apache.directory.server.core.api.partition.AbstractPartition.initialize(AbstractPartition.java:84)
at org.apache.directory.server.core.DefaultDirectoryService.initialize(DefaultDirectoryService.java:1808)
at org.apache.directory.server.core.DefaultDirectoryService.startup(DefaultDirectoryService.java:1248)
at org.apache.hadoop.minikdc.MiniKdc.initDirectoryService(MiniKdc.java:383)
at org.apache.hadoop.minikdc.MiniKdc.start(MiniKdc.java:319)
at org.apache.solr.cloud.SaslZkACLProviderTest$SaslZkTestServer.run(SaslZkACLProviderTest.java:203)
... 38 more
Caused by: java.lang.RuntimeException: org.apache.directory.api.ldap.model.exception.LdapOtherException: ERR_04447_CANNOT_NORMALIZE_VALUE Cannot normalize the wrapped value ERR_04473_NOT_VALID_VALUE Not a valid value '20090818022733Z' for the AttributeType 'ATTRIBUTE_TYPE ( 1.3.6.1.4.1.18060.0.4.1.2.35
NAME 'schemaModifyTimestamp'
DESC time which schema was modified
SUP modifyTimestamp
EQUALITY generalizedTimeMatch
ORDERING generalizedTimeOrderingMatch
SYNTAX 1.3.6.1.4.1.1466.115.121.1.24
USAGE directoryOperation
)
'
at org.apache.directory.server.core.api.schema.SchemaPartition.doInit(SchemaPartition.java:226)
at org.apache.directory.server.core.api.partition.AbstractPartition.initialize(AbstractPartition.java:79)
... 43 more
Caused by: org.apache.directory.api.ldap.model.exception.LdapOtherException: ERR_04447_CANNOT_NORMALIZE_VALUE Cannot normalize the wrapped value ERR_04473_NOT_VALID_VALUE Not a valid value '20090818022733Z' for the AttributeType 'ATTRIBUTE_TYPE ( 1.3.6.1.4.1.18060.0.4.1.2.35
NAME 'schemaModifyTimestamp'
DESC time which schema was modified
SUP modifyTimestamp
EQUALITY generalizedTimeMatch
ORDERING generalizedTimeOrderingMatch
SYNTAX 1.3.6.1.4.1.1466.115.121.1.24
USAGE directoryOperation
)
'
at org.apache.directory.server.core.api.partition.AbstractPartition.initialize(AbstractPartition.java:84)
at org.apache.directory.server.core.api.schema.SchemaPartition.doInit(SchemaPartition.java:219)
... 44 more
Caused by: org.apache.directory.api.ldap.model.exception.LdapInvalidAttributeValueException: ERR_04447_CANNOT_NORMALIZE_VALUE Cannot normalize the wrapped value ERR_04473_NOT_VALID_VALUE Not a valid value '20090818022733Z' for the AttributeType 'ATTRIBUTE_TYPE ( 1.3.6.1.4.1.18060.0.4.1.2.35
NAME 'schemaModifyTimestamp'
DESC time which schema was modified
SUP modifyTimestamp
EQUALITY generalizedTimeMatch
ORDERING generalizedTimeOrderingMatch
SYNTAX 1.3.6.1.4.1.1466.115.121.1.24
USAGE directoryOperation
)
'
at org.apache.directory.api.ldap.model.entry.AbstractValue.apply(AbstractValue.java:211)
at org.apache.directory.api.ldap.model.entry.StringValue.<init>(StringValue.java:107)
at org.apache.directory.api.ldap.model.entry.DefaultAttribute.<init>(DefaultAttribute.java:468)
at org.apache.directory.api.ldap.model.entry.DefaultEntry.<init>(DefaultEntry.java:315)
at org.apache.directory.server.core.partition.ldif.LdifPartition.loadEntries(LdifPartition.java:517)
at org.apache.directory.server.core.partition.ldif.LdifPartition.loadEntries(LdifPartition.java:549)
at org.apache.directory.server.core.partition.ldif.LdifPartition.doInit(LdifPartition.java:164)
at org.apache.directory.server.core.api.partition.AbstractPartition.initialize(AbstractPartition.java:79)
... 45 more
Caused by: org.apache.directory.api.ldap.model.exception.LdapInvalidAttributeValueException: ERR_04473_NOT_VALID_VALUE Not a valid value '20090818022733Z' for the AttributeType 'ATTRIBUTE_TYPE ( 1.3.6.1.4.1.18060.0.4.1.2.35
NAME 'schemaModifyTimestamp'
DESC time which schema was modified
SUP modifyTimestamp
EQUALITY generalizedTimeMatch
ORDERING generalizedTimeOrderingMatch
SYNTAX 1.3.6.1.4.1.1466.115.121.1.24
USAGE directoryOperation
)
'
at org.apache.directory.api.ldap.model.entry.AbstractValue.apply(AbstractValue.java:204)
... 52 more
Build Log:
[...truncated 11376 lines...]
[junit4] Suite: org.apache.solr.cloud.SaslZkACLProviderTest
[junit4] 2> Creating dataDir: /home/jenkins/workspace/Lucene-Solr-6.x-Linux/solr/build/solr-core/test/J0/temp/solr.cloud.SaslZkACLProviderTest_C3E978CEAF38652B-001/init-core-data-001
[junit4] 2> 867919 INFO (SUITE-SaslZkACLProviderTest-seed#[C3E978CEAF38652B]-worker) [ ] o.a.s.SolrTestCaseJ4 Randomized ssl (false) and clientAuth (true)
[junit4] 2> 867921 INFO (TEST-SaslZkACLProviderTest.testSaslZkACLProvider-seed#[C3E978CEAF38652B]) [ ] o.a.s.SolrTestCaseJ4 ###Starting testSaslZkACLProvider
[junit4] 2> 867922 INFO (TEST-SaslZkACLProviderTest.testSaslZkACLProvider-seed#[C3E978CEAF38652B]) [ ] o.a.s.c.SaslZkACLProviderTest ####SETUP_START testSaslZkACLProvider
[junit4] 2> 867922 INFO (TEST-SaslZkACLProviderTest.testSaslZkACLProvider-seed#[C3E978CEAF38652B]) [ ] o.a.s.c.SaslZkACLProviderTest ZooKeeper dataDir:/home/jenkins/workspace/Lucene-Solr-6.x-Linux/solr/build/solr-core/test/J0/temp/solr.cloud.SaslZkACLProviderTest_C3E978CEAF38652B-001/tempDir-002/zookeeper/server1/data
[junit4] 2> 869825 WARN (TEST-SaslZkACLProviderTest.testSaslZkACLProvider-seed#[C3E978CEAF38652B]) [ ] o.a.d.a.l.m.e.DefaultEntry The attribute 'schemamodifytimestamp' cannot be stored
[junit4] 2> 869839 ERROR (TEST-SaslZkACLProviderTest.testSaslZkACLProvider-seed#[C3E978CEAF38652B]) [ ] o.a.d.s.c.a.s.SchemaPartition ERR_90 Failed to initialize wrapped partition.
[junit4] 2> org.apache.directory.api.ldap.model.exception.LdapOtherException: ERR_04447_CANNOT_NORMALIZE_VALUE Cannot normalize the wrapped value ERR_04473_NOT_VALID_VALUE Not a valid value '20090818022733Z' for the AttributeType 'ATTRIBUTE_TYPE ( 1.3.6.1.4.1.18060.0.4.1.2.35
[junit4] 2> NAME 'schemaModifyTimestamp'
[junit4] 2> DESC time which schema was modified
[junit4] 2> SUP modifyTimestamp
[junit4] 2> EQUALITY generalizedTimeMatch
[junit4] 2> ORDERING generalizedTimeOrderingMatch
[junit4] 2> SYNTAX 1.3.6.1.4.1.1466.115.121.1.24
[junit4] 2> USAGE directoryOperation
[junit4] 2> )
[junit4] 2> '
[junit4] 2> at org.apache.directory.server.core.api.partition.AbstractPartition.initialize(AbstractPartition.java:84)
[junit4] 2> at org.apache.directory.server.core.api.schema.SchemaPartition.doInit(SchemaPartition.java:219)
[junit4] 2> at org.apache.directory.server.core.api.partition.AbstractPartition.initialize(AbstractPartition.java:79)
[junit4] 2> at org.apache.directory.server.core.DefaultDirectoryService.initialize(DefaultDirectoryService.java:1808)
[junit4] 2> at org.apache.directory.server.core.DefaultDirectoryService.startup(DefaultDirectoryService.java:1248)
[junit4] 2> at org.apache.hadoop.minikdc.MiniKdc.initDirectoryService(MiniKdc.java:383)
[junit4] 2> at org.apache.hadoop.minikdc.MiniKdc.start(MiniKdc.java:319)
[junit4] 2> at org.apache.solr.cloud.SaslZkACLProviderTest$SaslZkTestServer.run(SaslZkACLProviderTest.java:203)
[junit4] 2> at org.apache.solr.cloud.SaslZkACLProviderTest.setUp(SaslZkACLProviderTest.java:80)
[junit4] 2> at sun.reflect.GeneratedMethodAccessor4.invoke(Unknown Source)
[junit4] 2> at sun.reflect.DelegatingMethodAccessorImpl.invoke(DelegatingMethodAccessorImpl.java:43)
[junit4] 2> at java.lang.reflect.Method.invoke(Method.java:520)
[junit4] 2> at com.carrotsearch.randomizedtesting.RandomizedRunner.invoke(RandomizedRunner.java:1764)
[junit4] 2> at com.carrotsearch.randomizedtesting.RandomizedRunner$9.evaluate(RandomizedRunner.java:905)
[junit4] 2> at com.carrotsearch.randomizedtesting.RandomizedRunner$10.evaluate(RandomizedRunner.java:921)
[junit4] 2> at com.carrotsearch.randomizedtesting.rules.SystemPropertiesRestoreRule$1.evaluate(SystemPropertiesRestoreRule.java:57)
[junit4] 2> at org.apache.lucene.util.TestRuleSetupTeardownChained$1.evaluate(TestRuleSetupTeardownChained.java:49)
[junit4] 2> at org.apache.lucene.util.AbstractBeforeAfterRule$1.evaluate(AbstractBeforeAfterRule.java:45)
[junit4] 2> at org.apache.lucene.util.TestRuleThreadAndTestName$1.evaluate(TestRuleThreadAndTestName.java:48)
[junit4] 2> at org.apache.lucene.util.TestRuleIgnoreAfterMaxFailures$1.evaluate(TestRuleIgnoreAfterMaxFailures.java:64)
[junit4] 2> at org.apache.lucene.util.TestRuleMarkFailure$1.evaluate(TestRuleMarkFailure.java:47)
[junit4] 2> at com.carrotsearch.randomizedtesting.rules.StatementAdapter.evaluate(StatementAdapter.java:36)
[junit4] 2> at com.carrotsearch.randomizedtesting.ThreadLeakControl$StatementRunner.run(ThreadLeakControl.java:367)
[junit4] 2> at com.carrotsearch.randomizedtesting.ThreadLeakControl.forkTimeoutingTask(ThreadLeakControl.java:809)
[junit4] 2> at com.carrotsearch.randomizedtesting.ThreadLeakControl$3.evaluate(ThreadLeakControl.java:460)
[junit4] 2> at com.carrotsearch.randomizedtesting.RandomizedRunner.runSingleTest(RandomizedRunner.java:880)
[junit4] 2> at com.carrotsearch.randomizedtesting.RandomizedRunner$5.evaluate(RandomizedRunner.java:781)
[junit4] 2> at com.carrotsearch.randomizedtesting.RandomizedRunner$6.evaluate(RandomizedRunner.java:816)
[junit4] 2> at com.carrotsearch.randomizedtesting.RandomizedRunner$7.evaluate(RandomizedRunner.java:827)
[junit4] 2> at com.carrotsearch.randomizedtesting.rules.StatementAdapter.evaluate(StatementAdapter.java:36)
[junit4] 2> at com.carrotsearch.randomizedtesting.rules.SystemPropertiesRestoreRule$1.evaluate(SystemPropertiesRestoreRule.java:57)
[junit4] 2> at org.apache.lucene.util.AbstractBeforeAfterRule$1.evaluate(AbstractBeforeAfterRule.java:45)
[junit4] 2> at com.carrotsearch.randomizedtesting.rules.StatementAdapter.evaluate(StatementAdapter.java:36)
[junit4] 2> at org.apache.lucene.util.TestRuleStoreClassName$1.evaluate(TestRuleStoreClassName.java:41)
[junit4] 2> at com.carrotsearch.randomizedtesting.rules.NoShadowingOrOverridesOnMethodsRule$1.evaluate(NoShadowingOrOverridesOnMethodsRule.java:40)
[junit4] 2> at com.carrotsearch.randomizedtesting.rules.NoShadowingOrOverridesOnMethodsRule$1.evaluate(NoShadowingOrOverridesOnMethodsRule.java:40)
[junit4] 2> at com.carrotsearch.randomizedtesting.rules.StatementAdapter.evaluate(StatementAdapter.java:36)
[junit4] 2> at com.carrotsearch.randomizedtesting.rules.StatementAdapter.evaluate(StatementAdapter.java:36)
[junit4] 2> at com.carrotsearch.randomizedtesting.rules.StatementAdapter.evaluate(StatementAdapter.java:36)
[junit4] 2> at org.apache.lucene.util.TestRuleAssertionsRequired$1.evaluate(TestRuleAssertionsRequired.java:53)
[junit4] 2> at org.apache.lucene.util.TestRuleMarkFailure$1.evaluate(TestRuleMarkFailure.java:47)
[junit4] 2> at org.apache.lucene.util.TestRuleIgnoreAfterMaxFailures$1.evaluate(TestRuleIgnoreAfterMaxFailures.java:64)
[junit4] 2> at org.apache.lucene.util.TestRuleIgnoreTestSuites$1.evaluate(TestRuleIgnoreTestSuites.java:54)
[junit4] 2> at com.carrotsearch.randomizedtesting.rules.StatementAdapter.evaluate(StatementAdapter.java:36)
[junit4] 2> at com.carrotsearch.randomizedtesting.ThreadLeakControl$StatementRunner.run(ThreadLeakControl.java:367)
[junit4] 2> at java.lang.Thread.run(Thread.java:804)
[junit4] 2> Caused by: org.apache.directory.api.ldap.model.exception.LdapInvalidAttributeValueException: ERR_04447_CANNOT_NORMALIZE_VALUE Cannot normalize the wrapped value ERR_04473_NOT_VALID_VALUE Not a valid value '20090818022733Z' for the AttributeType 'ATTRIBUTE_TYPE ( 1.3.6.1.4.1.18060.0.4.1.2.35
[junit4] 2> NAME 'schemaModifyTimestamp'
[junit4] 2> DESC time which schema was modified
[junit4] 2> SUP modifyTimestamp
[junit4] 2> EQUALITY generalizedTimeMatch
[junit4] 2> ORDERING generalizedTimeOrderingMatch
[junit4] 2> SYNTAX 1.3.6.1.4.1.1466.115.121.1.24
[junit4] 2> USAGE directoryOperation
[junit4] 2> )
[junit4] 2> '
[junit4] 2> at org.apache.directory.api.ldap.model.entry.AbstractValue.apply(AbstractValue.java:211)
[junit4] 2> at org.apache.directory.api.ldap.model.entry.StringValue.<init>(StringValue.java:107)
[junit4] 2> at org.apache.directory.api.ldap.model.entry.DefaultAttribute.<init>(DefaultAttribute.java:468)
[junit4] 2> at org.apache.directory.api.ldap.model.entry.DefaultEntry.<init>(DefaultEntry.java:315)
[junit4] 2> at org.apache.directory.server.core.partition.ldif.LdifPartition.loadEntries(LdifPartition.java:517)
[junit4] 2> at org.apache.directory.server.core.partition.ldif.LdifPartition.loadEntries(LdifPartition.java:549)
[junit4] 2> at org.apache.directory.server.core.partition.ldif.LdifPartition.doInit(LdifPartition.java:164)
[junit4] 2> at org.apache.directory.server.core.api.partition.AbstractPartition.initialize(AbstractPartition.java:79)
[junit4] 2> ... 45 more
[junit4] 2> Caused by: org.apache.directory.api.ldap.model.exception.LdapInvalidAttributeValueException: ERR_04473_NOT_VALID_VALUE Not a valid value '20090818022733Z' for the AttributeType 'ATTRIBUTE_TYPE ( 1.3.6.1.4.1.18060.0.4.1.2.35
[junit4] 2> NAME 'schemaModifyTimestamp'
[junit4] 2> DESC time which schema was modified
[junit4] 2> SUP modifyTimestamp
[junit4] 2> EQUALITY generalizedTimeMatch
[junit4] 2> ORDERING generalizedTimeOrderingMatch
[junit4] 2> SYNTAX 1.3.6.1.4.1.1466.115.121.1.24
[junit4] 2> USAGE directoryOperation
[junit4] 2> )
[junit4] 2> '
[junit4] 2> at org.apache.directory.api.ldap.model.entry.AbstractValue.apply(AbstractValue.java:204)
[junit4] 2> ... 52 more
[junit4] 2> NOTE: reproduce with: ant test -Dtestcase=SaslZkACLProviderTest -Dtests.method=testSaslZkACLProvider -Dtests.seed=C3E978CEAF38652B -Dtests.multiplier=3 -Dtests.slow=true -Dtests.locale=as-IN -Dtests.timezone=Australia/Canberra -Dtests.asserts=true -Dtests.file.encoding=ISO-8859-1
[junit4] ERROR 1.92s J0 | SaslZkACLProviderTest.testSaslZkACLProvider <<<
[junit4] > Throwable #1: java.lang.RuntimeException: org.apache.directory.api.ldap.model.exception.LdapOtherException: org.apache.directory.api.ldap.model.exception.LdapOtherException: ERR_04447_CANNOT_NORMALIZE_VALUE Cannot normalize the wrapped value ERR_04473_NOT_VALID_VALUE Not a valid value '20090818022733Z' for the AttributeType 'ATTRIBUTE_TYPE ( 1.3.6.1.4.1.18060.0.4.1.2.35
[junit4] > NAME 'schemaModifyTimestamp'
[junit4] > DESC time which schema was modified
[junit4] > SUP modifyTimestamp
[junit4] > EQUALITY generalizedTimeMatch
[junit4] > ORDERING generalizedTimeOrderingMatch
[junit4] > SYNTAX 1.3.6.1.4.1.1466.115.121.1.24
[junit4] > USAGE directoryOperation
[junit4] > )
[junit4] > '
[junit4] > at org.apache.solr.cloud.SaslZkACLProviderTest$SaslZkTestServer.run(SaslZkACLProviderTest.java:210)
[junit4] > at org.apache.solr.cloud.SaslZkACLProviderTest.setUp(SaslZkACLProviderTest.java:80)
[junit4] > at java.lang.Thread.run(Thread.java:804)
[junit4] > Caused by: org.apache.directory.api.ldap.model.exception.LdapOtherException: org.apache.directory.api.ldap.model.exception.LdapOtherException: ERR_04447_CANNOT_NORMALIZE_VALUE Cannot normalize the wrapped value ERR_04473_NOT_VALID_VALUE Not a valid value '20090818022733Z' for the AttributeType 'ATTRIBUTE_TYPE ( 1.3.6.1.4.1.18060.0.4.1.2.35
[junit4] > NAME 'schemaModifyTimestamp'
[junit4] > DESC time which schema was modified
[junit4] > SUP modifyTimestamp
[junit4] > EQUALITY generalizedTimeMatch
[junit4] > ORDERING generalizedTimeOrderingMatch
[junit4] > SYNTAX 1.3.6.1.4.1.1466.115.121.1.24
[junit4] > USAGE directoryOperation
[junit4] > )
[junit4] > '
[junit4] > at org.apache.directory.server.core.api.partition.AbstractPartition.initialize(AbstractPartition.java:84)
[junit4] > at org.apache.directory.server.core.DefaultDirectoryService.initialize(DefaultDirectoryService.java:1808)
[junit4] > at org.apache.directory.server.core.DefaultDirectoryService.startup(DefaultDirectoryService.java:1248)
[junit4] > at org.apache.hadoop.minikdc.MiniKdc.initDirectoryService(MiniKdc.java:383)
[junit4] > at org.apache.hadoop.minikdc.MiniKdc.start(MiniKdc.java:319)
[junit4] > at org.apache.solr.cloud.SaslZkACLProviderTest$SaslZkTestServer.run(SaslZkACLProviderTest.java:203)
[junit4] > ... 38 more
[junit4] > Caused by: java.lang.RuntimeException: org.apache.directory.api.ldap.model.exception.LdapOtherException: ERR_04447_CANNOT_NORMALIZE_VALUE Cannot normalize the wrapped value ERR_04473_NOT_VALID_VALUE Not a valid value '20090818022733Z' for the AttributeType 'ATTRIBUTE_TYPE ( 1.3.6.1.4.1.18060.0.4.1.2.35
[junit4] > NAME 'schemaModifyTimestamp'
[junit4] > DESC time which schema was modified
[junit4] > SUP modifyTimestamp
[junit4] > EQUALITY generalizedTimeMatch
[junit4] > ORDERING generalizedTimeOrderingMatch
[junit4] > SYNTAX 1.3.6.1.4.1.1466.115.121.1.24
[junit4] > USAGE directoryOperation
[junit4] > )
[junit4] > '
[junit4] > at org.apache.directory.server.core.api.schema.SchemaPartition.doInit(SchemaPartition.java:226)
[junit4] > at org.apache.directory.server.core.api.partition.AbstractPartition.initialize(AbstractPartition.java:79)
[junit4] > ... 43 more
[junit4] > Caused by: org.apache.directory.api.ldap.model.exception.LdapOtherException: ERR_04447_CANNOT_NORMALIZE_VALUE Cannot normalize the wrapped value ERR_04473_NOT_VALID_VALUE Not a valid value '20090818022733Z' for the AttributeType 'ATTRIBUTE_TYPE ( 1.3.6.1.4.1.18060.0.4.1.2.35
[junit4] > NAME 'schemaModifyTimestamp'
[junit4] > DESC time which schema was modified
[junit4] > SUP modifyTimestamp
[junit4] > EQUALITY generalizedTimeMatch
[junit4] > ORDERING generalizedTimeOrderingMatch
[junit4] > SYNTAX 1.3.6.1.4.1.1466.115.121.1.24
[junit4] > USAGE directoryOperation
[junit4] > )
[junit4] > '
[junit4] > at org.apache.directory.server.core.api.partition.AbstractPartition.initialize(AbstractPartition.java:84)
[junit4] > at org.apache.directory.server.core.api.schema.SchemaPartition.doInit(SchemaPartition.java:219)
[junit4] > ... 44 more
[junit4] > Caused by: org.apache.directory.api.ldap.model.exception.LdapInvalidAttributeValueException: ERR_04447_CANNOT_NORMALIZE_VALUE Cannot normalize the wrapped value ERR_04473_NOT_VALID_VALUE Not a valid value '20090818022733Z' for the AttributeType 'ATTRIBUTE_TYPE ( 1.3.6.1.4.1.18060.0.4.1.2.35
[junit4] > NAME 'schemaModifyTimestamp'
[junit4] > DESC time which schema was modified
[junit4] > SUP modifyTimestamp
[junit4] > EQUALITY generalizedTimeMatch
[junit4] > ORDERING generalizedTimeOrderingMatch
[junit4] > SYNTAX 1.3.6.1.4.1.1466.115.121.1.24
[junit4] > USAGE directoryOperation
[junit4] > )
[junit4] > '
[junit4] > at org.apache.directory.api.ldap.model.entry.AbstractValue.apply(AbstractValue.java:211)
[junit4] > at org.apache.directory.api.ldap.model.entry.StringValue.<init>(StringValue.java:107)
[junit4] > at org.apache.directory.api.ldap.model.entry.DefaultAttribute.<init>(DefaultAttribute.java:468)
[junit4] > at org.apache.directory.api.ldap.model.entry.DefaultEntry.<init>(DefaultEntry.java:315)
[junit4] > at org.apache.directory.server.core.partition.ldif.LdifPartition.loadEntries(LdifPartition.java:517)
[junit4] > at org.apache.directory.server.core.partition.ldif.LdifPartition.loadEntries(LdifPartition.java:549)
[junit4] > at org.apache.directory.server.core.partition.ldif.LdifPartition.doInit(LdifPartition.java:164)
[junit4] > at org.apache.directory.server.core.api.partition.AbstractPartition.initialize(AbstractPartition.java:79)
[junit4] > ... 45 more
[junit4] > Caused by: org.apache.directory.api.ldap.model.exception.LdapInvalidAttributeValueException: ERR_04473_NOT_VALID_VALUE Not a valid value '20090818022733Z' for the AttributeType 'ATTRIBUTE_TYPE ( 1.3.6.1.4.1.18060.0.4.1.2.35
[junit4] > NAME 'schemaModifyTimestamp'
[junit4] > DESC time which schema was modified
[junit4] > SUP modifyTimestamp
[junit4] > EQUALITY generalizedTimeMatch
[junit4] > ORDERING generalizedTimeOrderingMatch
[junit4] > SYNTAX 1.3.6.1.4.1.1466.115.121.1.24
[junit4] > USAGE directoryOperation
[junit4] > )
[junit4] > '
[junit4] > at org.apache.directory.api.ldap.model.entry.AbstractValue.apply(AbstractValue.java:204)
[junit4] > ... 52 moreThrowable #2: java.lang.NullPointerException
[junit4] > at org.apache.solr.cloud.ZkTestServer$ZKServerMain.shutdown(ZkTestServer.java:334)
[junit4] > at org.apache.solr.cloud.ZkTestServer.shutdown(ZkTestServer.java:526)
[junit4] > at org.apache.solr.cloud.SaslZkACLProviderTest$SaslZkTestServer.shutdown(SaslZkACLProviderTest.java:217)
[junit4] > at org.apache.solr.cloud.SaslZkACLProviderTest.tearDown(SaslZkACLProviderTest.java:115)
[junit4] > at java.lang.Thread.run(Thread.java:804)
[junit4] 2> 869842 INFO (SUITE-SaslZkACLProviderTest-seed#[C3E978CEAF38652B]-worker) [ ] o.a.s.SolrTestCaseJ4 ###deleteCore
[junit4] 2> NOTE: leaving temporary files on disk at: /home/jenkins/workspace/Lucene-Solr-6.x-Linux/solr/build/solr-core/test/J0/temp/solr.cloud.SaslZkACLProviderTest_C3E978CEAF38652B-001
[junit4] 2> Mar 16, 2016 4:48:43 PM com.carrotsearch.randomizedtesting.ThreadLeakControl checkThreadLeaks
[junit4] 2> WARNING: Will linger awaiting termination of 5 leaked thread(s).
[junit4] 2> Mar 16, 2016 4:49:03 PM com.carrotsearch.randomizedtesting.ThreadLeakControl checkThreadLeaks
[junit4] 2> SEVERE: 5 threads leaked from SUITE scope at org.apache.solr.cloud.SaslZkACLProviderTest:
[junit4] 2> 1) Thread[id=6393, name=kdcReplayCache.data, state=TIMED_WAITING, group=TGRP-SaslZkACLProviderTest]
[junit4] 2> at jdk.internal.misc.Unsafe.park(Native Method)
[junit4] 2> at java.util.concurrent.locks.LockSupport.parkNanos(LockSupport.java:230)
[junit4] 2> at java.util.concurrent.locks.AbstractQueuedSynchronizer$ConditionObject.awaitNanos(AbstractQueuedSynchronizer.java:2106)
[junit4] 2> at java.util.concurrent.ScheduledThreadPoolExecutor$DelayedWorkQueue.take(ScheduledThreadPoolExecutor.java:1131)
[junit4] 2> at java.util.concurrent.ScheduledThreadPoolExecutor$DelayedWorkQueue.take(ScheduledThreadPoolExecutor.java:848)
[junit4] 2> at java.util.concurrent.ThreadPoolExecutor.getTask(ThreadPoolExecutor.java:1083)
[junit4] 2> at java.util.concurrent.ThreadPoolExecutor.runWorker(ThreadPoolExecutor.java:1143)
[junit4] 2> at java.util.concurrent.ThreadPoolExecutor$Worker.run(ThreadPoolExecutor.java:632)
[junit4] 2> at java.lang.Thread.run(Thread.java:804)
[junit4] 2> 2) Thread[id=6392, name=changePwdReplayCache.data, state=TIMED_WAITING, group=TGRP-SaslZkACLProviderTest]
[junit4] 2> at jdk.internal.misc.Unsafe.park(Native Method)
[junit4] 2> at java.util.concurrent.locks.LockSupport.parkNanos(LockSupport.java:230)
[junit4] 2> at java.util.concurrent.locks.AbstractQueuedSynchronizer$ConditionObject.awaitNanos(AbstractQueuedSynchronizer.java:2106)
[junit4] 2> at java.util.concurrent.ScheduledThreadPoolExecutor$DelayedWorkQueue.take(ScheduledThreadPoolExecutor.java:1131)
[junit4] 2> at java.util.concurrent.ScheduledThreadPoolExecutor$DelayedWorkQueue.take(ScheduledThreadPoolExecutor.java:848)
[junit4] 2> at java.util.concurrent.ThreadPoolExecutor.getTask(ThreadPoolExecutor.java:1083)
[junit4] 2> at java.util.concurrent.ThreadPoolExecutor.runWorker(ThreadPoolExecutor.java:1143)
[junit4] 2> at java.util.concurrent.ThreadPoolExecutor$Worker.run(ThreadPoolExecutor.java:632)
[junit4] 2> at java.lang.Thread.run(Thread.java:804)
[junit4] 2> 3) Thread[id=6390, name=apacheds, state=WAITING, group=TGRP-SaslZkACLProviderTest]
[junit4] 2> at java.lang.Object.wait(Native Method)
[junit4] 2> at java.lang.Object.wait(Object.java:516)
[junit4] 2> at java.util.TimerThread.mainLoop(Timer.java:526)
[junit4] 2> at java.util.TimerThread.run(Timer.java:505)
[junit4] 2> 4) Thread[id=6391, name=groupCache.data, state=TIMED_WAITING, group=TGRP-SaslZkACLProviderTest]
[junit4] 2> at jdk.internal.misc.Unsafe.park(Native Method)
[junit4] 2> at java.util.concurrent.locks.LockSupport.parkNanos(LockSupport.java:230)
[junit4] 2> at java.util.concurrent.locks.AbstractQueuedSynchronizer$ConditionObject.awaitNanos(AbstractQueuedSynchronizer.java:2106)
[junit4] 2> at java.util.concurrent.ScheduledThreadPoolExecutor$DelayedWorkQueue.take(ScheduledThreadPoolExecutor.java:1131)
[junit4] 2> at java.util.concurrent.ScheduledThreadPoolExecutor$DelayedWorkQueue.take(ScheduledThreadPoolExecutor.java:848)
[junit4] 2> at java.util.concurrent.ThreadPoolExecutor.getTask(ThreadPoolExecutor.java:1083)
[junit4] 2> at java.util.concurrent.ThreadPoolExecutor.runWorker(ThreadPoolExecutor.java:1143)
[junit4] 2> at java.util.concurrent.ThreadPoolExecutor$Worker.run(ThreadPoolExecutor.java:632)
[junit4] 2> at java.lang.Thread.run(Thread.java:804)
[junit4] 2> 5) Thread[id=6394, name=ou=system.data, state=TIMED_WAITING, group=TGRP-SaslZkACLProviderTest]
[junit4] 2> at jdk.internal.misc.Unsafe.park(Native Method)
[junit4] 2> at java.util.concurrent.locks.LockSupport.parkNanos(LockSupport.java:230)
[junit4] 2> at java.util.concurrent.locks.AbstractQueuedSynchronizer$ConditionObject.awaitNanos(AbstractQueuedSynchronizer.java:2106)
[junit4] 2> at java.util.concurrent.ScheduledThreadPoolExecutor$DelayedWorkQueue.take(ScheduledThreadPoolExecutor.java:1131)
[junit4] 2> at java.util.concurrent.ScheduledThreadPoolExecutor$DelayedWorkQueue.take(ScheduledThreadPoolExecutor.java:848)
[junit4] 2> at java.util.concurrent.ThreadPoolExecutor.getTask(ThreadPoolExecutor.java:1083)
[junit4] 2> at java.util.concurrent.ThreadPoolExecutor.runWorker(ThreadPoolExecutor.java:1143)
[junit4] 2> at java.util.concurrent.ThreadPoolExecutor$Worker.run(ThreadPoolExecutor.java:632)
[junit4] 2> at java.lang.Thread.run(Thread.java:804)
[junit4] 2> Mar 16, 2016 4:49:03 PM com.carrotsearch.randomizedtesting.ThreadLeakControl tryToInterruptAll
[junit4] 2> INFO: Starting to interrupt leaked threads:
[junit4] 2> 1) Thread[id=6393, name=kdcReplayCache.data, state=TIMED_WAITING, group=TGRP-SaslZkACLProviderTest]
[junit4] 2> 2) Thread[id=6392, name=changePwdReplayCache.data, state=TIMED_WAITING, group=TGRP-SaslZkACLProviderTest]
[junit4] 2> 3) Thread[id=6390, name=apacheds, state=WAITING, group=TGRP-SaslZkACLProviderTest]
[junit4] 2> 4) Thread[id=6391, name=groupCache.data, state=TIMED_WAITING, group=TGRP-SaslZkACLProviderTest]
[junit4] 2> 5) Thread[id=6394, name=ou=system.data, state=TIMED_WAITING, group=TGRP-SaslZkACLProviderTest]
[junit4] 2> Mar 16, 2016 4:49:06 PM com.carrotsearch.randomizedtesting.ThreadLeakControl tryToInterruptAll
[junit4] 2> SEVERE: There are still zombie threads that couldn't be terminated:
[junit4] 2> 1) Thread[id=6393, name=kdcReplayCache.data, state=TIMED_WAITING, group=TGRP-SaslZkACLProviderTest]
[junit4] 2> at jdk.internal.misc.Unsafe.park(Native Method)
[junit4] 2> at java.util.concurrent.locks.LockSupport.parkNanos(LockSupport.java:230)
[junit4] 2> at java.util.concurrent.locks.AbstractQueuedSynchronizer$ConditionObject.awaitNanos(AbstractQueuedSynchronizer.java:2106)
[junit4] 2> at java.util.concurrent.ScheduledThreadPoolExecutor$DelayedWorkQueue.take(ScheduledThreadPoolExecutor.java:1131)
[junit4] 2> at java.util.concurrent.ScheduledThreadPoolExecutor$DelayedWorkQueue.take(ScheduledThreadPoolExecutor.java:848)
[junit4] 2> at java.util.concurrent.ThreadPoolExecutor.getTask(ThreadPoolExecutor.java:1083)
[junit4] 2> at java.util.concurrent.ThreadPoolExecutor.runWorker(ThreadPoolExecutor.java:1143)
[junit4] 2> at java.util.concurrent.ThreadPoolExecutor$Worker.run(ThreadPoolExecutor.java:632)
[junit4] 2> at java.lang.Thread.run(Thread.java:804)
[junit4] 2> 2) Thread[id=6392, name=changePwdReplayCache.data, state=TIMED_WAITING, group=TGRP-SaslZkACLProviderTest]
[junit4] 2> at jdk.internal.misc.Unsafe.park(Native Method)
[junit4] 2> at java.util.concurrent.locks.LockSupport.parkNanos(LockSupport.java:230)
[junit4] 2> at java.util.concurrent.locks.AbstractQueuedSynchronizer$ConditionObject.awaitNanos(AbstractQueuedSynchronizer.java:2106)
[junit4] 2> at java.util.concurrent.ScheduledThreadPoolExecutor$DelayedWorkQueue.take(ScheduledThreadPoolExecutor.java:1131)
[junit4] 2> at java.util.concurrent.ScheduledThreadPoolExecutor$DelayedWorkQueue.take(ScheduledThreadPoolExecutor.java:848)
[junit4] 2> at java.util.concurrent.ThreadPoolExecutor.getTask(ThreadPoolExecutor.java:1083)
[junit4] 2> at java.util.concurrent.ThreadPoolExecutor.runWorker(ThreadPoolExecutor.java:1143)
[junit4] 2> at java.util.concurrent.ThreadPoolExecutor$Worker.run(ThreadPoolExecutor.java:632)
[junit4] 2> at java.lang.Thread.run(Thread.java:804)
[junit4] 2> 3) Thread[id=6390, name=apacheds, state=WAITING, group=TGRP-SaslZkACLProviderTest]
[junit4] 2> at java.lang.Object.wait(Native Method)
[junit4] 2> at java.lang.Object.wait(Object.java:516)
[junit4] 2> at java.util.TimerThread.mainLoop(Timer.java:526)
[junit4] 2> at java.util.TimerThread.run(Timer.java:505)
[junit4] 2> 4) Thread[id=6391, name=groupCache.data, state=TIMED_WAITING, group=TGRP-SaslZkACLProviderTest]
[junit4] 2> at jdk.internal.misc.Unsafe.park(Native Method)
[junit4] 2> at java.util.concurrent.locks.LockSupport.parkNanos(LockSupport.java:230)
[junit4] 2> at java.util.concurrent.locks.AbstractQueuedSynchronizer$ConditionObject.awaitNanos(AbstractQueuedSynchronizer.java:2106)
[junit4] 2> at java.util.concurrent.ScheduledThreadPoolExecutor$DelayedWorkQueue.take(ScheduledThreadPoolExecutor.java:1131)
[junit4] 2> at java.util.concurrent.ScheduledThreadPoolExecutor$DelayedWorkQueue.take(ScheduledThreadPoolExecutor.java:848)
[junit4] 2> at java.util.concurrent.ThreadPoolExecutor.getTask(ThreadPoolExecutor.java:1083)
[junit4] 2> at java.util.concurrent.ThreadPoolExecutor.runWorker(ThreadPoolExecutor.java:1143)
[junit4] 2> at java.util.concurrent.ThreadPoolExecutor$Worker.run(ThreadPoolExecutor.java:632)
[junit4] 2> at java.lang.Thread.run(Thread.java:804)
[junit4] 2> 5) Thread[id=6394, name=ou=system.data, state=TIMED_WAITING, group=TGRP-SaslZkACLProviderTest]
[junit4] 2> at jdk.internal.misc.Unsafe.park(Native Method)
[junit4] 2> at java.util.concurrent.locks.LockSupport.parkNanos(LockSupport.java:230)
[junit4] 2> at java.util.concurrent.locks.AbstractQueuedSynchronizer$ConditionObject.awaitNanos(AbstractQueuedSynchronizer.java:2106)
[junit4] 2> at java.util.concurrent.ScheduledThreadPoolExecutor$DelayedWorkQueue.take(ScheduledThreadPoolExecutor.java:1131)
[junit4] 2> at java.util.concurrent.ScheduledThreadPoolExecutor$DelayedWorkQueue.take(ScheduledThreadPoolExecutor.java:848)
[junit4] 2> at java.util.concurrent.ThreadPoolExecutor.getTask(ThreadPoolExecutor.java:1083)
[junit4] 2> at java.util.concurrent.ThreadPoolExecutor.runWorker(ThreadPoolExecutor.java:1143)
[junit4] 2> at java.util.concurrent.ThreadPoolExecutor$Worker.run(ThreadPoolExecutor.java:632)
[junit4] 2> at java.lang.Thread.run(Thread.java:804)
[junit4] 2> NOTE: test params are: codec=Asserting(Lucene60): {}, docValues:{}, maxPointsInLeafNode=1748, maxMBSortInHeap=6.3532703573083715, sim=ClassicSimilarity, locale=as-IN, timezone=Australia/Canberra
[junit4] 2> NOTE: Linux 4.2.0-34-generic amd64/Oracle Corporation 9-ea (64-bit)/cpus=12,threads=6,free=350900704,total=526385152
[junit4] 2> NOTE: All tests run in this JVM: [TestLuceneMatchVersion, TestPKIAuthenticationPlugin, BJQParserTest, QueryEqualityTest, TestSolr4Spatial, TestRemoteStreaming, TestHighlightDedupGrouping, BufferStoreTest, TestMergePolicyConfig, HdfsDirectoryFactoryTest, DistributedSpellCheckComponentTest, SignatureUpdateProcessorFactoryTest, SegmentsInfoRequestHandlerTest, TestRandomFaceting, TestSolrCLIRunExample, CollectionTooManyReplicasTest, ResourceLoaderTest, ChangedSchemaMergeTest, TestComponentsName, TestConfig, TestInitParams, TestBinaryField, TestExclusionRuleCollectionAccess, TestAtomicUpdateErrorCases, DistributedQueryComponentOptimizationTest, TestMinMaxOnMultiValuedField, TestCrossCoreJoin, CustomCollectionTest, TestDistributedStatsComponentCardinality, TestCustomSort, IndexSchemaRuntimeFieldTest, TestFoldingMultitermQuery, CloudExitableDirectoryReaderTest, PeerSyncTest, CachingDirectoryFactoryTest, TestCSVLoader, TestPhraseSuggestions, UUIDFieldTest, SpatialHeatmapFacetsTest, TestFaceting, DistanceUnitsTest, TestDefaultSearchFieldResource, AddBlockUpdateTest, SharedFSAutoReplicaFailoverUtilsTest, TestScoreJoinQPScore, RecoveryAfterSoftCommitTest, TestShardHandlerFactory, TestReplicaProperties, BlockJoinFacetSimpleTest, SolrCoreTest, BasicZkTest, DefaultValueUpdateProcessorTest, TestChildDocTransformer, ResponseHeaderTest, HdfsUnloadDistributedZkTest, TestExactSharedStatsCache, TestHashQParserPlugin, DocExpirationUpdateProcessorFactoryTest, TestReRankQParserPlugin, RankQueryTest, TestFieldTypeResource, TestLazyCores, TestDistributedSearch, TestMissingGroups, HttpPartitionTest, RestartWhileUpdatingTest, TestMiniSolrCloudClusterSSL, TestLMDirichletSimilarityFactory, TestArbitraryIndexDir, TestAnalyzedSuggestions, TestDynamicLoading, EchoParamsTest, SaslZkACLProviderTest]
[junit4] 2> NOTE: reproduce with: ant test -Dtestcase=SaslZkACLProviderTest -Dtests.seed=C3E978CEAF38652B -Dtests.multiplier=3 -Dtests.slow=true -Dtests.locale=as-IN -Dtests.timezone=Australia/Canberra -Dtests.asserts=true -Dtests.file.encoding=ISO-8859-1
[junit4] ERROR 0.00s J0 | SaslZkACLProviderTest (suite) <<<
[junit4] > Throwable #1: com.carrotsearch.randomizedtesting.ThreadLeakError: 5 threads leaked from SUITE scope at org.apache.solr.cloud.SaslZkACLProviderTest:
[junit4] > 1) Thread[id=6393, name=kdcReplayCache.data, state=TIMED_WAITING, group=TGRP-SaslZkACLProviderTest]
[junit4] > at jdk.internal.misc.Unsafe.park(Native Method)
[junit4] > at java.util.concurrent.locks.LockSupport.parkNanos(LockSupport.java:230)
[junit4] > at java.util.concurrent.locks.AbstractQueuedSynchronizer$ConditionObject.awaitNanos(AbstractQueuedSynchronizer.java:2106)
[junit4] > at java.util.concurrent.ScheduledThreadPoolExecutor$DelayedWorkQueue.take(ScheduledThreadPoolExecutor.java:1131)
[junit4] > at java.util.concurrent.ScheduledThreadPoolExecutor$DelayedWorkQueue.take(ScheduledThreadPoolExecutor.java:848)
[junit4] > at java.util.concurrent.ThreadPoolExecutor.getTask(ThreadPoolExecutor.java:1083)
[junit4] > at java.util.concurrent.ThreadPoolExecutor.runWorker(ThreadPoolExecutor.java:1143)
[junit4] > at java.util.concurrent.ThreadPoolExecutor$Worker.run(ThreadPoolExecutor.java:632)
[junit4] > at java.lang.Thread.run(Thread.java:804)
[junit4] > 2) Thread[id=6392, name=changePwdReplayCache.data, state=TIMED_WAITING, group=TGRP-SaslZkACLProviderTest]
[junit4] > at jdk.internal.misc.Unsafe.park(Native Method)
[junit4] > at java.util.concurrent.locks.LockSupport.parkNanos(LockSupport.java:230)
[junit4] > at java.util.concurrent.locks.AbstractQueuedSynchronizer$ConditionObject.awaitNanos(AbstractQueuedSynchronizer.java:2106)
[junit4] > at java.util.concurrent.ScheduledThreadPoolExecutor$DelayedWorkQueue.take(ScheduledThreadPoolExecutor.java:1131)
[junit4] > at java.util.concurrent.ScheduledThreadPoolExecutor$DelayedWorkQueue.take(ScheduledThreadPoolExecutor.java:848)
[junit4] > at java.util.concurrent.ThreadPoolExecutor.getTask(ThreadPoolExecutor.java:1083)
[junit4] > at java.util.concurrent.ThreadPoolExecutor.runWorker(ThreadPoolExecutor.java:1143)
[junit4] > at java.util.concurrent.ThreadPoolExecutor$Worker.run(ThreadPoolExecutor.java:632)
[junit4] > at java.lang.Thread.run(Thread.java:804)
[junit4] > 3) Thread[id=6390, name=apacheds, state=WAITING, group=TGRP-SaslZkACLProviderTest]
[junit4] > at java.lang.Object.wait(Native Method)
[junit4] > at java.lang.Object.wait(Object.java:516)
[junit4] > at java.util.TimerThread.mainLoop(Timer.java:526)
[junit4] > at java.util.TimerThread.run(Timer.java:505)
[junit4] > 4) Thread[id=6391, name=groupCache.data, state=TIMED_WAITING, group=TGRP-SaslZkACLProviderTest]
[junit4] > at jdk.internal.misc.Unsafe.park(Native Method)
[junit4] > at java.util.concurrent.locks.LockSupport.parkNanos(LockSupport.java:230)
[junit4] > at java.util.concurrent.locks.AbstractQueuedSynchronizer$ConditionObject.awaitNanos(AbstractQueuedSynchronizer.java:2106)
[junit4] > at java.util.concurrent.ScheduledThreadPoolExecutor$DelayedWorkQueue.take(ScheduledThreadPoolExecutor.java:1131)
[junit4] > at java.util.concurrent.ScheduledThreadPoolExecutor$DelayedWorkQueue.take(ScheduledThreadPoolExecutor.java:848)
[junit4] > at java.util.concurrent.ThreadPoolExecutor.getTask(ThreadPoolExecutor.java:1083)
[junit4] > at java.util.concurrent.ThreadPoolExecutor.runWorker(ThreadPoolExecutor.java:1143)
[junit4] > at java.util.concurrent.ThreadPoolExecutor$Worker.run(ThreadPoolExecutor.java:632)
[junit4] > at java.lang.Thread.run(Thread.java:804)
[junit4] > 5) Thread[id=6394, name=ou=system.data, state=TIMED_WAITING, group=TGRP-SaslZkACLProviderTest]
[junit4] > at jdk.internal.misc.Unsafe.park(Native Method)
[junit4] > at java.util.concurrent.locks.LockSupport.parkNanos(LockSupport.java:230)
[junit4] > at java.util.concurrent.locks.AbstractQueuedSynchronizer$ConditionObject.awaitNanos(AbstractQueuedSynchronizer.java:2106)
[junit4] > at java.util.concurrent.ScheduledThreadPoolExecutor$DelayedWorkQueue.take(ScheduledThreadPoolExecutor.java:1131)
[junit4] > at java.util.concurrent.ScheduledThreadPoolExecutor$DelayedWorkQueue.take(ScheduledThreadPoolExecutor.java:848)
[junit4] > at java.util.concurrent.ThreadPoolExecutor.getTask(ThreadPoolExecutor.java:1083)
[junit4] > at java.util.concurrent.ThreadPoolExecutor.runWorker(ThreadPoolExecutor.java:1143)
[junit4] > at java.util.concurrent.ThreadPoolExecutor$Worker.run(ThreadPoolExecutor.java:632)
[junit4] > at java.lang.Thread.run(Thread.java:804)
[junit4] > at __randomizedtesting.SeedInfo.seed([C3E978CEAF38652B]:0)Throwable #2: com.carrotsearch.randomizedtesting.ThreadLeakError: There are still zombie threads that couldn't be terminated:
[junit4] > 1) Thread[id=6393, name=kdcReplayCache.data, state=TIMED_WAITING, group=TGRP-SaslZkACLProviderTest]
[junit4] > at jdk.internal.misc.Unsafe.park(Native Method)
[junit4] > at java.util.concurrent.locks.LockSupport.parkNanos(LockSupport.java:230)
[junit4] > at java.util.concurrent.locks.AbstractQueuedSynchronizer$ConditionObject.awaitNanos(AbstractQueuedSynchronizer.java:2106)
[junit4] > at java.util.concurrent.ScheduledThreadPoolExecutor$DelayedWorkQueue.take(ScheduledThreadPoolExecutor.java:1131)
[junit4] > at java.util.concurrent.ScheduledThreadPoolExecutor$DelayedWorkQueue.take(ScheduledThreadPoolExecutor.java:848)
[junit4] > at java.util.concurrent.ThreadPoolExecutor.getTask(ThreadPoolExecutor.java:1083)
[junit4] > at java.util.concurrent.ThreadPoolExecutor.runWorker(ThreadPoolExecutor.java:1143)
[junit4] > at java.util.concurrent.ThreadPoolExecutor$Worker.run(ThreadPoolExecutor.java:632)
[junit4] > at java.lang.Thread.run(Thread.java:804)
[junit4] > 2) Thread[id=6392, name=changePwdReplayCache.data, state=TIMED_WAITING, group=TGRP-SaslZkACLProviderTest]
[junit4] > at jdk.internal.misc.Unsafe.park(Native Method)
[junit4] > at java.util.concurrent.locks.LockSupport.parkNanos(LockSupport.java:230)
[junit4] > at java.util.concurrent.locks.AbstractQueuedSynchronizer$ConditionObject.awaitNanos(AbstractQueuedSynchronizer.java:2106)
[junit4] > at java.util.concurrent.ScheduledThreadPoolExecutor$DelayedWorkQueue.take(ScheduledThreadPoolExecutor.java:1131)
[junit4] > at java.util.concurrent.ScheduledThreadPoolExecutor$DelayedWorkQueue.take(ScheduledThreadPoolExecutor.java:848)
[junit4] > at java.util.concurrent.ThreadPoolExecutor.getTask(ThreadPoolExecutor.java:1083)
[junit4] > at java.util.concurrent.ThreadPoolExecutor.runWorker(ThreadPoolExecutor.java:1143)
[junit4] > at java.util.concurrent.ThreadPoolExecutor$Worker.run(ThreadPoolExecutor.java:632)
[junit4] > at java.lang.Thread.run(Thread.java:804)
[junit4] > 3) Thread[id=6390, name=apacheds, state=WAITING, group=TGRP-SaslZkACLProviderTest]
[junit4] > at java.lang.Object.wait(Native Method)
[junit4] > at java.lang.Object.wait(Object.java:516)
[junit4] > at java.util.TimerThread.mainLoop(Timer.java:526)
[junit4] > at java.util.TimerThread.run(Timer.java:505)
[junit4] > 4) Thread[id=6391, name=groupCache.data, state=TIMED_WAITING, group=TGRP-SaslZkACLProviderTest]
[junit4] > at jdk.internal.misc.Unsafe.park(Native Method)
[junit4] > at java.util.concurrent.locks.LockSupport.parkNanos(LockSupport.java:230)
[junit4] > at java.util.concurrent.locks.AbstractQueuedSynchronizer$ConditionObject.awaitNanos(AbstractQueuedSynchronizer.java:2106)
[junit4] > at java.util.concurrent.ScheduledThreadPoolExecutor$DelayedWorkQueue.take(ScheduledThreadPoolExecutor.java:1131)
[junit4] > at java.util.concurrent.ScheduledThreadPoolExecutor$DelayedWorkQueue.take(ScheduledThreadPoolExecutor.java:848)
[junit4] > at java.util.concurrent.ThreadPoolExecutor.getTask(ThreadPoolExecutor.java:1083)
[junit4] > at java.util.concurrent.ThreadPoolExecutor.runWorker(ThreadPoolExecutor.java:1143)
[junit4] > at java.util.concurrent.ThreadPoolExecutor$Worker.run(ThreadPoolExecutor.java:632)
[junit4] > at java.lang.Thread.run(Thread.java:804)
[junit4] > 5) Thread[id=6394, name=ou=system.data, state=TIMED_WAITING, group=TGRP-SaslZkACLProviderTest]
[junit4] > at jdk.internal.misc.Unsafe.park(Native Method)
[junit4] > at java.util.concurrent.locks.LockSupport.parkNanos(LockSupport.java:230)
[junit4] > at java.util.concurrent.locks.AbstractQueuedSynchronizer$ConditionObject.awaitNanos(AbstractQueuedSynchronizer.java:2106)
[junit4] > at java.util.concurrent.ScheduledThreadPoolExecutor$DelayedWorkQueue.take(ScheduledThreadPoolExecutor.java:1131)
[junit4] > at java.util.concurrent.ScheduledThreadPoolExecutor$DelayedWorkQueue.take(ScheduledThreadPoolExecutor.java:848)
[junit4] > at java.util.concurrent.ThreadPoolExecutor.getTask(ThreadPoolExecutor.java:1083)
[junit4] > at java.util.concurrent.ThreadPoolExecutor.runWorker(ThreadPoolExecutor.java:1143)
[junit4] > at java.util.concurrent.ThreadPoolExecutor$Worker.run(ThreadPoolExecutor.java:632)
[junit4] > at java.lang.Thread.run(Thread.java:804)
[junit4] > at __randomizedtesting.SeedInfo.seed([C3E978CEAF38652B]:0)
[junit4] Completed [246/580 (1!)] on J0 in 25.00s, 1 test, 3 errors <<< FAILURES!
[...truncated 1090 lines...]
BUILD FAILED
/home/jenkins/workspace/Lucene-Solr-6.x-Linux/build.xml:740: The following error occurred while executing this line:
/home/jenkins/workspace/Lucene-Solr-6.x-Linux/build.xml:684: The following error occurred while executing this line:
/home/jenkins/workspace/Lucene-Solr-6.x-Linux/build.xml:59: The following error occurred while executing this line:
/home/jenkins/workspace/Lucene-Solr-6.x-Linux/solr/build.xml:233: The following error occurred while executing this line:
/home/jenkins/workspace/Lucene-Solr-6.x-Linux/solr/common-build.xml:526: The following error occurred while executing this line:
/home/jenkins/workspace/Lucene-Solr-6.x-Linux/lucene/common-build.xml:1457: The following error occurred while executing this line:
/home/jenkins/workspace/Lucene-Solr-6.x-Linux/lucene/common-build.xml:1014: There were test failures: 580 suites (10 ignored), 2320 tests, 2 suite-level errors, 1 error, 1218 ignored (70 assumptions) [seed: C3E978CEAF38652B]
Total time: 45 minutes 43 seconds
Build step 'Invoke Ant' marked build as failure
Archiving artifacts
[WARNINGS] Skipping publisher since build result is FAILURE
Recording test results
Email was triggered for: Failure - Any
Sending email for trigger: Failure - Any
[JENKINS-EA] Lucene-Solr-6.x-Linux (32bit/jdk-9-ea+109) - Build #
146 - Still Failing!
Posted by Policeman Jenkins Server <je...@thetaphi.de>.
Build: http://jenkins.thetaphi.de/job/Lucene-Solr-6.x-Linux/146/
Java: 32bit/jdk-9-ea+109 -server -XX:+UseG1GC
1 tests failed.
FAILED: org.apache.solr.cloud.UnloadDistributedZkTest.test
Error Message:
Captured an uncaught exception in thread: Thread[id=7155, name=testExecutor-2794-thread-7, state=RUNNABLE, group=TGRP-UnloadDistributedZkTest]
Stack Trace:
com.carrotsearch.randomizedtesting.UncaughtExceptionError: Captured an uncaught exception in thread: Thread[id=7155, name=testExecutor-2794-thread-7, state=RUNNABLE, group=TGRP-UnloadDistributedZkTest]
Caused by: java.lang.RuntimeException: org.apache.solr.client.solrj.SolrServerException: Timeout occured while waiting response from server at: http://127.0.0.1:42578
at __randomizedtesting.SeedInfo.seed([6F42133EBE049F7E]:0)
at org.apache.solr.cloud.BasicDistributedZkTest.lambda$createCores$0(BasicDistributedZkTest.java:583)
at org.apache.solr.common.util.ExecutorUtil$MDCAwareThreadPoolExecutor.lambda$execute$0(ExecutorUtil.java:229)
at java.util.concurrent.ThreadPoolExecutor.runWorker(ThreadPoolExecutor.java:1158)
at java.util.concurrent.ThreadPoolExecutor$Worker.run(ThreadPoolExecutor.java:632)
at java.lang.Thread.run(Thread.java:804)
Caused by: org.apache.solr.client.solrj.SolrServerException: Timeout occured while waiting response from server at: http://127.0.0.1:42578
at org.apache.solr.client.solrj.impl.HttpSolrClient.executeMethod(HttpSolrClient.java:588)
at org.apache.solr.client.solrj.impl.HttpSolrClient.request(HttpSolrClient.java:241)
at org.apache.solr.client.solrj.impl.HttpSolrClient.request(HttpSolrClient.java:230)
at org.apache.solr.client.solrj.SolrClient.request(SolrClient.java:1219)
at org.apache.solr.cloud.BasicDistributedZkTest.lambda$createCores$0(BasicDistributedZkTest.java:581)
... 4 more
Caused by: java.net.SocketTimeoutException: Read timed out
at java.net.SocketInputStream.socketRead0(Native Method)
at java.net.SocketInputStream.socketRead(SocketInputStream.java:116)
at java.net.SocketInputStream.read(SocketInputStream.java:170)
at java.net.SocketInputStream.read(SocketInputStream.java:141)
at org.apache.http.impl.io.AbstractSessionInputBuffer.fillBuffer(AbstractSessionInputBuffer.java:160)
at org.apache.http.impl.io.SocketInputBuffer.fillBuffer(SocketInputBuffer.java:84)
at org.apache.http.impl.io.AbstractSessionInputBuffer.readLine(AbstractSessionInputBuffer.java:273)
at org.apache.http.impl.conn.DefaultHttpResponseParser.parseHead(DefaultHttpResponseParser.java:140)
at org.apache.http.impl.conn.DefaultHttpResponseParser.parseHead(DefaultHttpResponseParser.java:57)
at org.apache.http.impl.io.AbstractMessageParser.parse(AbstractMessageParser.java:261)
at org.apache.http.impl.AbstractHttpClientConnection.receiveResponseHeader(AbstractHttpClientConnection.java:283)
at org.apache.http.impl.conn.DefaultClientConnection.receiveResponseHeader(DefaultClientConnection.java:251)
at org.apache.http.impl.conn.ManagedClientConnectionImpl.receiveResponseHeader(ManagedClientConnectionImpl.java:197)
at org.apache.http.protocol.HttpRequestExecutor.doReceiveResponse(HttpRequestExecutor.java:272)
at org.apache.http.protocol.HttpRequestExecutor.execute(HttpRequestExecutor.java:124)
at org.apache.http.impl.client.DefaultRequestDirector.tryExecute(DefaultRequestDirector.java:685)
at org.apache.http.impl.client.DefaultRequestDirector.execute(DefaultRequestDirector.java:487)
at org.apache.http.impl.client.AbstractHttpClient.doExecute(AbstractHttpClient.java:882)
at org.apache.http.impl.client.CloseableHttpClient.execute(CloseableHttpClient.java:82)
at org.apache.http.impl.client.CloseableHttpClient.execute(CloseableHttpClient.java:107)
at org.apache.http.impl.client.CloseableHttpClient.execute(CloseableHttpClient.java:55)
at org.apache.solr.client.solrj.impl.HttpSolrClient.executeMethod(HttpSolrClient.java:482)
... 8 more
Build Log:
[...truncated 11530 lines...]
[junit4] Suite: org.apache.solr.cloud.UnloadDistributedZkTest
[junit4] 2> Creating dataDir: /home/jenkins/workspace/Lucene-Solr-6.x-Linux/solr/build/solr-core/test/J1/temp/solr.cloud.UnloadDistributedZkTest_6F42133EBE049F7E-001/init-core-data-001
[junit4] 2> 931910 INFO (SUITE-UnloadDistributedZkTest-seed#[6F42133EBE049F7E]-worker) [ ] o.a.s.BaseDistributedSearchTestCase Setting hostContext system property: /
[junit4] 2> 931911 INFO (TEST-UnloadDistributedZkTest.test-seed#[6F42133EBE049F7E]) [ ] o.a.s.c.ZkTestServer STARTING ZK TEST SERVER
[junit4] 2> 931912 INFO (Thread-2453) [ ] o.a.s.c.ZkTestServer client port:0.0.0.0/0.0.0.0:0
[junit4] 2> 931912 INFO (Thread-2453) [ ] o.a.s.c.ZkTestServer Starting server
[junit4] 2> 932012 INFO (TEST-UnloadDistributedZkTest.test-seed#[6F42133EBE049F7E]) [ ] o.a.s.c.ZkTestServer start zk server on port:43092
[junit4] 2> 932012 INFO (TEST-UnloadDistributedZkTest.test-seed#[6F42133EBE049F7E]) [ ] o.a.s.c.c.SolrZkClient Using default ZkCredentialsProvider
[junit4] 2> 932012 INFO (TEST-UnloadDistributedZkTest.test-seed#[6F42133EBE049F7E]) [ ] o.a.s.c.c.ConnectionManager Waiting for client to connect to ZooKeeper
[junit4] 2> 932013 INFO (zkCallback-1160-thread-1) [ ] o.a.s.c.c.ConnectionManager Watcher org.apache.solr.common.cloud.ConnectionManager@1734b5e name:ZooKeeperConnection Watcher:127.0.0.1:43092 got event WatchedEvent state:SyncConnected type:None path:null path:null type:None
[junit4] 2> 932013 INFO (TEST-UnloadDistributedZkTest.test-seed#[6F42133EBE049F7E]) [ ] o.a.s.c.c.ConnectionManager Client is connected to ZooKeeper
[junit4] 2> 932013 INFO (TEST-UnloadDistributedZkTest.test-seed#[6F42133EBE049F7E]) [ ] o.a.s.c.c.SolrZkClient Using default ZkACLProvider
[junit4] 2> 932013 INFO (TEST-UnloadDistributedZkTest.test-seed#[6F42133EBE049F7E]) [ ] o.a.s.c.c.SolrZkClient makePath: /solr
[junit4] 2> 932014 INFO (TEST-UnloadDistributedZkTest.test-seed#[6F42133EBE049F7E]) [ ] o.a.s.c.c.SolrZkClient Using default ZkCredentialsProvider
[junit4] 2> 932014 INFO (TEST-UnloadDistributedZkTest.test-seed#[6F42133EBE049F7E]) [ ] o.a.s.c.c.ConnectionManager Waiting for client to connect to ZooKeeper
[junit4] 2> 932015 INFO (zkCallback-1161-thread-1) [ ] o.a.s.c.c.ConnectionManager Watcher org.apache.solr.common.cloud.ConnectionManager@1e0dc8 name:ZooKeeperConnection Watcher:127.0.0.1:43092/solr got event WatchedEvent state:SyncConnected type:None path:null path:null type:None
[junit4] 2> 932015 INFO (TEST-UnloadDistributedZkTest.test-seed#[6F42133EBE049F7E]) [ ] o.a.s.c.c.ConnectionManager Client is connected to ZooKeeper
[junit4] 2> 932015 INFO (TEST-UnloadDistributedZkTest.test-seed#[6F42133EBE049F7E]) [ ] o.a.s.c.c.SolrZkClient Using default ZkACLProvider
[junit4] 2> 932015 INFO (TEST-UnloadDistributedZkTest.test-seed#[6F42133EBE049F7E]) [ ] o.a.s.c.c.SolrZkClient makePath: /collections/collection1
[junit4] 2> 932015 INFO (TEST-UnloadDistributedZkTest.test-seed#[6F42133EBE049F7E]) [ ] o.a.s.c.c.SolrZkClient makePath: /collections/collection1/shards
[junit4] 2> 932016 INFO (TEST-UnloadDistributedZkTest.test-seed#[6F42133EBE049F7E]) [ ] o.a.s.c.c.SolrZkClient makePath: /collections/control_collection
[junit4] 2> 932016 INFO (TEST-UnloadDistributedZkTest.test-seed#[6F42133EBE049F7E]) [ ] o.a.s.c.c.SolrZkClient makePath: /collections/control_collection/shards
[junit4] 2> 932017 INFO (TEST-UnloadDistributedZkTest.test-seed#[6F42133EBE049F7E]) [ ] o.a.s.c.AbstractZkTestCase put /home/jenkins/workspace/Lucene-Solr-6.x-Linux/solr/core/src/test-files/solr/collection1/conf/solrconfig-tlog.xml to /configs/conf1/solrconfig.xml
[junit4] 2> 932017 INFO (TEST-UnloadDistributedZkTest.test-seed#[6F42133EBE049F7E]) [ ] o.a.s.c.c.SolrZkClient makePath: /configs/conf1/solrconfig.xml
[junit4] 2> 932018 INFO (TEST-UnloadDistributedZkTest.test-seed#[6F42133EBE049F7E]) [ ] o.a.s.c.AbstractZkTestCase put /home/jenkins/workspace/Lucene-Solr-6.x-Linux/solr/core/src/test-files/solr/collection1/conf/schema.xml to /configs/conf1/schema.xml
[junit4] 2> 932018 INFO (TEST-UnloadDistributedZkTest.test-seed#[6F42133EBE049F7E]) [ ] o.a.s.c.c.SolrZkClient makePath: /configs/conf1/schema.xml
[junit4] 2> 932018 INFO (TEST-UnloadDistributedZkTest.test-seed#[6F42133EBE049F7E]) [ ] o.a.s.c.AbstractZkTestCase put /home/jenkins/workspace/Lucene-Solr-6.x-Linux/solr/core/src/test-files/solr/collection1/conf/solrconfig.snippet.randomindexconfig.xml to /configs/conf1/solrconfig.snippet.randomindexconfig.xml
[junit4] 2> 932019 INFO (TEST-UnloadDistributedZkTest.test-seed#[6F42133EBE049F7E]) [ ] o.a.s.c.c.SolrZkClient makePath: /configs/conf1/solrconfig.snippet.randomindexconfig.xml
[junit4] 2> 932019 INFO (TEST-UnloadDistributedZkTest.test-seed#[6F42133EBE049F7E]) [ ] o.a.s.c.AbstractZkTestCase put /home/jenkins/workspace/Lucene-Solr-6.x-Linux/solr/core/src/test-files/solr/collection1/conf/stopwords.txt to /configs/conf1/stopwords.txt
[junit4] 2> 932019 INFO (TEST-UnloadDistributedZkTest.test-seed#[6F42133EBE049F7E]) [ ] o.a.s.c.c.SolrZkClient makePath: /configs/conf1/stopwords.txt
[junit4] 2> 932020 INFO (TEST-UnloadDistributedZkTest.test-seed#[6F42133EBE049F7E]) [ ] o.a.s.c.AbstractZkTestCase put /home/jenkins/workspace/Lucene-Solr-6.x-Linux/solr/core/src/test-files/solr/collection1/conf/protwords.txt to /configs/conf1/protwords.txt
[junit4] 2> 932020 INFO (TEST-UnloadDistributedZkTest.test-seed#[6F42133EBE049F7E]) [ ] o.a.s.c.c.SolrZkClient makePath: /configs/conf1/protwords.txt
[junit4] 2> 932020 INFO (TEST-UnloadDistributedZkTest.test-seed#[6F42133EBE049F7E]) [ ] o.a.s.c.AbstractZkTestCase put /home/jenkins/workspace/Lucene-Solr-6.x-Linux/solr/core/src/test-files/solr/collection1/conf/currency.xml to /configs/conf1/currency.xml
[junit4] 2> 932020 INFO (TEST-UnloadDistributedZkTest.test-seed#[6F42133EBE049F7E]) [ ] o.a.s.c.c.SolrZkClient makePath: /configs/conf1/currency.xml
[junit4] 2> 932021 INFO (TEST-UnloadDistributedZkTest.test-seed#[6F42133EBE049F7E]) [ ] o.a.s.c.AbstractZkTestCase put /home/jenkins/workspace/Lucene-Solr-6.x-Linux/solr/core/src/test-files/solr/collection1/conf/enumsConfig.xml to /configs/conf1/enumsConfig.xml
[junit4] 2> 932021 INFO (TEST-UnloadDistributedZkTest.test-seed#[6F42133EBE049F7E]) [ ] o.a.s.c.c.SolrZkClient makePath: /configs/conf1/enumsConfig.xml
[junit4] 2> 932021 INFO (TEST-UnloadDistributedZkTest.test-seed#[6F42133EBE049F7E]) [ ] o.a.s.c.AbstractZkTestCase put /home/jenkins/workspace/Lucene-Solr-6.x-Linux/solr/core/src/test-files/solr/collection1/conf/open-exchange-rates.json to /configs/conf1/open-exchange-rates.json
[junit4] 2> 932021 INFO (TEST-UnloadDistributedZkTest.test-seed#[6F42133EBE049F7E]) [ ] o.a.s.c.c.SolrZkClient makePath: /configs/conf1/open-exchange-rates.json
[junit4] 2> 932022 INFO (TEST-UnloadDistributedZkTest.test-seed#[6F42133EBE049F7E]) [ ] o.a.s.c.AbstractZkTestCase put /home/jenkins/workspace/Lucene-Solr-6.x-Linux/solr/core/src/test-files/solr/collection1/conf/mapping-ISOLatin1Accent.txt to /configs/conf1/mapping-ISOLatin1Accent.txt
[junit4] 2> 932022 INFO (TEST-UnloadDistributedZkTest.test-seed#[6F42133EBE049F7E]) [ ] o.a.s.c.c.SolrZkClient makePath: /configs/conf1/mapping-ISOLatin1Accent.txt
[junit4] 2> 932022 INFO (TEST-UnloadDistributedZkTest.test-seed#[6F42133EBE049F7E]) [ ] o.a.s.c.AbstractZkTestCase put /home/jenkins/workspace/Lucene-Solr-6.x-Linux/solr/core/src/test-files/solr/collection1/conf/old_synonyms.txt to /configs/conf1/old_synonyms.txt
[junit4] 2> 932022 INFO (TEST-UnloadDistributedZkTest.test-seed#[6F42133EBE049F7E]) [ ] o.a.s.c.c.SolrZkClient makePath: /configs/conf1/old_synonyms.txt
[junit4] 2> 932023 INFO (TEST-UnloadDistributedZkTest.test-seed#[6F42133EBE049F7E]) [ ] o.a.s.c.AbstractZkTestCase put /home/jenkins/workspace/Lucene-Solr-6.x-Linux/solr/core/src/test-files/solr/collection1/conf/synonyms.txt to /configs/conf1/synonyms.txt
[junit4] 2> 932023 INFO (TEST-UnloadDistributedZkTest.test-seed#[6F42133EBE049F7E]) [ ] o.a.s.c.c.SolrZkClient makePath: /configs/conf1/synonyms.txt
[junit4] 2> 932081 INFO (TEST-UnloadDistributedZkTest.test-seed#[6F42133EBE049F7E]) [ ] o.a.s.SolrTestCaseJ4 Writing core.properties file to /home/jenkins/workspace/Lucene-Solr-6.x-Linux/solr/build/solr-core/test/J1/temp/solr.cloud.UnloadDistributedZkTest_6F42133EBE049F7E-001/control-001/cores/collection1
[junit4] 2> 932082 INFO (TEST-UnloadDistributedZkTest.test-seed#[6F42133EBE049F7E]) [ ] o.e.j.s.Server jetty-9.3.6.v20151106
[junit4] 2> 932082 INFO (TEST-UnloadDistributedZkTest.test-seed#[6F42133EBE049F7E]) [ ] o.e.j.s.h.ContextHandler Started o.e.j.s.ServletContextHandler@d8fe{/,null,AVAILABLE}
[junit4] 2> 932087 INFO (TEST-UnloadDistributedZkTest.test-seed#[6F42133EBE049F7E]) [ ] o.e.j.s.ServerConnector Started ServerConnector@3e8b44{HTTP/1.1,[http/1.1]}{127.0.0.1:37195}
[junit4] 2> 932087 INFO (TEST-UnloadDistributedZkTest.test-seed#[6F42133EBE049F7E]) [ ] o.e.j.s.Server Started @934502ms
[junit4] 2> 932087 INFO (TEST-UnloadDistributedZkTest.test-seed#[6F42133EBE049F7E]) [ ] o.a.s.c.s.e.JettySolrRunner Jetty properties: {solr.data.dir=/home/jenkins/workspace/Lucene-Solr-6.x-Linux/solr/build/solr-core/test/J1/temp/solr.cloud.UnloadDistributedZkTest_6F42133EBE049F7E-001/tempDir-001/control/data, hostContext=/, hostPort=37195, coreRootDirectory=/home/jenkins/workspace/Lucene-Solr-6.x-Linux/solr/build/solr-core/test/J1/../../../../../../../../../home/jenkins/workspace/Lucene-Solr-6.x-Linux/solr/build/solr-core/test/J1/temp/solr.cloud.UnloadDistributedZkTest_6F42133EBE049F7E-001/control-001/cores}
[junit4] 2> 932087 INFO (TEST-UnloadDistributedZkTest.test-seed#[6F42133EBE049F7E]) [ ] o.a.s.s.SolrDispatchFilter SolrDispatchFilter.init(): sun.misc.Launcher$AppClassLoader@1591d15
[junit4] 2> 932087 INFO (TEST-UnloadDistributedZkTest.test-seed#[6F42133EBE049F7E]) [ ] o.a.s.c.SolrResourceLoader new SolrResourceLoader for directory: '/home/jenkins/workspace/Lucene-Solr-6.x-Linux/solr/build/solr-core/test/J1/temp/solr.cloud.UnloadDistributedZkTest_6F42133EBE049F7E-001/control-001'
[junit4] 2> 932087 INFO (TEST-UnloadDistributedZkTest.test-seed#[6F42133EBE049F7E]) [ ] o.a.s.c.SolrResourceLoader JNDI not configured for solr (NoInitialContextEx)
[junit4] 2> 932087 INFO (TEST-UnloadDistributedZkTest.test-seed#[6F42133EBE049F7E]) [ ] o.a.s.c.SolrResourceLoader solr home defaulted to 'solr/' (could not find system property or JNDI)
[junit4] 2> 932087 INFO (TEST-UnloadDistributedZkTest.test-seed#[6F42133EBE049F7E]) [ ] o.a.s.c.c.SolrZkClient Using default ZkCredentialsProvider
[junit4] 2> 932087 INFO (TEST-UnloadDistributedZkTest.test-seed#[6F42133EBE049F7E]) [ ] o.a.s.c.c.ConnectionManager Waiting for client to connect to ZooKeeper
[junit4] 2> 932088 INFO (zkCallback-1162-thread-1) [ ] o.a.s.c.c.ConnectionManager Watcher org.apache.solr.common.cloud.ConnectionManager@15cb6cb name:ZooKeeperConnection Watcher:127.0.0.1:43092/solr got event WatchedEvent state:SyncConnected type:None path:null path:null type:None
[junit4] 2> 932088 INFO (TEST-UnloadDistributedZkTest.test-seed#[6F42133EBE049F7E]) [ ] o.a.s.c.c.ConnectionManager Client is connected to ZooKeeper
[junit4] 2> 932088 INFO (TEST-UnloadDistributedZkTest.test-seed#[6F42133EBE049F7E]) [ ] o.a.s.c.c.SolrZkClient Using default ZkACLProvider
[junit4] 2> 932089 INFO (TEST-UnloadDistributedZkTest.test-seed#[6F42133EBE049F7E]) [ ] o.a.s.s.SolrDispatchFilter Loading solr.xml from SolrHome (not found in ZooKeeper)
[junit4] 2> 932089 INFO (TEST-UnloadDistributedZkTest.test-seed#[6F42133EBE049F7E]) [ ] o.a.s.c.SolrXmlConfig Loading container configuration from /home/jenkins/workspace/Lucene-Solr-6.x-Linux/solr/build/solr-core/test/J1/temp/solr.cloud.UnloadDistributedZkTest_6F42133EBE049F7E-001/control-001/solr.xml
[junit4] 2> 932092 INFO (TEST-UnloadDistributedZkTest.test-seed#[6F42133EBE049F7E]) [ ] o.a.s.c.CorePropertiesLocator Config-defined core root directory: /home/jenkins/workspace/Lucene-Solr-6.x-Linux/solr/build/solr-core/test/J1/../../../../../../../../../home/jenkins/workspace/Lucene-Solr-6.x-Linux/solr/build/solr-core/test/J1/temp/solr.cloud.UnloadDistributedZkTest_6F42133EBE049F7E-001/control-001/cores
[junit4] 2> 932092 INFO (TEST-UnloadDistributedZkTest.test-seed#[6F42133EBE049F7E]) [ ] o.a.s.c.CoreContainer New CoreContainer 22392042
[junit4] 2> 932092 INFO (TEST-UnloadDistributedZkTest.test-seed#[6F42133EBE049F7E]) [ ] o.a.s.c.CoreContainer Loading cores into CoreContainer [instanceDir=/home/jenkins/workspace/Lucene-Solr-6.x-Linux/solr/build/solr-core/test/J1/temp/solr.cloud.UnloadDistributedZkTest_6F42133EBE049F7E-001/control-001]
[junit4] 2> 932092 WARN (TEST-UnloadDistributedZkTest.test-seed#[6F42133EBE049F7E]) [ ] o.a.s.c.CoreContainer Couldn't add files from /home/jenkins/workspace/Lucene-Solr-6.x-Linux/solr/build/solr-core/test/J1/temp/solr.cloud.UnloadDistributedZkTest_6F42133EBE049F7E-001/control-001/lib to classpath: /home/jenkins/workspace/Lucene-Solr-6.x-Linux/solr/build/solr-core/test/J1/temp/solr.cloud.UnloadDistributedZkTest_6F42133EBE049F7E-001/control-001/lib
[junit4] 2> 932092 INFO (TEST-UnloadDistributedZkTest.test-seed#[6F42133EBE049F7E]) [ ] o.a.s.h.c.HttpShardHandlerFactory created with socketTimeout : 90000,urlScheme : ,connTimeout : 15000,maxConnectionsPerHost : 20,maxConnections : 10000,corePoolSize : 0,maximumPoolSize : 2147483647,maxThreadIdleTime : 5,sizeOfQueue : -1,fairnessPolicy : false,useRetries : false,
[junit4] 2> 932093 INFO (TEST-UnloadDistributedZkTest.test-seed#[6F42133EBE049F7E]) [ ] o.a.s.u.UpdateShardHandler Creating UpdateShardHandler HTTP client with params: socketTimeout=340000&connTimeout=45000&retry=true
[junit4] 2> 932094 INFO (TEST-UnloadDistributedZkTest.test-seed#[6F42133EBE049F7E]) [ ] o.a.s.l.LogWatcher SLF4J impl is org.slf4j.impl.Log4jLoggerFactory
[junit4] 2> 932094 INFO (TEST-UnloadDistributedZkTest.test-seed#[6F42133EBE049F7E]) [ ] o.a.s.l.LogWatcher Registering Log Listener [Log4j (org.slf4j.impl.Log4jLoggerFactory)]
[junit4] 2> 932094 INFO (TEST-UnloadDistributedZkTest.test-seed#[6F42133EBE049F7E]) [ ] o.a.s.c.ZkContainer Zookeeper client=127.0.0.1:43092/solr
[junit4] 2> 932094 INFO (TEST-UnloadDistributedZkTest.test-seed#[6F42133EBE049F7E]) [ ] o.a.s.c.ZkController zkHost includes chroot
[junit4] 2> 932094 INFO (TEST-UnloadDistributedZkTest.test-seed#[6F42133EBE049F7E]) [ ] o.a.s.c.c.SolrZkClient Using default ZkCredentialsProvider
[junit4] 2> 932094 INFO (TEST-UnloadDistributedZkTest.test-seed#[6F42133EBE049F7E]) [ ] o.a.s.c.c.ConnectionManager Waiting for client to connect to ZooKeeper
[junit4] 2> 932095 INFO (zkCallback-1165-thread-1) [ ] o.a.s.c.c.ConnectionManager Watcher org.apache.solr.common.cloud.ConnectionManager@18eaefa name:ZooKeeperConnection Watcher:127.0.0.1:43092 got event WatchedEvent state:SyncConnected type:None path:null path:null type:None
[junit4] 2> 932095 INFO (TEST-UnloadDistributedZkTest.test-seed#[6F42133EBE049F7E]) [ ] o.a.s.c.c.ConnectionManager Client is connected to ZooKeeper
[junit4] 2> 932096 INFO (TEST-UnloadDistributedZkTest.test-seed#[6F42133EBE049F7E]) [ ] o.a.s.c.c.SolrZkClient Using default ZkACLProvider
[junit4] 2> 932096 INFO (TEST-UnloadDistributedZkTest.test-seed#[6F42133EBE049F7E]) [ ] o.a.s.c.c.ConnectionManager Waiting for client to connect to ZooKeeper
[junit4] 2> 932097 INFO (zkCallback-1166-thread-1) [ ] o.a.s.c.c.ConnectionManager Watcher org.apache.solr.common.cloud.ConnectionManager@17277 name:ZooKeeperConnection Watcher:127.0.0.1:43092/solr got event WatchedEvent state:SyncConnected type:None path:null path:null type:None
[junit4] 2> 932097 INFO (TEST-UnloadDistributedZkTest.test-seed#[6F42133EBE049F7E]) [ ] o.a.s.c.c.ConnectionManager Client is connected to ZooKeeper
[junit4] 2> 932098 INFO (TEST-UnloadDistributedZkTest.test-seed#[6F42133EBE049F7E]) [ ] o.a.s.c.c.SolrZkClient makePath: /overseer/queue
[junit4] 2> 932099 INFO (TEST-UnloadDistributedZkTest.test-seed#[6F42133EBE049F7E]) [ ] o.a.s.c.c.SolrZkClient makePath: /overseer/collection-queue-work
[junit4] 2> 932100 INFO (TEST-UnloadDistributedZkTest.test-seed#[6F42133EBE049F7E]) [ ] o.a.s.c.c.SolrZkClient makePath: /overseer/collection-map-running
[junit4] 2> 932100 INFO (TEST-UnloadDistributedZkTest.test-seed#[6F42133EBE049F7E]) [ ] o.a.s.c.c.SolrZkClient makePath: /overseer/collection-map-completed
[junit4] 2> 932101 INFO (TEST-UnloadDistributedZkTest.test-seed#[6F42133EBE049F7E]) [ ] o.a.s.c.c.SolrZkClient makePath: /overseer/collection-map-failure
[junit4] 2> 932101 INFO (TEST-UnloadDistributedZkTest.test-seed#[6F42133EBE049F7E]) [ ] o.a.s.c.c.SolrZkClient makePath: /live_nodes
[junit4] 2> 932102 INFO (TEST-UnloadDistributedZkTest.test-seed#[6F42133EBE049F7E]) [ ] o.a.s.c.c.SolrZkClient makePath: /aliases.json
[junit4] 2> 932102 INFO (TEST-UnloadDistributedZkTest.test-seed#[6F42133EBE049F7E]) [ ] o.a.s.c.c.SolrZkClient makePath: /clusterstate.json
[junit4] 2> 932103 INFO (TEST-UnloadDistributedZkTest.test-seed#[6F42133EBE049F7E]) [ ] o.a.s.c.c.SolrZkClient makePath: /security.json
[junit4] 2> 932103 INFO (TEST-UnloadDistributedZkTest.test-seed#[6F42133EBE049F7E]) [ ] o.a.s.c.c.ZkStateReader Updating cluster state from ZooKeeper...
[junit4] 2> 932103 INFO (TEST-UnloadDistributedZkTest.test-seed#[6F42133EBE049F7E]) [ ] o.a.s.c.c.ZkStateReader Updated live nodes from ZooKeeper... (0) -> (0)
[junit4] 2> 932104 INFO (TEST-UnloadDistributedZkTest.test-seed#[6F42133EBE049F7E]) [ ] o.a.s.c.c.SolrZkClient makePath: /overseer_elect
[junit4] 2> 932104 INFO (TEST-UnloadDistributedZkTest.test-seed#[6F42133EBE049F7E]) [ ] o.a.s.c.c.SolrZkClient makePath: /overseer_elect/election
[junit4] 2> 932104 INFO (TEST-UnloadDistributedZkTest.test-seed#[6F42133EBE049F7E]) [ ] o.a.s.c.Overseer Overseer (id=null) closing
[junit4] 2> 932105 INFO (TEST-UnloadDistributedZkTest.test-seed#[6F42133EBE049F7E]) [ ] o.a.s.c.LeaderElector Joined leadership election with path: /overseer_elect/election/95561725928210436-127.0.0.1:37195_-n_0000000000
[junit4] 2> 932105 INFO (TEST-UnloadDistributedZkTest.test-seed#[6F42133EBE049F7E]) [ ] o.a.s.c.OverseerElectionContext I am going to be the leader 127.0.0.1:37195_
[junit4] 2> 932105 INFO (TEST-UnloadDistributedZkTest.test-seed#[6F42133EBE049F7E]) [ ] o.a.s.c.c.SolrZkClient makePath: /overseer_elect/leader
[junit4] 2> 932105 INFO (TEST-UnloadDistributedZkTest.test-seed#[6F42133EBE049F7E]) [ ] o.a.s.c.Overseer Overseer (id=95561725928210436-127.0.0.1:37195_-n_0000000000) starting
[junit4] 2> 932106 INFO (TEST-UnloadDistributedZkTest.test-seed#[6F42133EBE049F7E]) [ ] o.a.s.c.c.SolrZkClient makePath: /overseer/queue-work
[junit4] 2> 932108 INFO (TEST-UnloadDistributedZkTest.test-seed#[6F42133EBE049F7E]) [ ] o.a.s.c.OverseerAutoReplicaFailoverThread Starting OverseerAutoReplicaFailoverThread autoReplicaFailoverWorkLoopDelay=10000 autoReplicaFailoverWaitAfterExpiration=10000 autoReplicaFailoverBadNodeExpiration=60000
[junit4] 2> 932108 INFO (OverseerCollectionConfigSetProcessor-95561725928210436-127.0.0.1:37195_-n_0000000000) [ ] o.a.s.c.OverseerTaskProcessor Process current queue of overseer operations
[junit4] 2> 932108 INFO (OverseerStateUpdate-95561725928210436-127.0.0.1:37195_-n_0000000000) [ ] o.a.s.c.Overseer Starting to work on the main queue
[junit4] 2> 932108 INFO (TEST-UnloadDistributedZkTest.test-seed#[6F42133EBE049F7E]) [ ] o.a.s.c.ZkController Register node as live in ZooKeeper:/live_nodes/127.0.0.1:37195_
[junit4] 2> 932109 INFO (TEST-UnloadDistributedZkTest.test-seed#[6F42133EBE049F7E]) [ ] o.a.s.c.c.SolrZkClient makePath: /live_nodes/127.0.0.1:37195_
[junit4] 2> 932110 INFO (OverseerStateUpdate-95561725928210436-127.0.0.1:37195_-n_0000000000) [ ] o.a.s.c.c.ZkStateReader Updated live nodes from ZooKeeper... (0) -> (0)
[junit4] 2> 932110 INFO (zkCallback-1166-thread-1) [ ] o.a.s.c.c.ZkStateReader A live node change: [WatchedEvent state:SyncConnected type:NodeChildrenChanged path:/live_nodes], has occurred - updating... (live nodes size: [0])
[junit4] 2> 932110 INFO (zkCallback-1166-thread-1) [ ] o.a.s.c.c.ZkStateReader Updated live nodes from ZooKeeper... (0) -> (1)
[junit4] 2> 932123 INFO (TEST-UnloadDistributedZkTest.test-seed#[6F42133EBE049F7E]) [ ] o.a.s.c.CoreContainer Security conf doesn't exist. Skipping setup for authorization module.
[junit4] 2> 932123 INFO (TEST-UnloadDistributedZkTest.test-seed#[6F42133EBE049F7E]) [ ] o.a.s.c.CoreContainer No authentication plugin used.
[junit4] 2> 932124 INFO (TEST-UnloadDistributedZkTest.test-seed#[6F42133EBE049F7E]) [ ] o.a.s.c.CorePropertiesLocator Looking for core definitions underneath /home/jenkins/workspace/Lucene-Solr-6.x-Linux/solr/build/solr-core/test/J1/../../../../../../../../../home/jenkins/workspace/Lucene-Solr-6.x-Linux/solr/build/solr-core/test/J1/temp/solr.cloud.UnloadDistributedZkTest_6F42133EBE049F7E-001/control-001/cores
[junit4] 2> 932124 INFO (TEST-UnloadDistributedZkTest.test-seed#[6F42133EBE049F7E]) [ ] o.a.s.c.CoreDescriptor Created CoreDescriptor: {name=collection1, config=solrconfig.xml, transient=false, schema=schema.xml, loadOnStartup=true, configSetProperties=configsetprops.json, collection=control_collection, coreNodeName=, dataDir=data/, shard=}
[junit4] 2> 932125 INFO (TEST-UnloadDistributedZkTest.test-seed#[6F42133EBE049F7E]) [ ] o.a.s.c.CorePropertiesLocator Found core collection1 in /home/jenkins/workspace/Lucene-Solr-6.x-Linux/solr/build/solr-core/test/J1/../../../../../../../../../home/jenkins/workspace/Lucene-Solr-6.x-Linux/solr/build/solr-core/test/J1/temp/solr.cloud.UnloadDistributedZkTest_6F42133EBE049F7E-001/control-001/cores/collection1
[junit4] 2> 932125 INFO (TEST-UnloadDistributedZkTest.test-seed#[6F42133EBE049F7E]) [ ] o.a.s.c.CorePropertiesLocator Found 1 core definitions
[junit4] 2> 932125 INFO (TEST-UnloadDistributedZkTest.test-seed#[6F42133EBE049F7E]) [ ] o.a.s.s.SolrDispatchFilter user.dir=/home/jenkins/workspace/Lucene-Solr-6.x-Linux/solr/build/solr-core/test/J1
[junit4] 2> 932125 INFO (TEST-UnloadDistributedZkTest.test-seed#[6F42133EBE049F7E]) [ ] o.a.s.s.SolrDispatchFilter SolrDispatchFilter.init() done
[junit4] 2> 932125 INFO (coreLoadExecutor-2715-thread-1) [ ] o.a.s.c.ZkController publishing state=down
[junit4] 2> 932125 INFO (coreLoadExecutor-2715-thread-1) [ ] o.a.s.c.ZkController numShards not found on descriptor - reading it from system property
[junit4] 2> 932126 INFO (OverseerStateUpdate-95561725928210436-127.0.0.1:37195_-n_0000000000) [ ] o.a.s.c.Overseer processMessage: queueSize: 1, message = {
[junit4] 2> "core":"collection1",
[junit4] 2> "roles":null,
[junit4] 2> "base_url":"http://127.0.0.1:37195",
[junit4] 2> "node_name":"127.0.0.1:37195_",
[junit4] 2> "numShards":"1",
[junit4] 2> "state":"down",
[junit4] 2> "shard":null,
[junit4] 2> "collection":"control_collection",
[junit4] 2> "operation":"state"} current state version: 0
[junit4] 2> 932126 INFO (coreLoadExecutor-2715-thread-1) [ ] o.a.s.c.ZkController look for our core node name
[junit4] 2> 932126 INFO (OverseerStateUpdate-95561725928210436-127.0.0.1:37195_-n_0000000000) [ ] o.a.s.c.o.ReplicaMutator Update state numShards=1 message={
[junit4] 2> "core":"collection1",
[junit4] 2> "roles":null,
[junit4] 2> "base_url":"http://127.0.0.1:37195",
[junit4] 2> "node_name":"127.0.0.1:37195_",
[junit4] 2> "numShards":"1",
[junit4] 2> "state":"down",
[junit4] 2> "shard":null,
[junit4] 2> "collection":"control_collection",
[junit4] 2> "operation":"state"}
[junit4] 2> 932126 INFO (OverseerStateUpdate-95561725928210436-127.0.0.1:37195_-n_0000000000) [ ] o.a.s.c.o.ClusterStateMutator building a new cName: control_collection
[junit4] 2> 932127 INFO (OverseerStateUpdate-95561725928210436-127.0.0.1:37195_-n_0000000000) [ ] o.a.s.c.o.ReplicaMutator Assigning new node to shard shard=shard1
[junit4] 2> 932127 INFO (zkCallback-1166-thread-1) [ ] o.a.s.c.c.ZkStateReader A cluster state change: [WatchedEvent state:SyncConnected type:NodeDataChanged path:/clusterstate.json], has occurred - updating... (live nodes size: [1])
[junit4] 2> 933126 INFO (coreLoadExecutor-2715-thread-1) [ ] o.a.s.c.ZkController waiting to find shard id in clusterstate for collection1
[junit4] 2> 933126 INFO (coreLoadExecutor-2715-thread-1) [ ] o.a.s.c.ZkController Check for collection zkNode:control_collection
[junit4] 2> 933127 INFO (coreLoadExecutor-2715-thread-1) [ ] o.a.s.c.ZkController Collection zkNode exists
[junit4] 2> 933127 INFO (coreLoadExecutor-2715-thread-1) [ ] o.a.s.c.c.ZkStateReader Load collection config from: [/collections/control_collection]
[junit4] 2> 933127 INFO (coreLoadExecutor-2715-thread-1) [ ] o.a.s.c.c.ZkStateReader path=[/collections/control_collection] [configName]=[conf1] specified config exists in ZooKeeper
[junit4] 2> 933127 INFO (coreLoadExecutor-2715-thread-1) [ ] o.a.s.c.SolrResourceLoader new SolrResourceLoader for directory: '/home/jenkins/workspace/Lucene-Solr-6.x-Linux/solr/build/solr-core/test/J1/temp/solr.cloud.UnloadDistributedZkTest_6F42133EBE049F7E-001/control-001/cores/collection1'
[junit4] 2> 933127 INFO (coreLoadExecutor-2715-thread-1) [ ] o.a.s.c.SolrResourceLoader JNDI not configured for solr (NoInitialContextEx)
[junit4] 2> 933127 INFO (coreLoadExecutor-2715-thread-1) [ ] o.a.s.c.SolrResourceLoader solr home defaulted to 'solr/' (could not find system property or JNDI)
[junit4] 2> 933128 INFO (coreLoadExecutor-2715-thread-1) [ ] o.a.s.c.Config loaded config solrconfig.xml with version 0
[junit4] 2> 933131 INFO (coreLoadExecutor-2715-thread-1) [ ] o.a.s.c.SolrConfig current version of requestparams : -1
[junit4] 2> 933134 INFO (coreLoadExecutor-2715-thread-1) [ ] o.a.s.c.SolrConfig Using Lucene MatchVersion: 6.1.0
[junit4] 2> 933160 INFO (coreLoadExecutor-2715-thread-1) [ ] o.a.s.c.SolrConfig Loaded SolrConfig: solrconfig.xml
[junit4] 2> 933163 INFO (coreLoadExecutor-2715-thread-1) [ ] o.a.s.s.IndexSchema [collection1] Schema name=test
[junit4] 2> 933212 INFO (coreLoadExecutor-2715-thread-1) [ ] o.a.s.s.OpenExchangeRatesOrgProvider Initialized with rates=open-exchange-rates.json, refreshInterval=1440.
[junit4] 2> 933216 INFO (coreLoadExecutor-2715-thread-1) [ ] o.a.s.s.IndexSchema default search field in schema is text
[junit4] 2> 933217 INFO (coreLoadExecutor-2715-thread-1) [ ] o.a.s.s.IndexSchema unique key field: id
[junit4] 2> 933221 INFO (coreLoadExecutor-2715-thread-1) [ ] o.a.s.s.FileExchangeRateProvider Reloading exchange rates from file currency.xml
[junit4] 2> 933222 INFO (coreLoadExecutor-2715-thread-1) [ ] o.a.s.s.FileExchangeRateProvider Reloading exchange rates from file currency.xml
[junit4] 2> 933223 INFO (coreLoadExecutor-2715-thread-1) [ ] o.a.s.s.OpenExchangeRatesOrgProvider Reloading exchange rates from open-exchange-rates.json
[junit4] 2> 933223 INFO (coreLoadExecutor-2715-thread-1) [ ] o.a.s.s.OpenExchangeRatesOrgProvider Reloading exchange rates from open-exchange-rates.json
[junit4] 2> 933224 INFO (coreLoadExecutor-2715-thread-1) [ ] o.a.s.c.ConfigSetProperties Did not find ConfigSet properties, assuming default properties: Can't find resource 'configsetprops.json' in classpath or '/configs/conf1', cwd=/home/jenkins/workspace/Lucene-Solr-6.x-Linux/solr/build/solr-core/test/J1
[junit4] 2> 933224 INFO (coreLoadExecutor-2715-thread-1) [ ] o.a.s.c.CoreContainer Creating SolrCore 'collection1' using configuration from collection control_collection
[junit4] 2> 933224 INFO (coreLoadExecutor-2715-thread-1) [ ] o.a.s.c.SolrCore org.apache.solr.core.MockDirectoryFactory
[junit4] 2> 933224 INFO (coreLoadExecutor-2715-thread-1) [ ] o.a.s.c.SolrCore [[collection1] ] Opening new SolrCore at [/home/jenkins/workspace/Lucene-Solr-6.x-Linux/solr/build/solr-core/test/J1/temp/solr.cloud.UnloadDistributedZkTest_6F42133EBE049F7E-001/control-001/cores/collection1], dataDir=[/home/jenkins/workspace/Lucene-Solr-6.x-Linux/solr/build/solr-core/test/J1/../../../../../../../../../home/jenkins/workspace/Lucene-Solr-6.x-Linux/solr/build/solr-core/test/J1/temp/solr.cloud.UnloadDistributedZkTest_6F42133EBE049F7E-001/control-001/cores/collection1/data/]
[junit4] 2> 933224 INFO (coreLoadExecutor-2715-thread-1) [ ] o.a.s.c.JmxMonitoredMap JMX monitoring is enabled. Adding Solr mbeans to JMX Server: com.sun.jmx.mbeanserver.JmxMBeanServer@134e49e
[junit4] 2> 933225 INFO (coreLoadExecutor-2715-thread-1) [ ] o.a.s.c.CachingDirectoryFactory return new directory for /home/jenkins/workspace/Lucene-Solr-6.x-Linux/solr/build/solr-core/test/J1/../../../../../../../../../home/jenkins/workspace/Lucene-Solr-6.x-Linux/solr/build/solr-core/test/J1/temp/solr.cloud.UnloadDistributedZkTest_6F42133EBE049F7E-001/control-001/cores/collection1/data
[junit4] 2> 933225 INFO (coreLoadExecutor-2715-thread-1) [ ] o.a.s.c.SolrCore New index directory detected: old=null new=/home/jenkins/workspace/Lucene-Solr-6.x-Linux/solr/build/solr-core/test/J1/../../../../../../../../../home/jenkins/workspace/Lucene-Solr-6.x-Linux/solr/build/solr-core/test/J1/temp/solr.cloud.UnloadDistributedZkTest_6F42133EBE049F7E-001/control-001/cores/collection1/data/index/
[junit4] 2> 933225 WARN (coreLoadExecutor-2715-thread-1) [ ] o.a.s.c.SolrCore [collection1] Solr index directory '/home/jenkins/workspace/Lucene-Solr-6.x-Linux/solr/build/solr-core/test/J1/../../../../../../../../../home/jenkins/workspace/Lucene-Solr-6.x-Linux/solr/build/solr-core/test/J1/temp/solr.cloud.UnloadDistributedZkTest_6F42133EBE049F7E-001/control-001/cores/collection1/data/index' doesn't exist. Creating new index...
[junit4] 2> 933226 INFO (coreLoadExecutor-2715-thread-1) [ ] o.a.s.c.CachingDirectoryFactory return new directory for /home/jenkins/workspace/Lucene-Solr-6.x-Linux/solr/build/solr-core/test/J1/../../../../../../../../../home/jenkins/workspace/Lucene-Solr-6.x-Linux/solr/build/solr-core/test/J1/temp/solr.cloud.UnloadDistributedZkTest_6F42133EBE049F7E-001/control-001/cores/collection1/data/index
[junit4] 2> 933226 INFO (coreLoadExecutor-2715-thread-1) [ ] o.a.s.u.RandomMergePolicy RandomMergePolicy wrapping class org.apache.lucene.index.TieredMergePolicy: [TieredMergePolicy: maxMergeAtOnce=22, maxMergeAtOnceExplicit=15, maxMergedSegmentMB=48.697265625, floorSegmentMB=0.705078125, forceMergeDeletesPctAllowed=9.421971657727855, segmentsPerTier=19.0, maxCFSSegmentSizeMB=8.796093022207999E12, noCFSRatio=1.0
[junit4] 2> 933226 INFO (coreLoadExecutor-2715-thread-1) [ ] o.a.s.c.SolrDeletionPolicy SolrDeletionPolicy.onCommit: commits: num=1
[junit4] 2> commit{dir=MockDirectoryWrapper(RAMDirectory@f48b27 lockFactory=org.apache.lucene.store.SingleInstanceLockFactory@6be9c8),segFN=segments_1,generation=1}
[junit4] 2> 933226 INFO (coreLoadExecutor-2715-thread-1) [ ] o.a.s.c.SolrDeletionPolicy newest commit generation = 1
[junit4] 2> 933226 INFO (OldIndexDirectoryCleanupThreadForCore-collection1) [ ] o.a.s.c.SolrCore Looking for old index directories to cleanup for core collection1 in /home/jenkins/workspace/Lucene-Solr-6.x-Linux/solr/build/solr-core/test/J1/../../../../../../../../../home/jenkins/workspace/Lucene-Solr-6.x-Linux/solr/build/solr-core/test/J1/temp/solr.cloud.UnloadDistributedZkTest_6F42133EBE049F7E-001/control-001/cores/collection1/data/
[junit4] 2> 933227 WARN (OldIndexDirectoryCleanupThreadForCore-collection1) [ ] o.a.s.c.DirectoryFactory /home/jenkins/workspace/Lucene-Solr-6.x-Linux/solr/build/solr-core/test/J1/../../../../../../../../../home/jenkins/workspace/Lucene-Solr-6.x-Linux/solr/build/solr-core/test/J1/temp/solr.cloud.UnloadDistributedZkTest_6F42133EBE049F7E-001/control-001/cores/collection1/data/ does not point to a valid data directory; skipping clean-up of old index directories.
[junit4] 2> 933229 INFO (coreLoadExecutor-2715-thread-1) [ ] o.a.s.u.p.UpdateRequestProcessorChain creating updateRequestProcessorChain "nodistrib"
[junit4] 2> 933229 INFO (coreLoadExecutor-2715-thread-1) [ ] o.a.s.u.p.UpdateRequestProcessorChain creating updateRequestProcessorChain "dedupe"
[junit4] 2> 933229 INFO (coreLoadExecutor-2715-thread-1) [ ] o.a.s.u.p.UpdateRequestProcessorChain inserting DistributedUpdateProcessorFactory into updateRequestProcessorChain "dedupe"
[junit4] 2> 933229 INFO (coreLoadExecutor-2715-thread-1) [ ] o.a.s.u.p.UpdateRequestProcessorChain creating updateRequestProcessorChain "stored_sig"
[junit4] 2> 933229 INFO (coreLoadExecutor-2715-thread-1) [ ] o.a.s.u.p.UpdateRequestProcessorChain inserting DistributedUpdateProcessorFactory into updateRequestProcessorChain "stored_sig"
[junit4] 2> 933229 INFO (coreLoadExecutor-2715-thread-1) [ ] o.a.s.u.p.UpdateRequestProcessorChain creating updateRequestProcessorChain "distrib-dup-test-chain-explicit"
[junit4] 2> 933229 INFO (coreLoadExecutor-2715-thread-1) [ ] o.a.s.u.p.UpdateRequestProcessorChain creating updateRequestProcessorChain "distrib-dup-test-chain-implicit"
[junit4] 2> 933229 INFO (coreLoadExecutor-2715-thread-1) [ ] o.a.s.u.p.UpdateRequestProcessorChain inserting DistributedUpdateProcessorFactory into updateRequestProcessorChain "distrib-dup-test-chain-implicit"
[junit4] 2> 933230 INFO (coreLoadExecutor-2715-thread-1) [ ] o.a.s.c.SolrCore no updateRequestProcessorChain defined as default, creating implicit default
[junit4] 2> 933230 WARN (coreLoadExecutor-2715-thread-1) [ ] o.a.s.c.RequestHandlers INVALID paramSet a in requestHandler {type = requestHandler,name = /dump,class = DumpRequestHandler,args = {defaults={a=A,b=B}}}
[junit4] 2> 933231 INFO (coreLoadExecutor-2715-thread-1) [ ] o.a.s.h.l.XMLLoader xsltCacheLifetimeSeconds=60
[junit4] 2> 933231 INFO (coreLoadExecutor-2715-thread-1) [ ] o.a.s.h.l.XMLLoader xsltCacheLifetimeSeconds=60
[junit4] 2> 933232 INFO (coreLoadExecutor-2715-thread-1) [ ] o.a.s.h.l.XMLLoader xsltCacheLifetimeSeconds=60
[junit4] 2> 933232 INFO (coreLoadExecutor-2715-thread-1) [ ] o.a.s.h.l.XMLLoader xsltCacheLifetimeSeconds=60
[junit4] 2> 933234 INFO (coreLoadExecutor-2715-thread-1) [ ] o.a.s.c.RequestHandlers Registered paths: /admin/mbeans,standard,/dump,/update/csv,/sql,/update/json/docs,/admin/luke,/export,/admin/segments,/get,/admin/system,/replication,/admin/properties,/config,/stream,/schema,/admin/plugins,/admin/logging,/update/json,/admin/ping,/admin/threads,/update,/admin/file
[junit4] 2> 933234 INFO (coreLoadExecutor-2715-thread-1) [ ] o.a.s.c.SolrCore Using default statsCache cache: org.apache.solr.search.stats.LocalStatsCache
[junit4] 2> 933234 INFO (coreLoadExecutor-2715-thread-1) [ ] o.a.s.u.UpdateHandler Using UpdateLog implementation: org.apache.solr.update.UpdateLog
[junit4] 2> 933234 INFO (coreLoadExecutor-2715-thread-1) [ ] o.a.s.u.UpdateLog Initializing UpdateLog: dataDir= defaultSyncLevel=FLUSH numRecordsToKeep=100 maxNumLogsToKeep=10 numVersionBuckets=65536
[junit4] 2> 933235 INFO (coreLoadExecutor-2715-thread-1) [ ] o.a.s.u.CommitTracker Hard AutoCommit: disabled
[junit4] 2> 933235 INFO (coreLoadExecutor-2715-thread-1) [ ] o.a.s.u.CommitTracker Soft AutoCommit: disabled
[junit4] 2> 933235 INFO (coreLoadExecutor-2715-thread-1) [ ] o.a.s.u.RandomMergePolicy RandomMergePolicy wrapping class org.apache.lucene.index.MockRandomMergePolicy: org.apache.lucene.index.MockRandomMergePolicy@1f13243
[junit4] 2> 933235 INFO (coreLoadExecutor-2715-thread-1) [ ] o.a.s.c.SolrDeletionPolicy SolrDeletionPolicy.onInit: commits: num=1
[junit4] 2> commit{dir=MockDirectoryWrapper(RAMDirectory@f48b27 lockFactory=org.apache.lucene.store.SingleInstanceLockFactory@6be9c8),segFN=segments_1,generation=1}
[junit4] 2> 933235 INFO (coreLoadExecutor-2715-thread-1) [ ] o.a.s.c.SolrDeletionPolicy newest commit generation = 1
[junit4] 2> 933235 INFO (coreLoadExecutor-2715-thread-1) [ ] o.a.s.s.SolrIndexSearcher Opening [Searcher@12bf477[collection1] main]
[junit4] 2> 933235 INFO (coreLoadExecutor-2715-thread-1) [ ] o.a.s.c.c.ZkStateReader Load collection config from: [/collections/control_collection]
[junit4] 2> 933236 INFO (coreLoadExecutor-2715-thread-1) [ ] o.a.s.c.c.ZkStateReader path=[/collections/control_collection] [configName]=[conf1] specified config exists in ZooKeeper
[junit4] 2> 933236 INFO (coreLoadExecutor-2715-thread-1) [ ] o.a.s.r.ManagedResourceStorage Setting up ZooKeeper-based storage for the RestManager with znodeBase: /configs/conf1
[junit4] 2> 933236 INFO (coreLoadExecutor-2715-thread-1) [ ] o.a.s.r.ManagedResourceStorage Configured ZooKeeperStorageIO with znodeBase: /configs/conf1
[junit4] 2> 933236 INFO (coreLoadExecutor-2715-thread-1) [ ] o.a.s.r.RestManager Initializing RestManager with initArgs: {}
[junit4] 2> 933236 INFO (coreLoadExecutor-2715-thread-1) [ ] o.a.s.r.ManagedResourceStorage Reading _rest_managed.json using ZooKeeperStorageIO:path=/configs/conf1
[junit4] 2> 933236 INFO (coreLoadExecutor-2715-thread-1) [ ] o.a.s.r.ManagedResourceStorage No data found for znode /configs/conf1/_rest_managed.json
[junit4] 2> 933236 INFO (coreLoadExecutor-2715-thread-1) [ ] o.a.s.r.ManagedResourceStorage Loaded null at path _rest_managed.json using ZooKeeperStorageIO:path=/configs/conf1
[junit4] 2> 933236 INFO (coreLoadExecutor-2715-thread-1) [ ] o.a.s.r.RestManager Initializing 0 registered ManagedResources
[junit4] 2> 933236 INFO (coreLoadExecutor-2715-thread-1) [ ] o.a.s.h.ReplicationHandler Commits will be reserved for 10000
[junit4] 2> 933237 INFO (searcherExecutor-2716-thread-1) [ ] o.a.s.c.SolrCore [collection1] Registered new searcher Searcher@12bf477[collection1] main{ExitableDirectoryReader(UninvertingDirectoryReader())}
[junit4] 2> 933237 INFO (coreLoadExecutor-2715-thread-1) [ ] o.a.s.u.UpdateLog Looking up max value of version field to seed version buckets
[junit4] 2> 933237 INFO (coreLoadExecutor-2715-thread-1) [ ] o.a.s.u.VersionInfo Refreshing highest value of _version_ for 65536 version buckets from index
[junit4] 2> 933237 INFO (coreLoadExecutor-2715-thread-1) [ ] o.a.s.u.VersionInfo No terms found for _version_, cannot seed version bucket highest value from index
[junit4] 2> 933237 INFO (coreLoadExecutor-2715-thread-1) [ ] o.a.s.u.UpdateLog Could not find max version in index or recent updates, using new clock 1528987616240730112
[junit4] 2> 933239 INFO (coreLoadExecutor-2715-thread-1) [ ] o.a.s.u.UpdateLog Took 1.0ms to seed version buckets with highest version 1528987616240730112
[junit4] 2> 933239 INFO (coreLoadExecutor-2715-thread-1) [ ] o.a.s.c.ZkController watch zkdir /configs/conf1
[junit4] 2> 933239 INFO (coreLoadExecutor-2715-thread-1) [ ] o.a.s.c.CoreContainer registering core: collection1
[junit4] 2> 933239 INFO (coreZkRegister-2709-thread-1) [ ] o.a.s.c.ZkController Register replica - core:collection1 address:http://127.0.0.1:37195 collection:control_collection shard:shard1
[junit4] 2> 933240 INFO (coreZkRegister-2709-thread-1) [ ] o.a.s.c.c.SolrZkClient makePath: /collections/control_collection/leader_elect/shard1/election
[junit4] 2> 933241 INFO (coreZkRegister-2709-thread-1) [ ] o.a.s.c.LeaderElector Joined leadership election with path: /collections/control_collection/leader_elect/shard1/election/95561725928210436-core_node1-n_0000000000
[junit4] 2> 933241 INFO (coreZkRegister-2709-thread-1) [ ] o.a.s.c.ShardLeaderElectionContext Running the leader process for shard=shard1 and weAreReplacement=false and leaderVoteWait=180000
[junit4] 2> 933242 INFO (coreZkRegister-2709-thread-1) [ ] o.a.s.c.ShardLeaderElectionContext Enough replicas found to continue.
[junit4] 2> 933242 INFO (coreZkRegister-2709-thread-1) [ ] o.a.s.c.ShardLeaderElectionContext I may be the new leader - try and sync
[junit4] 2> 933242 INFO (coreZkRegister-2709-thread-1) [ ] o.a.s.c.SyncStrategy Sync replicas to http://127.0.0.1:37195/collection1/
[junit4] 2> 933242 INFO (coreZkRegister-2709-thread-1) [ ] o.a.s.c.SyncStrategy Sync Success - now sync replicas to me
[junit4] 2> 933242 INFO (OverseerStateUpdate-95561725928210436-127.0.0.1:37195_-n_0000000000) [ ] o.a.s.c.Overseer processMessage: queueSize: 1, message = {
[junit4] 2> "operation":"leader",
[junit4] 2> "shard":"shard1",
[junit4] 2> "collection":"control_collection"} current state version: 1
[junit4] 2> 933242 INFO (coreZkRegister-2709-thread-1) [ ] o.a.s.c.SyncStrategy http://127.0.0.1:37195/collection1/ has no replicas
[junit4] 2> 933242 INFO (coreZkRegister-2709-thread-1) [ ] o.a.s.c.c.SolrZkClient makePath: /collections/control_collection/leaders/shard1
[junit4] 2> 933243 INFO (coreZkRegister-2709-thread-1) [ ] o.a.s.c.ShardLeaderElectionContextBase Creating leader registration node /collections/control_collection/leaders/shard1/leader after winning as /collections/control_collection/leader_elect/shard1/election/95561725928210436-core_node1-n_0000000000
[junit4] 2> 933244 INFO (coreZkRegister-2709-thread-1) [ ] o.a.s.c.ShardLeaderElectionContext I am the new leader: http://127.0.0.1:37195/collection1/ shard1
[junit4] 2> 933244 INFO (OverseerStateUpdate-95561725928210436-127.0.0.1:37195_-n_0000000000) [ ] o.a.s.c.Overseer processMessage: queueSize: 1, message = {
[junit4] 2> "operation":"leader",
[junit4] 2> "shard":"shard1",
[junit4] 2> "collection":"control_collection",
[junit4] 2> "base_url":"http://127.0.0.1:37195",
[junit4] 2> "core":"collection1",
[junit4] 2> "state":"active"} current state version: 1
[junit4] 2> 933345 INFO (zkCallback-1166-thread-1) [ ] o.a.s.c.c.ZkStateReader A cluster state change: [WatchedEvent state:SyncConnected type:NodeDataChanged path:/clusterstate.json], has occurred - updating... (live nodes size: [1])
[junit4] 2> 933394 INFO (coreZkRegister-2709-thread-1) [ ] o.a.s.c.ZkController We are http://127.0.0.1:37195/collection1/ and leader is http://127.0.0.1:37195/collection1/
[junit4] 2> 933394 INFO (coreZkRegister-2709-thread-1) [ ] o.a.s.c.ZkController No LogReplay needed for core=collection1 baseURL=http://127.0.0.1:37195
[junit4] 2> 933394 INFO (coreZkRegister-2709-thread-1) [ ] o.a.s.c.ZkController I am the leader, no recovery necessary
[junit4] 2> 933394 INFO (coreZkRegister-2709-thread-1) [ ] o.a.s.c.ZkController publishing state=active
[junit4] 2> 933394 INFO (coreZkRegister-2709-thread-1) [ ] o.a.s.c.ZkController numShards not found on descriptor - reading it from system property
[junit4] 2> 933396 INFO (OverseerStateUpdate-95561725928210436-127.0.0.1:37195_-n_0000000000) [ ] o.a.s.c.Overseer processMessage: queueSize: 1, message = {
[junit4] 2> "core":"collection1",
[junit4] 2> "core_node_name":"core_node1",
[junit4] 2> "roles":null,
[junit4] 2> "base_url":"http://127.0.0.1:37195",
[junit4] 2> "node_name":"127.0.0.1:37195_",
[junit4] 2> "numShards":"1",
[junit4] 2> "state":"active",
[junit4] 2> "shard":"shard1",
[junit4] 2> "collection":"control_collection",
[junit4] 2> "operation":"state"} current state version: 2
[junit4] 2> 933396 INFO (OverseerStateUpdate-95561725928210436-127.0.0.1:37195_-n_0000000000) [ ] o.a.s.c.o.ReplicaMutator Update state numShards=1 message={
[junit4] 2> "core":"collection1",
[junit4] 2> "core_node_name":"core_node1",
[junit4] 2> "roles":null,
[junit4] 2> "base_url":"http://127.0.0.1:37195",
[junit4] 2> "node_name":"127.0.0.1:37195_",
[junit4] 2> "numShards":"1",
[junit4] 2> "state":"active",
[junit4] 2> "shard":"shard1",
[junit4] 2> "collection":"control_collection",
[junit4] 2> "operation":"state"}
[junit4] 2> 933497 INFO (zkCallback-1166-thread-1) [ ] o.a.s.c.c.ZkStateReader A cluster state change: [WatchedEvent state:SyncConnected type:NodeDataChanged path:/clusterstate.json], has occurred - updating... (live nodes size: [1])
[junit4] 2> 933627 INFO (TEST-UnloadDistributedZkTest.test-seed#[6F42133EBE049F7E]) [ ] o.a.s.c.c.SolrZkClient Using default ZkCredentialsProvider
[junit4] 2> 933627 INFO (TEST-UnloadDistributedZkTest.test-seed#[6F42133EBE049F7E]) [ ] o.a.s.c.c.ConnectionManager Waiting for client to connect to ZooKeeper
[junit4] 2> 933628 INFO (zkCallback-1168-thread-1) [ ] o.a.s.c.c.ConnectionManager Watcher org.apache.solr.common.cloud.ConnectionManager@19b5957 name:ZooKeeperConnection Watcher:127.0.0.1:43092/solr got event WatchedEvent state:SyncConnected type:None path:null path:null type:None
[junit4] 2> 933628 INFO (TEST-UnloadDistributedZkTest.test-seed#[6F42133EBE049F7E]) [ ] o.a.s.c.c.ConnectionManager Client is connected to ZooKeeper
[junit4] 2> 933628 INFO (TEST-UnloadDistributedZkTest.test-seed#[6F42133EBE049F7E]) [ ] o.a.s.c.c.SolrZkClient Using default ZkACLProvider
[junit4] 2> 933628 INFO (TEST-UnloadDistributedZkTest.test-seed#[6F42133EBE049F7E]) [ ] o.a.s.c.c.ZkStateReader Updating cluster state from ZooKeeper...
[junit4] 2> 933628 INFO (TEST-UnloadDistributedZkTest.test-seed#[6F42133EBE049F7E]) [ ] o.a.s.c.c.ZkStateReader Updated live nodes from ZooKeeper... (0) -> (1)
[junit4] 2> 933629 INFO (TEST-UnloadDistributedZkTest.test-seed#[6F42133EBE049F7E]) [ ] o.a.s.c.ChaosMonkey monkey: init - expire sessions:false cause connection loss:false
[junit4] 2> 933629 INFO (TEST-UnloadDistributedZkTest.test-seed#[6F42133EBE049F7E]) [ ] o.a.s.c.AbstractFullDistribZkTestBase Creating collection1 with stateFormat=2
[junit4] 2> 933629 INFO (TEST-UnloadDistributedZkTest.test-seed#[6F42133EBE049F7E]) [ ] o.a.s.c.c.SolrZkClient Using default ZkCredentialsProvider
[junit4] 2> 933629 INFO (TEST-UnloadDistributedZkTest.test-seed#[6F42133EBE049F7E]) [ ] o.a.s.c.c.ConnectionManager Waiting for client to connect to ZooKeeper
[junit4] 2> 933629 INFO (zkCallback-1169-thread-1) [ ] o.a.s.c.c.ConnectionManager Watcher org.apache.solr.common.cloud.ConnectionManager@15ed6bd name:ZooKeeperConnection Watcher:127.0.0.1:43092/solr got event WatchedEvent state:SyncConnected type:None path:null path:null type:None
[junit4] 2> 933629 INFO (TEST-UnloadDistributedZkTest.test-seed#[6F42133EBE049F7E]) [ ] o.a.s.c.c.ConnectionManager Client is connected to ZooKeeper
[junit4] 2> 933630 INFO (TEST-UnloadDistributedZkTest.test-seed#[6F42133EBE049F7E]) [ ] o.a.s.c.c.SolrZkClient Using default ZkACLProvider
[junit4] 2> 933630 INFO (OverseerStateUpdate-95561725928210436-127.0.0.1:37195_-n_0000000000) [ ] o.a.s.c.Overseer processMessage: queueSize: 1, message = {
[junit4] 2> "operation":"create",
[junit4] 2> "name":"collection1",
[junit4] 2> "numShards":"2",
[junit4] 2> "stateFormat":"2"} current state version: 3
[junit4] 2> 933630 INFO (OverseerStateUpdate-95561725928210436-127.0.0.1:37195_-n_0000000000) [ ] o.a.s.c.o.ClusterStateMutator building a new cName: collection1
[junit4] 2> 933688 INFO (TEST-UnloadDistributedZkTest.test-seed#[6F42133EBE049F7E]) [ ] o.a.s.SolrTestCaseJ4 Writing core.properties file to /home/jenkins/workspace/Lucene-Solr-6.x-Linux/solr/build/solr-core/test/J1/temp/solr.cloud.UnloadDistributedZkTest_6F42133EBE049F7E-001/shard-1-001/cores/collection1
[junit4] 2> 933689 INFO (TEST-UnloadDistributedZkTest.test-seed#[6F42133EBE049F7E]) [ ] o.a.s.c.AbstractFullDistribZkTestBase create jetty 1 in directory /home/jenkins/workspace/Lucene-Solr-6.x-Linux/solr/build/solr-core/test/J1/temp/solr.cloud.UnloadDistributedZkTest_6F42133EBE049F7E-001/shard-1-001
[junit4] 2> 933690 INFO (TEST-UnloadDistributedZkTest.test-seed#[6F42133EBE049F7E]) [ ] o.e.j.s.Server jetty-9.3.6.v20151106
[junit4] 2> 933690 INFO (TEST-UnloadDistributedZkTest.test-seed#[6F42133EBE049F7E]) [ ] o.e.j.s.h.ContextHandler Started o.e.j.s.ServletContextHandler@1d93f26{/,null,AVAILABLE}
[junit4] 2> 933691 INFO (TEST-UnloadDistributedZkTest.test-seed#[6F42133EBE049F7E]) [ ] o.e.j.s.ServerConnector Started ServerConnector@753e97{HTTP/1.1,[http/1.1]}{127.0.0.1:35854}
[junit4] 2> 933691 INFO (TEST-UnloadDistributedZkTest.test-seed#[6F42133EBE049F7E]) [ ] o.e.j.s.Server Started @936107ms
[junit4] 2> 933691 INFO (TEST-UnloadDistributedZkTest.test-seed#[6F42133EBE049F7E]) [ ] o.a.s.c.s.e.JettySolrRunner Jetty properties: {solr.data.dir=/home/jenkins/workspace/Lucene-Solr-6.x-Linux/solr/build/solr-core/test/J1/temp/solr.cloud.UnloadDistributedZkTest_6F42133EBE049F7E-001/tempDir-001/jetty1, solrconfig=solrconfig.xml, hostContext=/, hostPort=35854, coreRootDirectory=/home/jenkins/workspace/Lucene-Solr-6.x-Linux/solr/build/solr-core/test/J1/temp/solr.cloud.UnloadDistributedZkTest_6F42133EBE049F7E-001/shard-1-001/cores}
[junit4] 2> 933691 INFO (TEST-UnloadDistributedZkTest.test-seed#[6F42133EBE049F7E]) [ ] o.a.s.s.SolrDispatchFilter SolrDispatchFilter.init(): sun.misc.Launcher$AppClassLoader@1591d15
[junit4] 2> 933691 INFO (TEST-UnloadDistributedZkTest.test-seed#[6F42133EBE049F7E]) [ ] o.a.s.c.SolrResourceLoader new SolrResourceLoader for directory: '/home/jenkins/workspace/Lucene-Solr-6.x-Linux/solr/build/solr-core/test/J1/temp/solr.cloud.UnloadDistributedZkTest_6F42133EBE049F7E-001/shard-1-001'
[junit4] 2> 933691 INFO (TEST-UnloadDistributedZkTest.test-seed#[6F42133EBE049F7E]) [ ] o.a.s.c.SolrResourceLoader JNDI not configured for solr (NoInitialContextEx)
[junit4] 2> 933691 INFO (TEST-UnloadDistributedZkTest.test-seed#[6F42133EBE049F7E]) [ ] o.a.s.c.SolrResourceLoader solr home defaulted to 'solr/' (could not find system property or JNDI)
[junit4] 2> 933692 INFO (TEST-UnloadDistributedZkTest.test-seed#[6F42133EBE049F7E]) [ ] o.a.s.c.c.SolrZkClient Using default ZkCredentialsProvider
[junit4] 2> 933692 INFO (TEST-UnloadDistributedZkTest.test-seed#[6F42133EBE049F7E]) [ ] o.a.s.c.c.ConnectionManager Waiting for client to connect to ZooKeeper
[junit4] 2> 933692 INFO (zkCallback-1170-thread-1) [ ] o.a.s.c.c.ConnectionManager Watcher org.apache.solr.common.cloud.ConnectionManager@9e6ab2 name:ZooKeeperConnection Watcher:127.0.0.1:43092/solr got event WatchedEvent state:SyncConnected type:None path:null path:null type:None
[junit4] 2> 933692 INFO (TEST-UnloadDistributedZkTest.test-seed#[6F42133EBE049F7E]) [ ] o.a.s.c.c.ConnectionManager Client is connected to ZooKeeper
[junit4] 2> 933693 INFO (TEST-UnloadDistributedZkTest.test-seed#[6F42133EBE049F7E]) [ ] o.a.s.c.c.SolrZkClient Using default ZkACLProvider
[junit4] 2> 933694 INFO (TEST-UnloadDistributedZkTest.test-seed#[6F42133EBE049F7E]) [ ] o.a.s.s.SolrDispatchFilter Loading solr.xml from SolrHome (not found in ZooKeeper)
[junit4] 2> 933694 INFO (TEST-UnloadDistributedZkTest.test-seed#[6F42133EBE049F7E]) [ ] o.a.s.c.SolrXmlConfig Loading container configuration from /home/jenkins/workspace/Lucene-Solr-6.x-Linux/solr/build/solr-core/test/J1/temp/solr.cloud.UnloadDistributedZkTest_6F42133EBE049F7E-001/shard-1-001/solr.xml
[junit4] 2> 933696 INFO (TEST-UnloadDistributedZkTest.test-seed#[6F42133EBE049F7E]) [ ] o.a.s.c.CorePropertiesLocator Config-defined core root directory: /home/jenkins/workspace/Lucene-Solr-6.x-Linux/solr/build/solr-core/test/J1/temp/solr.cloud.UnloadDistributedZkTest_6F42133EBE049F7E-001/shard-1-001/cores
[junit4] 2> 933696 INFO (TEST-UnloadDistributedZkTest.test-seed#[6F42133EBE049F7E]) [ ] o.a.s.c.CoreContainer New CoreContainer 26268755
[junit4] 2> 933696 INFO (TEST-UnloadDistributedZkTest.test-seed#[6F42133EBE049F7E]) [ ] o.a.s.c.CoreContainer Loading cores into CoreContainer [instanceDir=/home/jenkins/workspace/Lucene-Solr-6.x-Linux/solr/build/solr-core/test/J1/temp/solr.cloud.UnloadDistributedZkTest_6F42133EBE049F7E-001/shard-1-001]
[junit4] 2> 933696 WARN (TEST-UnloadDistributedZkTest.test-seed#[6F42133EBE049F7E]) [ ] o.a.s.c.CoreContainer Couldn't add files from /home/jenkins/workspace/Lucene-Solr-6.x-Linux/solr/build/solr-core/test/J1/temp/solr.cloud.UnloadDistributedZkTest_6F42133EBE049F7E-001/shard-1-001/lib to classpath: /home/jenkins/workspace/Lucene-Solr-6.x-Linux/solr/build/solr-core/test/J1/temp/solr.cloud.UnloadDistributedZkTest_6F42133EBE049F7E-001/shard-1-001/lib
[junit4] 2> 933697 INFO (TEST-UnloadDistributedZkTest.test-seed#[6F42133EBE049F7E]) [ ] o.a.s.h.c.HttpShardHandlerFactory created with socketTimeout : 90000,urlScheme : ,connTimeout : 15000,maxConnectionsPerHost : 20,maxConnections : 10000,corePoolSize : 0,maximumPoolSize : 2147483647,maxThreadIdleTime : 5,sizeOfQueue : -1,fairnessPolicy : false,useRetries : false,
[junit4] 2> 933697 INFO (TEST-UnloadDistributedZkTest.test-seed#[6F42133EBE049F7E]) [ ] o.a.s.u.UpdateShardHandler Creating UpdateShardHandler HTTP client with params: socketTimeout=340000&connTimeout=45000&retry=true
[junit4] 2> 933698 INFO (TEST-UnloadDistributedZkTest.test-seed#[6F42133EBE049F7E]) [ ] o.a.s.l.LogWatcher SLF4J impl is org.slf4j.impl.Log4jLoggerFactory
[junit4] 2> 933698 INFO (TEST-UnloadDistributedZkTest.test-seed#[6F42133EBE049F7E]) [ ] o.a.s.l.LogWatcher Registering Log Listener [Log4j (org.slf4j.impl.Log4jLoggerFactory)]
[junit4] 2> 933698 INFO (TEST-UnloadDistributedZkTest.test-seed#[6F42133EBE049F7E]) [ ] o.a.s.c.ZkContainer Zookeeper client=127.0.0.1:43092/solr
[junit4] 2> 933698 INFO (TEST-UnloadDistributedZkTest.test-seed#[6F42133EBE049F7E]) [ ] o.a.s.c.ZkController zkHost includes chroot
[junit4] 2> 933698 INFO (TEST-UnloadDistributedZkTest.test-seed#[6F42133EBE049F7E]) [ ] o.a.s.c.c.SolrZkClient Using default ZkCredentialsProvider
[junit4] 2> 933698 INFO (TEST-UnloadDistributedZkTest.test-seed#[6F42133EBE049F7E]) [ ] o.a.s.c.c.ConnectionManager Waiting for client to connect to ZooKeeper
[junit4] 2> 933698 INFO (zkCallback-1173-thread-1) [ ] o.a.s.c.c.ConnectionManager Watcher org.apache.solr.common.cloud.ConnectionManager@239887 name:ZooKeeperConnection Watcher:127.0.0.1:43092 got event WatchedEvent state:SyncConnected type:None path:null path:null type:None
[junit4] 2> 933699 INFO (TEST-UnloadDistributedZkTest.test-seed#[6F42133EBE049F7E]) [ ] o.a.s.c.c.ConnectionManager Client is connected to ZooKeeper
[junit4] 2> 933699 INFO (TEST-UnloadDistributedZkTest.test-seed#[6F42133EBE049F7E]) [ ] o.a.s.c.c.SolrZkClient Using default ZkACLProvider
[junit4] 2> 933700 INFO (TEST-UnloadDistributedZkTest.test-seed#[6F42133EBE049F7E]) [ ] o.a.s.c.c.ConnectionManager Waiting for client to connect to ZooKeeper
[junit4] 2> 933700 INFO (zkCallback-1174-thread-1) [ ] o.a.s.c.c.ConnectionManager Watcher org.apache.solr.common.cloud.ConnectionManager@17ec912 name:ZooKeeperConnection Watcher:127.0.0.1:43092/solr got event WatchedEvent state:SyncConnected type:None path:null path:null type:None
[junit4] 2> 933701 INFO (TEST-UnloadDistributedZkTest.test-seed#[6F42133EBE049F7E]) [ ] o.a.s.c.c.ConnectionManager Client is connected to ZooKeeper
[junit4] 2> 933703 INFO (TEST-UnloadDistributedZkTest.test-seed#[6F42133EBE049F7E]) [ ] o.a.s.c.c.ZkStateReader Updating cluster state from ZooKeeper...
[junit4] 2> 933703 INFO (TEST-UnloadDistributedZkTest.test-seed#[6F42133EBE049F7E]) [ ] o.a.s.c.c.ZkStateReader Updated live nodes from ZooKeeper... (0) -> (1)
[junit4] 2> 933703 INFO (TEST-UnloadDistributedZkTest.test-seed#[6F42133EBE049F7E]) [ ] o.a.s.c.Overseer Overseer (id=null) closing
[junit4] 2> 933704 INFO (TEST-UnloadDistributedZkTest.test-seed#[6F42133EBE049F7E]) [ ] o.a.s.c.LeaderElector Joined leadership election with path: /overseer_elect/election/95561725928210441-127.0.0.1:35854_-n_0000000001
[junit4] 2> 933704 INFO (TEST-UnloadDistributedZkTest.test-seed#[6F42133EBE049F7E]) [ ] o.a.s.c.LeaderElector Watching path /overseer_elect/election/95561725928210436-127.0.0.1:37195_-n_0000000000 to know if I could be the leader
[junit4] 2> 933704 INFO (TEST-UnloadDistributedZkTest.test-seed#[6F42133EBE049F7E]) [ ] o.a.s.c.ZkController Publish node=127.0.0.1:35854_ as DOWN
[junit4] 2> 933704 INFO (OverseerStateUpdate-95561725928210436-127.0.0.1:37195_-n_0000000000) [ ] o.a.s.c.Overseer processMessage: queueSize: 1, message = {
[junit4] 2> "operation":"downnode",
[junit4] 2> "node_name":"127.0.0.1:35854_"} current state version: 3
[junit4] 2> 933705 INFO (OverseerStateUpdate-95561725928210436-127.0.0.1:37195_-n_0000000000) [ ] o.a.s.c.o.NodeMutator DownNode state invoked for node: 127.0.0.1:35854_
[junit4] 2> 933705 INFO (OverseerStateUpdate-95561725928210436-127.0.0.1:37195_-n_0000000000) [ ] o.a.s.c.o.ZkStateWriter going to create_collection /collections/collection1/state.json
[junit4] 2> 933807 INFO (zkCallback-1166-thread-1) [ ] o.a.s.c.c.ZkStateReader A cluster state change: [WatchedEvent state:SyncConnected type:NodeDataChanged path:/clusterstate.json], has occurred - updating... (live nodes size: [1])
[junit4] 2> 933807 INFO (zkCallback-1174-thread-1) [ ] o.a.s.c.c.ZkStateReader A cluster state change: [WatchedEvent state:SyncConnected type:NodeDataChanged path:/clusterstate.json], has occurred - updating... (live nodes size: [1])
[junit4] 2> 933807 INFO (zkCallback-1168-thread-1) [ ] o.a.s.c.c.ZkStateReader A cluster state change: [WatchedEvent state:SyncConnected type:NodeDataChanged path:/clusterstate.json], has occurred - updating... (live nodes size: [1])
[junit4] 2> 934705 INFO (TEST-UnloadDistributedZkTest.test-seed#[6F42133EBE049F7E]) [ ] o.a.s.c.ZkController Register node as live in ZooKeeper:/live_nodes/127.0.0.1:35854_
[junit4] 2> 934705 INFO (TEST-UnloadDistributedZkTest.test-seed#[6F42133EBE049F7E]) [ ] o.a.s.c.c.SolrZkClient makePath: /live_nodes/127.0.0.1:35854_
[junit4] 2> 934706 INFO (zkCallback-1174-thread-1) [ ] o.a.s.c.c.ZkStateReader A live node change: [WatchedEvent state:SyncConnected type:NodeChildrenChanged path:/live_nodes], has occurred - updating... (live nodes size: [1])
[junit4] 2> 934706 INFO (zkCallback-1166-thread-1) [ ] o.a.s.c.c.ZkStateReader A live node change: [WatchedEvent state:SyncConnected type:NodeChildrenChanged path:/live_nodes], has occurred - updating... (live nodes size: [1])
[junit4] 2> 934706 INFO (zkCallback-1168-thread-1) [ ] o.a.s.c.c.ZkStateReader A live node change: [WatchedEvent state:SyncConnected type:NodeChildrenChanged path:/live_nodes], has occurred - updating... (live nodes size: [1])
[junit4] 2> 934706 INFO (zkCallback-1174-thread-1) [ ] o.a.s.c.c.ZkStateReader Updated live nodes from ZooKeeper... (1) -> (2)
[junit4] 2> 934706 INFO (zkCallback-1168-thread-1) [ ] o.a.s.c.c.ZkStateReader Updated live nodes from ZooKeeper... (1) -> (2)
[junit4] 2> 934706 INFO (zkCallback-1166-thread-1) [ ] o.a.s.c.c.ZkStateReader Updated live nodes from ZooKeeper... (1) -> (2)
[junit4] 2> 934719 INFO (TEST-UnloadDistributedZkTest.test-seed#[6F42133EBE049F7E]) [ ] o.a.s.c.CoreContainer Security conf doesn't exist. Skipping setup for authorization module.
[junit4] 2> 934719 INFO (TEST-UnloadDistributedZkTest.test-seed#[6F42133EBE049F7E]) [ ] o.a.s.c.CoreContainer No authentication plugin used.
[junit4] 2> 934720 INFO (TEST-UnloadDistributedZkTest.test-seed#[6F42133EBE049F7E]) [ ] o.a.s.c.CorePropertiesLocator Looking for core definitions underneath /home/jenkins/workspace/Lucene-Solr-6.x-Linux/solr/build/solr-core/test/J1/temp/solr.cloud.UnloadDistributedZkTest_6F42133EBE049F7E-001/shard-1-001/cores
[junit4] 2> 934720 INFO (TEST-UnloadDistributedZkTest.test-seed#[6F42133EBE049F7E]) [ ] o.a.s.c.CoreDescriptor Created CoreDescriptor: {name=collection1, config=solrconfig.xml, transient=false, schema=schema.xml, loadOnStartup=true, configSetProperties=configsetprops.json, collection=collection1, coreNodeName=, dataDir=data/, shard=}
[junit4] 2> 934720 INFO (TEST-UnloadDistributedZkTest.test-seed#[6F42133EBE049F7E]) [ ] o.a.s.c.CorePropertiesLocator Found core collection1 in /home/jenkins/workspace/Lucene-Solr-6.x-Linux/solr/build/solr-core/test/J1/temp/solr.cloud.UnloadDistributedZkTest_6F42133EBE049F7E-001/shard-1-001/cores/collection1
[junit4] 2> 934720 INFO (TEST-UnloadDistributedZkTest.test-seed#[6F42133EBE049F7E]) [ ] o.a.s.c.CorePropertiesLocator Found 1 core definitions
[junit4] 2> 934721 INFO (TEST-UnloadDistributedZkTest.test-seed#[6F42133EBE049F7E]) [ ] o.a.s.s.SolrDispatchFilter user.dir=/home/jenkins/workspace/Lucene-Solr-6.x-Linux/solr/build/solr-core/test/J1
[junit4] 2> 934721 INFO (TEST-UnloadDistributedZkTest.test-seed#[6F42133EBE049F7E]) [ ] o.a.s.s.SolrDispatchFilter SolrDispatchFilter.init() done
[junit4] 2> 934721 INFO (coreLoadExecutor-2726-thread-1) [ ] o.a.s.c.ZkController publishing state=down
[junit4] 2> 934721 INFO (coreLoadExecutor-2726-thread-1) [ ] o.a.s.c.ZkController numShards not found on descriptor - reading it from system property
[junit4] 2> 934722 INFO (coreLoadExecutor-2726-thread-1) [ ] o.a.s.c.ZkController Registering watch for collection collection1
[junit4] 2> 934722 INFO (coreLoadExecutor-2726-thread-1) [ ] o.a.s.c.c.ZkStateReader addZkWatch [collection1]
[junit4] 2> 934722 INFO (OverseerStateUpdate-95561725928210436-127.0.0.1:37195_-n_0000000000) [ ] o.a.s.c.Overseer processMessage: queueSize: 1, message = {
[junit4] 2> "core":"collection1",
[junit4] 2> "roles":null,
[junit4] 2> "base_url":"http://127.0.0.1:35854",
[junit4] 2> "node_name":"127.0.0.1:35854_",
[junit4] 2> "numShards":"2",
[junit4] 2> "state":"down",
[junit4] 2> "shard":null,
[junit4] 2> "collection":"collection1",
[junit4] 2> "operation":"state"} current state version: 4
[junit4] 2> 934722 INFO (coreLoadExecutor-2726-thread-1) [ ] o.a.s.c.c.ZkStateReader Add data for [collection1] ver [0]
[junit4] 2> 934722 INFO (coreLoadExecutor-2726-thread-1) [ ] o.a.s.c.ZkController look for our core node name
[junit4] 2> 934722 INFO (OverseerStateUpdate-95561725928210436-127.0.0.1:37195_-n_0000000000) [ ] o.a.s.c.o.ReplicaMutator Update state numShards=2 message={
[junit4] 2> "core":"collection1",
[junit4] 2> "roles":null,
[junit4] 2> "base_url":"http://127.0.0.1:35854",
[junit4] 2> "node_name":"127.0.0.1:35854_",
[junit4] 2> "numShards":"2",
[junit4] 2> "state":"down",
[junit4] 2> "shard":null,
[junit4] 2> "collection":"collection1",
[junit4] 2> "operation":"state"}
[junit4] 2> 934722 INFO (OverseerStateUpdate-95561725928210436-127.0.0.1:37195_-n_0000000000) [ ] o.a.s.c.o.ReplicaMutator Collection already exists with numShards=2
[junit4] 2> 934722 INFO (OverseerStateUpdate-95561725928210436-127.0.0.1:37195_-n_0000000000) [ ] o.a.s.c.o.ReplicaMutator Assigning new node to shard shard=shard2
[junit4] 2> 934823 INFO (OverseerStateUpdate-95561725928210436-127.0.0.1:37195_-n_0000000000) [ ] o.a.s.c.o.ZkStateWriter going to update_collection /collections/collection1/state.json version: 0
[junit4] 2> 934823 INFO (zkCallback-1174-thread-1) [ ] o.a.s.c.c.ZkStateReader A cluster state change: [WatchedEvent state:SyncConnected type:NodeDataChanged path:/collections/collection1/state.json] for collection [collection1] has occurred - updating... (live nodes size: [2])
[junit4] 2> 934824 INFO (zkCallback-1174-thread-1) [ ] o.a.s.c.c.ZkStateReader Updating data for [collection1] from [0] to [1]
[junit4] 2> 935722 INFO (coreLoadExecutor-2726-thread-1) [ ] o.a.s.c.ZkController waiting to find shard id in clusterstate for collection1
[junit4] 2> 935722 INFO (coreLoadExecutor-2726-thread-1) [ ] o.a.s.c.ZkController Check for collection zkNode:collection1
[junit4] 2> 935722 INFO (coreLoadExecutor-2726-thread-1) [ ] o.a.s.c.ZkController Collection zkNode exists
[junit4] 2> 935722 INFO (coreLoadExecutor-2726-thread-1) [ ] o.a.s.c.c.ZkStateReader Load collection config from: [/collections/collection1]
[junit4] 2> 935723 INFO (coreLoadExecutor-2726-thread-1) [ ] o.a.s.c.c.ZkStateReader path=[/collections/collection1] [configName]=[conf1] specified config exists in ZooKeeper
[junit4] 2> 935723 INFO (coreLoadExecutor-2726-thread-1) [ ] o.a.s.c.SolrResourceLoader new SolrResourceLoader for directory: '/home/jenkins/workspace/Lucene-Solr-6.x-Linux/solr/build/solr-core/test/J1/temp/solr.cloud.UnloadDistributedZkTest_6F42133EBE049F7E-001/shard-1-001/cores/collection1'
[junit4] 2> 935723 INFO (coreLoadExecutor-2726-thread-1) [ ] o.a.s.c.SolrResourceLoader JNDI not configured for solr (NoInitialContextEx)
[junit4] 2> 935723 INFO (coreLoadExecutor-2726-thread-1) [ ] o.a.s.c.SolrResourceLoader solr home defaulted to 'solr/' (could not find system property or JNDI)
[junit4] 2> 935724 INFO (coreLoadExecutor-2726-thread-1) [ ] o.a.s.c.Config loaded config solrconfig.xml with version 0
[junit4] 2> 935727 INFO (coreLoadExecutor-2726-thread-1) [ ] o.a.s.c.SolrConfig current version of requestparams : -1
[junit4] 2> 935729 INFO (coreLoadExecutor-2726-thread-1) [ ] o.a.s.c.SolrConfig Using Lucene MatchVersion: 6.1.0
[junit4] 2> 935734 INFO (coreLoadExecutor-2726-thread-1) [ ] o.a.s.c.SolrConfig Loaded SolrConfig: solrconfig.xml
[junit4] 2> 935738 INFO (coreLoadExecutor-2726-thread-1) [ ] o.a.s.s.IndexSchema [collection1] Schema name=test
[junit4] 2> 935789 INFO (coreLoadExecutor-2726-thread-1) [ ] o.a.s.s.OpenExchangeRatesOrgProvider Initialized with rates=open-exchange-rates.json, refreshInterval=1440.
[junit4] 2> 935793 INFO (coreLoadExecutor-2726-thread-1) [ ] o.a.s.s.IndexSchema default search field in schema is text
[junit4] 2> 935793 INFO (coreLoadExecutor-2726-thread-1) [ ] o.a.s.s.IndexSchema unique key field: id
[junit4] 2> 935797 INFO (coreLoadExecutor-2726-thread-1) [ ] o.a.s.s.FileExchangeRateProvider Reloading exchange rates from file currency.xml
[junit4] 2> 935798 INFO (coreLoadExecutor-2726-thread-1) [ ] o.a.s.s.FileExchangeRateProvider Reloading exchange rates from file currency.xml
[junit4] 2> 935799 INFO (coreLoadExecutor-2726-thread-1) [ ] o.a.s.s.OpenExchangeRatesOrgProvider Reloading exchange rates from open-exchange-rates.json
[junit4] 2> 935799 INFO (coreLoadExecutor-2726-thread-1) [ ] o.a.s.s.OpenExchangeRatesOrgProvider Reloading exchange rates from open-exchange-rates.json
[junit4] 2> 935800 INFO (coreLoadExecutor-2726-thread-1) [ ] o.a.s.c.ConfigSetProperties Did not find ConfigSet properties, assuming default properties: Can't find resource 'configsetprops.json' in classpath or '/configs/conf1', cwd=/home/jenkins/workspace/Lucene-Solr-6.x-Linux/solr/build/solr-core/test/J1
[junit4] 2> 935800 INFO (coreLoadExecutor-2726-thread-1) [ ] o.a.s.c.CoreContainer Creating SolrCore 'collection1' using configuration from collection collection1
[junit4] 2> 935800 INFO (coreLoadExecutor-2726-thread-1) [ ] o.a.s.c.SolrCore org.apache.solr.core.MockDirectoryFactory
[junit4] 2> 935800 INFO (coreLoadExecutor-2726-thread-1) [ ] o.a.s.c.SolrCore [[collection1] ] Opening new SolrCore at [/home/jenkins/workspace/Lucene-Solr-6.x-Linux/solr/build/solr-core/test/J1/temp/solr.cloud.UnloadDistributedZkTest_6F42133EBE049F7E-001/shard-1-001/cores/collection1], dataDir=[/home/jenkins/workspace/Lucene-Solr-6.x-Linux/solr/build/solr-core/test/J1/temp/solr.cloud.UnloadDistributedZkTest_6F42133EBE049F7E-001/shard-1-001/cores/collection1/data/]
[junit4] 2> 935800 INFO (coreLoadExecutor-2726-thread-1) [ ] o.a.s.c.JmxMonitoredMap JMX monitoring is enabled. Adding Solr mbeans to JMX Server: com.sun.jmx.mbeanserver.JmxMBeanServer@134e49e
[junit4] 2> 935801 INFO (coreLoadExecutor-2726-thread-1) [ ] o.a.s.c.CachingDirectoryFactory return new directory for /home/jenkins/workspace/Lucene-Solr-6.x-Linux/solr/build/solr-core/test/J1/temp/solr.cloud.UnloadDistributedZkTest_6F42133EBE049F7E-001/shard-1-001/cores/collection1/data
[junit4] 2> 935801 INFO (coreLoadExecutor-2726-thread-1) [ ] o.a.s.c.SolrCore New index directory detected: old=null new=/home/jenkins/workspace/Lucene-Solr-6.x-Linux/solr/build/solr-core/test/J1/temp/solr.cloud.UnloadDistributedZkTest_6F42133EBE049F7E-001/shard-1-001/cores/collection1/data/index/
[junit4] 2> 935801 WARN (coreLoadExecutor-2726-thread-1) [ ] o.a.s.c.SolrCore [collection1] Solr index directory '/home/jenkins/workspace/Lucene-Solr-6.x-Linux/solr/build/solr-core/test/J1/temp/solr.cloud.UnloadDistributedZkTest_6F42133EBE049F7E-001/shard-1-001/cores/collection1/data/index' doesn't exist. Creating new index...
[junit4] 2> 935801 INFO (coreLoadExecutor-2726-thread-1) [ ] o.a.s.c.CachingDirectoryFactory return new directory for /home/jenkins/workspace/Lucene-Solr-6.x-Linux/solr/build/solr-core/test/J1/temp/solr.cloud.UnloadDistributedZkTest_6F42133EBE049F7E-001/shard-1-001/cores/collection1/data/index
[junit4] 2> 935802 INFO (coreLoadExecutor-2726-thread-1) [ ] o.a.s.u.RandomMergePolicy RandomMergePolicy wrapping class org.apache.lucene.index.TieredMergePolicy: [TieredMergePolicy: maxMergeAtOnce=22, maxMergeAtOnceExplicit=15, maxMergedSegmentMB=48.697265625, floorSegmentMB=0.705078125, forceMergeDeletesPctAllowed=9.421971657727855, segmentsPerTier=19.0, maxCFSSegmentSizeMB=8.796093022207999E12, noCFSRatio=1.0
[junit4] 2> 935802 INFO (coreLoadExecutor-2726-thread-1) [ ] o.a.s.c.SolrDeletionPolicy SolrDeletionPolicy.onCommit: commits: num=1
[junit4] 2> commit{dir=MockDirectoryWrapper(RAMDirectory@1ab8274 lockFactory=org.apache.lucene.store.SingleInstanceLockFactory@1e8f125),segFN=segments_1,generation=1}
[junit4] 2> 935802 INFO (coreLoadExecutor-2726-thread-1) [ ] o.a.s.c.SolrDeletionPolicy newest commit generation = 1
[junit4] 2> 935802 INFO (OldIndexDirectoryCleanupThreadForCore-collection1) [ ] o.a.s.c.SolrCore Looking for old index directories to cleanup for core collection1 in /home/jenkins/workspace/Lucene-Solr-6.x-Linux/solr/build/solr-core/test/J1/temp/solr.cloud.UnloadDistributedZkTest_6F42133EBE049F7E-001/shard-1-001/cores/collection1/data/
[junit4] 2> 935802 WARN (OldIndexDirectoryCleanupThreadForCore-collection1) [ ] o.a.s.c.DirectoryFactory /home/jenkins/workspace/Lucene-Solr-6.x-Linux/solr/build/solr-core/test/J1/temp/solr.cloud.UnloadDistributedZkTest_6F42133EBE049F7E-001/shard-1-001/cores/collection1/data/ does not point to a valid data directory; skipping clean-up of old index directories.
[junit4] 2> 935806 INFO (coreLoadExecutor-2726-thread-1) [ ] o.a.s.u.p.UpdateRequestProcessorChain creating updateRequestProcessorChain "nodistrib"
[junit4] 2> 935806 INFO (coreLoadExecutor-2726-thread-1) [ ] o.a.s.u.p.UpdateRequestProcessorChain creating updateRequestProcessorChain "dedupe"
[junit4] 2> 935806 INFO (coreLoadExecutor-2726-thread-1) [ ] o.a.s.u.p.UpdateRequestProcessorChain inserting DistributedUpdateProcessorFactory into updateRequestProcessorChain "dedupe"
[junit4] 2> 935806 INFO (coreLoadExecutor-2726-thread-1) [ ] o.a.s.u.p.UpdateRequestProcessorChain creating updateRequestProcessorChain "stored_sig"
[junit4] 2> 935806 INFO (coreLoadExecutor-2726-thread-1) [ ] o.a.s.u.p.UpdateRequestProcessorChain inserting DistributedUpdateProcessorFactory into updateRequestProcessorChain "stored_sig"
[junit4] 2> 935806 INFO (coreLoadExecutor-2726-thread-1) [ ] o.a.s.u.p.UpdateRequestProcessorChain creating updateRequestProcessorChain "distrib-dup-test-chain-explicit"
[junit4] 2> 935806 INFO (coreLoadExecutor-2726-thread-1) [ ] o.a.s.u.p.UpdateRequestProcessorChain creating updateRequestProcessorChain "distrib-dup-test-chain-implicit"
[junit4] 2> 935806 INFO (coreLoadExecutor-2726-thread-1) [ ] o.a.s.u.p.UpdateRequestProcessorChain inserting DistributedUpdateProcessorFactory into updateRequestProcessorChain "distrib-dup-test-chain-implicit"
[junit4] 2> 935806 INFO (coreLoadExecutor-2726-thread-1) [ ] o.a.s.c.SolrCore no updateRequestProcessorChain defined as default, creating implicit default
[junit4] 2> 935806 WARN (coreLoadExecutor-2726-thread-1) [ ] o.a.s.c.RequestHandlers INVALID paramSet a in requestHandler {type = requestHandler,name = /dump,class = DumpRequestHandler,args = {defaults={a=A,b=B}}}
[junit4] 2> 935807 INFO (coreLoadExecutor-2726-thread-1) [ ] o.a.s.h.l.XMLLoader xsltCacheLifetimeSeconds=60
[junit4] 2> 935808 INFO (coreLoadExecutor-2726-thread-1) [ ] o.a.s.h.l.XMLLoader xsltCacheLifetimeSeconds=60
[junit4] 2> 935808 INFO (coreLoadExecutor-2726-thread-1) [ ] o.a.s.h.l.XMLLoader xsltCacheLifetimeSeconds=60
[junit4] 2> 935809 INFO (coreLoadExecutor-2726-thread-1) [ ] o.a.s.h.l.XMLLoader xsltCacheLifetimeSeconds=60
[junit4] 2> 935811 INFO (coreLoadExecutor-2726-thread-1) [ ] o.a.s.c.RequestHandlers Registered paths: /admin/mbeans,standard,/dump,/update/csv,/sql,/update/json/docs,/admin/luke,/export,/admin/segments,/get,/admin/system,/replication,/admin/properties,/config,/stream,/schema,/admin/plugins,/admin/logging,/update/json,/admin/ping,/admin/threads,/update,/admin/file
[junit4] 2> 935812 INFO (coreLoadExecutor-2726-thread-1) [ ] o.a.s.c.SolrCore Using default statsCache cache: org.apache.solr.search.stats.LocalStatsCache
[junit4] 2> 935812 INFO (coreLoadExecutor-2726-thread-1) [ ] o.a.s.u.UpdateHandler Using UpdateLog implementation: org.apache.solr.update.UpdateLog
[junit4] 2> 935812 INFO (coreLoadExecutor-2726-thread-1) [ ] o.a.s.u.UpdateLog Initializing UpdateLog: dataDir= defaultSyncLevel=FLUSH numRecordsToKeep=100 maxNumLogsToKeep=10 numVersionBuckets=65536
[junit4] 2> 935813 INFO (coreLoadExecutor-2726-thread-1) [ ] o.a.s.u.CommitTracker Hard AutoCommit: disabled
[junit4] 2> 935813 INFO (coreLoadExecutor-2726-thread-1) [ ] o.a.s.u.CommitTracker Soft AutoCommit: disabled
[junit4] 2> 935813 INFO (coreLoadExecutor-2726-thread-1) [ ] o.a.s.u.RandomMergePolicy RandomMergePolicy wrapping class org.apache.lucene.index.MockRandomMergePolicy: org.apache.lucene.index.MockRandomMergePolicy@1f8c49f
[junit4] 2> 935814 INFO (coreLoadExecutor-2726-thread-1) [ ] o.a.s.c.SolrDeletionPolicy SolrDeletionPolicy.onInit: commits: num=1
[junit4] 2> commit{dir=MockDirectoryWrapper(RAMDirectory@1ab8274 lockFactory=org.apache.lucene.store.SingleInstanceLockFactory@1e8f125),segFN=segments_1,generation=1}
[junit4] 2> 935814 INFO (coreLoadExecutor-2726-thread-1) [ ] o.a.s.c.SolrDeletionPolicy newest commit generation = 1
[junit4] 2> 935814 INFO (coreLoadExecutor-2726-thread-1) [ ] o.a.s.s.SolrIndexSearcher Opening [Searcher@870b47[collection1] main]
[junit4] 2> 935814 INFO (coreLoadExecutor-2726-thread-1) [ ] o.a.s.c.c.ZkStateReader Load collection config from: [/collections/collection1]
[junit4] 2> 935814 INFO (coreLoadExecutor-2726-thread-1) [ ] o.a.s.c.c.ZkStateReader path=[/collections/collection1] [configName]=[conf1] specified config exists in ZooKeeper
[junit4] 2> 935814 INFO (coreLoadExecutor-2726-thread-1) [ ] o.a.s.r.ManagedResourceStorage Setting up ZooKeeper-based storage for the RestManager with znodeBase: /configs/conf1
[junit4] 2> 935814 INFO (coreLoadExecutor-2726-thread-1) [ ] o.a.s.r.ManagedResourceStorage Configured ZooKeeperStorageIO with znodeBase: /configs/conf1
[junit4] 2> 935814 INFO (coreLoadExecutor-2726-thread-1) [ ] o.a.s.r.RestManager Initializing RestManager with initArgs: {}
[junit4] 2> 935815 INFO (coreLoadExecutor-2726-thread-1) [ ] o.a.s.r.ManagedResourceStorage Reading _rest_managed.json using ZooKeeperStorageIO:path=/configs/conf1
[junit4] 2> 935815 INFO (coreLoadExecutor-2726-thread-1) [ ] o.a.s.r.ManagedResourceStorage No data found for znode /configs/conf1/_rest_managed.json
[junit4] 2> 935815 INFO (coreLoadExecutor-2726-thread-1) [ ] o.a.s.r.ManagedResourceStorage Loaded null at path _rest_managed.json using ZooKeeperStorageIO:path=/configs/conf1
[junit4] 2> 935815 INFO (coreLoadExecutor-2726-thread-1) [ ] o.a.s.r.RestManager Initializing 0 registered ManagedResources
[junit4] 2> 935815 INFO (coreLoadExecutor-2726-thread-1) [ ] o.a.s.h.ReplicationHandler Commits will be reserved for 10000
[junit4] 2> 935815 INFO (searcherExecutor-2727-thread-1) [ ] o.a.s.c.SolrCore [collection1] Registered new searcher Searcher@870b47[collection1] main{ExitableDirectoryReader(UninvertingDirectoryReader())}
[junit4] 2> 935816 INFO (coreLoadExecutor-2726-thread-1) [ ] o.a.s.u.UpdateLog Looking up max value of version field to seed version buckets
[junit4] 2> 935816 INFO (coreLoadExecutor-2726-thread-1) [ ] o.a.s.u.VersionInfo Refreshing highest value of _version_ for 65536 version buckets from index
[junit4] 2> 935816 INFO (coreLoadExecutor-2726-thread-1) [ ] o.a.s.u.VersionInfo No terms found for _version_, cannot seed version bucket highest value from index
[junit4] 2> 935816 INFO (coreLoadExecutor-2726-thread-1) [ ] o.a.s.u.UpdateLog Could not find max version in index or recent updates, using new clock 1528987618945007616
[junit4] 2> 935818 INFO (coreLoadExecutor-2726-thread-1) [ ] o.a.s.u.UpdateLog Took 2.0ms to seed version buckets with highest version 1528987618945007616
[junit4] 2> 935818 INFO (coreLoadExecutor-2726-thread-1) [ ] o.a.s.c.ZkController watch zkdir /configs/conf1
[junit4] 2> 935818 INFO (coreLoadExecutor-2726-thread-1) [ ] o.a.s.c.CoreContainer registering core: collection1
[junit4] 2> 935818 INFO (coreZkRegister-2721-thread-1) [ ] o.a.s.c.ZkController Register replica - core:collection1 address:http://127.0.0.1:35854 collection:collection1 shard:shard2
[junit4] 2> 935819 INFO (coreZkRegister-2721-thread-1) [ ] o.a.s.c.c.SolrZkClient makePath: /collections/collection1/leader_elect/shard2/election
[junit4] 2> 935819 INFO (coreZkRegister-2721-thread-1) [ ] o.a.s.c.LeaderElector Joined leadership election with path: /collections/collection1/leader_elect/shard2/election/95561725928210441-core_node1-n_0000000000
[junit4] 2> 935819 INFO (coreZkRegister-2721-thread-1) [ ] o.a.s.c.ShardLeaderElectionContext Running the leader process for shard=shard2 and weAreReplacement=false and leaderVoteWait=180000
[junit4] 2> 935820 INFO (coreZkRegister-2721-thread-1) [ ] o.a.s.c.ShardLeaderElectionContext Enough replicas found to continue.
[junit4] 2> 935820 INFO (coreZkRegister-2721-thread-1) [ ] o.a.s.c.ShardLeaderElectionContext I may be the new leader - try and sync
[junit4] 2> 935820 INFO (coreZkRegister-2721-thread-1) [ ] o.a.s.c.SyncStrategy Sync replicas to http://127.0.0.1:35854/collection1/
[junit4] 2> 935820 INFO (coreZkRegister-2721-thread-1) [ ] o.a.s.c.SyncStrategy Sync Success - now sync replicas to me
[junit4] 2> 935820 INFO (coreZkRegister-2721-thread-1) [ ] o.a.s.c.SyncStrategy http://127.0.0.1:35854/collection1/ has no replicas
[junit4] 2> 935820 INFO (OverseerStateUpdate-95561725928210436-127.0.0.1:37195_-n_0000000000) [ ] o.a.s.c.Overseer processMessage: queueSize: 1, message = {
[junit4] 2> "operation":"leader",
[junit4] 2> "shard":"shard2",
[junit4] 2> "collection":"collection1"} current state version: 4
[junit4] 2> 935820 INFO (coreZkRegister-2721-thread-1) [ ] o.a.s.c.c.SolrZkClient makePath: /collections/collection1/leaders/shard2
[junit4] 2> 935821 INFO (coreZkRegister-2721-thread-1) [ ] o.a.s.c.ShardLeaderElectionContextBase Creating leader registration node /collections/collection1/leaders/shard2/leader after winning as /collections/collection1/leader_elect/shard2/election/95561725928210441-core_node1-n_0000000000
[junit4] 2> 935822 INFO (coreZkRegister-2721-thread-1) [ ] o.a.s.c.ShardLeaderElectionContext I am the new leader: http://127.0.0.1:35854/collection1/ shard2
[junit4] 2> 935822 INFO (OverseerStateUpdate-95561725928210436-127.0.0.1:37195_-n_0000000000) [ ] o.a.s.c.Overseer processMessage: queueSize: 1, message = {
[junit4] 2> "operation":"leader",
[junit4] 2> "shard":"shard2",
[junit4] 2> "collection":"collection1",
[junit4] 2> "base_url":"http://127.0.0.1:35854",
[junit4] 2> "core":"collection1",
[junit4] 2> "state":"active"} current state version: 4
[junit4] 2> 935923 INFO (OverseerStateUpdate-95561725928210436-127.0.0.1:37195_-n_0000000000) [ ] o.a.s.c.o.ZkStateWriter going to update_collection /collections/collection1/state.json version: 1
[junit4] 2> 935923 INFO (zkCallback-1174-thread-1) [ ] o.a.s.c.c.ZkStateReader A cluster state change: [WatchedEvent state:SyncConnected type:NodeDataChanged path:/collections/collection1/state.json] for collection [collection1] has occurred - updating... (live nodes size: [2])
[junit4] 2> 935923 INFO (zkCallback-1174-thread-1) [ ] o.a.s.c.c.ZkStateReader Updating data for [collection1] from [1] to [2]
[junit4] 2> 935972 INFO (coreZkRegister-2721-thread-1) [ ] o.a.s.c.ZkController We are http://127.0.0.1:35854/collection1/ and leader is http://127.0.0.1:35854/collection1/
[junit4] 2> 935972 INFO (coreZkRegister-2721-thread-1) [ ] o.a.s.c.ZkController No LogReplay needed for core=collection1 baseURL=http://127.0.0.1:35854
[junit4] 2> 935972 INFO (coreZkRegister-2721-thread-1) [ ] o.a.s.c.ZkController I am the leader, no recovery necessary
[junit4] 2> 935972 INFO (coreZkRegister-2721-thread-1) [ ] o.a.s.c.ZkController publishing state=active
[junit4] 2> 935972 INFO (coreZkRegister-2721-thread-1) [ ] o.a.s.c.ZkController numShards not found on descriptor - reading it from system property
[junit4] 2> 935974 INFO (OverseerStateUpdate-95561725928210436-127.0.0.1:37195_-n_0000000000) [ ] o.a.s.c.Overseer processMessage: queueSize: 1, message = {
[junit4] 2> "core":"collection1",
[junit4] 2> "core_node_name":"core_node1",
[junit4] 2> "roles":null,
[junit4] 2> "base_url":"http://127.0.0.1:35854",
[junit4] 2> "node_name":"127.0.0.1:35854_",
[junit4] 2> "numShards":"2",
[junit4] 2> "state":"active",
[junit4] 2> "shard":"shard2",
[junit4] 2> "collection":"collection1",
[junit4] 2> "operation":"state"} current state version: 4
[junit4] 2> 935975 INFO (OverseerStateUpdate-95561725928210436-127.0.0.1:37195_-n_0000000000) [ ] o.a.s.c.o.ReplicaMutator Update state numShards=2 message={
[junit4] 2> "core":"collection1",
[junit4] 2> "core_node_name":"core_node1",
[junit4] 2> "roles":null,
[junit4] 2> "base_url":"http://127.0.0.1:35854",
[junit4] 2> "node_name":"127.0.0.1:35854_",
[junit4] 2> "numShards":"2",
[junit4] 2> "state":"active",
[junit4] 2> "shard":"shard2",
[junit4] 2> "collection":"collection1",
[junit4] 2> "operation":"state"}
[junit4] 2> 936076 INFO (OverseerStateUpdate-95561725928210436-127.0.0.1:37195_-n_0000000000) [ ] o.a.s.c.o.ZkStateWriter going to update_collection /collections/collection1/state.json version: 2
[junit4] 2> 936076 INFO (zkCallback-1174-thread-1) [ ] o.a.s.c.c.ZkStateReader A cluster state change: [WatchedEvent state:SyncConnected type:NodeDataChanged path:/collections/collection1/state.json] for collection [collection1] has occurred - updating... (live nodes size: [2])
[junit4] 2> 936076 INFO (zkCallback-1174-thread-1) [ ] o.a.s.c.c.ZkStateReader Updating data for [collection1] from [2] to [3]
[junit4] 2> 936295 INFO (TEST-UnloadDistributedZkTest.test-seed#[6F42133EBE049F7E]) [ ] o.a.s.SolrTestCaseJ4 Writing core.properties file to /home/jenkins/workspace/Lucene-Solr-6.x-Linux/solr/build/solr-core/test/J1/temp/solr.cloud.UnloadDistributedZkTest_6F42133EBE049F7E-001/shard-2-001/cores/collection1
[junit4] 2> 936296 INFO (TEST-UnloadDistributedZkTest.test-seed#[6F42133EBE049F7E]) [ ] o.a.s.c.AbstractFullDis
[...truncated too long message...]
esponseParser.java:57)
[junit4] > at org.apache.http.impl.io.AbstractMessageParser.parse(AbstractMessageParser.java:261)
[junit4] > at org.apache.http.impl.AbstractHttpClientConnection.receiveResponseHeader(AbstractHttpClientConnection.java:283)
[junit4] > at org.apache.http.impl.conn.DefaultClientConnection.receiveResponseHeader(DefaultClientConnection.java:251)
[junit4] > at org.apache.http.impl.conn.ManagedClientConnectionImpl.receiveResponseHeader(ManagedClientConnectionImpl.java:197)
[junit4] > at org.apache.http.protocol.HttpRequestExecutor.doReceiveResponse(HttpRequestExecutor.java:272)
[junit4] > at org.apache.http.protocol.HttpRequestExecutor.execute(HttpRequestExecutor.java:124)
[junit4] > at org.apache.http.impl.client.DefaultRequestDirector.tryExecute(DefaultRequestDirector.java:685)
[junit4] > at org.apache.http.impl.client.DefaultRequestDirector.execute(DefaultRequestDirector.java:487)
[junit4] > at org.apache.http.impl.client.AbstractHttpClient.doExecute(AbstractHttpClient.java:882)
[junit4] > at org.apache.http.impl.client.CloseableHttpClient.execute(CloseableHttpClient.java:82)
[junit4] > at org.apache.http.impl.client.CloseableHttpClient.execute(CloseableHttpClient.java:107)
[junit4] > at org.apache.http.impl.client.CloseableHttpClient.execute(CloseableHttpClient.java:55)
[junit4] > at org.apache.solr.client.solrj.impl.HttpSolrClient.executeMethod(HttpSolrClient.java:482)
[junit4] > ... 8 moreThrowable #6: com.carrotsearch.randomizedtesting.UncaughtExceptionError: Captured an uncaught exception in thread: Thread[id=7157, name=testExecutor-2794-thread-9, state=RUNNABLE, group=TGRP-UnloadDistributedZkTest]
[junit4] > Caused by: java.lang.RuntimeException: org.apache.solr.client.solrj.SolrServerException: Timeout occured while waiting response from server at: http://127.0.0.1:42578
[junit4] > at __randomizedtesting.SeedInfo.seed([6F42133EBE049F7E]:0)
[junit4] > at org.apache.solr.cloud.BasicDistributedZkTest.lambda$createCores$0(BasicDistributedZkTest.java:583)
[junit4] > at org.apache.solr.common.util.ExecutorUtil$MDCAwareThreadPoolExecutor.lambda$execute$0(ExecutorUtil.java:229)
[junit4] > at java.util.concurrent.ThreadPoolExecutor.runWorker(ThreadPoolExecutor.java:1158)
[junit4] > at java.util.concurrent.ThreadPoolExecutor$Worker.run(ThreadPoolExecutor.java:632)
[junit4] > at java.lang.Thread.run(Thread.java:804)
[junit4] > Caused by: org.apache.solr.client.solrj.SolrServerException: Timeout occured while waiting response from server at: http://127.0.0.1:42578
[junit4] > at org.apache.solr.client.solrj.impl.HttpSolrClient.executeMethod(HttpSolrClient.java:588)
[junit4] > at org.apache.solr.client.solrj.impl.HttpSolrClient.request(HttpSolrClient.java:241)
[junit4] > at org.apache.solr.client.solrj.impl.HttpSolrClient.request(HttpSolrClient.java:230)
[junit4] > at org.apache.solr.client.solrj.SolrClient.request(SolrClient.java:1219)
[junit4] > at org.apache.solr.cloud.BasicDistributedZkTest.lambda$createCores$0(BasicDistributedZkTest.java:581)
[junit4] > ... 4 more
[junit4] > Caused by: java.net.SocketTimeoutException: Read timed out
[junit4] > at java.net.SocketInputStream.socketRead0(Native Method)
[junit4] > at java.net.SocketInputStream.socketRead(SocketInputStream.java:116)
[junit4] > at java.net.SocketInputStream.read(SocketInputStream.java:170)
[junit4] > at java.net.SocketInputStream.read(SocketInputStream.java:141)
[junit4] > at org.apache.http.impl.io.AbstractSessionInputBuffer.fillBuffer(AbstractSessionInputBuffer.java:160)
[junit4] > at org.apache.http.impl.io.SocketInputBuffer.fillBuffer(SocketInputBuffer.java:84)
[junit4] > at org.apache.http.impl.io.AbstractSessionInputBuffer.readLine(AbstractSessionInputBuffer.java:273)
[junit4] > at org.apache.http.impl.conn.DefaultHttpResponseParser.parseHead(DefaultHttpResponseParser.java:140)
[junit4] > at org.apache.http.impl.conn.DefaultHttpResponseParser.parseHead(DefaultHttpResponseParser.java:57)
[junit4] > at org.apache.http.impl.io.AbstractMessageParser.parse(AbstractMessageParser.java:261)
[junit4] > at org.apache.http.impl.AbstractHttpClientConnection.receiveResponseHeader(AbstractHttpClientConnection.java:283)
[junit4] > at org.apache.http.impl.conn.DefaultClientConnection.receiveResponseHeader(DefaultClientConnection.java:251)
[junit4] > at org.apache.http.impl.conn.ManagedClientConnectionImpl.receiveResponseHeader(ManagedClientConnectionImpl.java:197)
[junit4] > at org.apache.http.protocol.HttpRequestExecutor.doReceiveResponse(HttpRequestExecutor.java:272)
[junit4] > at org.apache.http.protocol.HttpRequestExecutor.execute(HttpRequestExecutor.java:124)
[junit4] > at org.apache.http.impl.client.DefaultRequestDirector.tryExecute(DefaultRequestDirector.java:685)
[junit4] > at org.apache.http.impl.client.DefaultRequestDirector.execute(DefaultRequestDirector.java:487)
[junit4] > at org.apache.http.impl.client.AbstractHttpClient.doExecute(AbstractHttpClient.java:882)
[junit4] > at org.apache.http.impl.client.CloseableHttpClient.execute(CloseableHttpClient.java:82)
[junit4] > at org.apache.http.impl.client.CloseableHttpClient.execute(CloseableHttpClient.java:107)
[junit4] > at org.apache.http.impl.client.CloseableHttpClient.execute(CloseableHttpClient.java:55)
[junit4] > at org.apache.solr.client.solrj.impl.HttpSolrClient.executeMethod(HttpSolrClient.java:482)
[junit4] > ... 8 more
[junit4] 2> 1067925 INFO (SUITE-UnloadDistributedZkTest-seed#[6F42133EBE049F7E]-worker) [ ] o.a.s.SolrTestCaseJ4 ###deleteCore
[junit4] 2> Mar 16, 2016 7:25:54 PM com.carrotsearch.randomizedtesting.ThreadLeakControl checkThreadLeaks
[junit4] 2> WARNING: Will linger awaiting termination of 1 leaked thread(s).
[junit4] 2> NOTE: test params are: codec=Asserting(Lucene60), sim=RandomSimilarity(queryNorm=true,coord=crazy): {}, locale=ha-Latn, timezone=Canada/Saskatchewan
[junit4] 2> NOTE: Linux 4.2.0-34-generic i386/Oracle Corporation 9-ea (32-bit)/cpus=12,threads=1,free=359246392,total=492830720
[junit4] 2> NOTE: All tests run in this JVM: [TestRandomRequestDistribution, TestFieldTypeResource, TestQuerySenderListener, TestAuthenticationFramework, TestManagedStopFilterFactory, TestWordDelimiterFilterFactory, TestBM25SimilarityFactory, TestSizeLimitedDistributedMap, TestSolrCoreProperties, DocExpirationUpdateProcessorFactoryTest, DocumentBuilderTest, ShardRoutingTest, TestDocumentBuilder, DistributedVersionInfoTest, AddBlockUpdateTest, FileUtilsTest, CheckHdfsIndexTest, RuleEngineTest, CollectionsAPIAsyncDistributedZkTest, TestCodecSupport, ZkControllerTest, DeleteInactiveReplicaTest, TestMinMaxOnMultiValuedField, ZkCLITest, TestSolr4Spatial2, TestConfigSetsAPIExclusivity, ClusterStateUpdateTest, TestHdfsUpdateLog, TimeZoneUtilsTest, SimplePostToolTest, HdfsRecoveryZkTest, TermsComponentTest, TestFieldCollectionResource, OverriddenZkACLAndCredentialsProvidersTest, TestDefaultSearchFieldResource, HighlighterTest, HdfsBasicDistributedZkTest, TestTrieFacet, JavabinLoaderTest, TestBulkSchemaAPI, OpenExchangeRatesOrgProviderTest, DOMUtilTest, OpenCloseCoreStressTest, TestSQLHandler, BasicFunctionalityTest, SoftAutoCommitTest, TestLeaderElectionZkExpiry, TestDistribDocBasedVersion, TestSolrQueryParserDefaultOperatorResource, TestCustomSort, OverseerStatusTest, TestMiniSolrCloudClusterBase, TestIntervalFaceting, TestManagedResource, TestTrie, TestLFUCache, TestHighFrequencyDictionaryFactory, TestScoreJoinQPScore, SpellingQueryConverterTest, DistributedSuggestComponentTest, DistributedFacetPivotWhiteBoxTest, MinimalSchemaTest, SolrInfoMBeanTest, TestNRTOpen, DistributedFacetPivotLongTailTest, TestConfigSetProperties, TestSystemIdResolver, DocValuesTest, MBeansHandlerTest, DistanceUnitsTest, SortByFunctionTest, UpdateRequestProcessorFactoryTest, TestUpdate, WordBreakSolrSpellCheckerTest, RemoteQueryErrorTest, SpellCheckComponentTest, TestBlendedInfixSuggestions, TestPartialUpdateDeduplication, TestReRankQParserPlugin, TestNonDefinedSimilarityFactory, HdfsWriteToMultipleCollectionsTest, SuggestComponentContextFilterQueryTest, TestSurroundQueryParser, SolrIndexSplitterTest, TestSearcherReuse, TestSolrCLIRunExample, MigrateRouteKeyTest, TestFiltering, TriLevelCompositeIdRoutingTest, TermVectorComponentTest, SolrPluginUtilsTest, SimpleCollectionCreateDeleteTest, UnloadDistributedZkTest]
[junit4] Completed [295/581 (1!)] on J1 in 136.63s, 1 test, 1 error <<< FAILURES!
[...truncated 931 lines...]
BUILD FAILED
/home/jenkins/workspace/Lucene-Solr-6.x-Linux/build.xml:740: The following error occurred while executing this line:
/home/jenkins/workspace/Lucene-Solr-6.x-Linux/build.xml:684: The following error occurred while executing this line:
/home/jenkins/workspace/Lucene-Solr-6.x-Linux/build.xml:59: The following error occurred while executing this line:
/home/jenkins/workspace/Lucene-Solr-6.x-Linux/solr/build.xml:233: The following error occurred while executing this line:
/home/jenkins/workspace/Lucene-Solr-6.x-Linux/solr/common-build.xml:526: The following error occurred while executing this line:
/home/jenkins/workspace/Lucene-Solr-6.x-Linux/lucene/common-build.xml:1457: The following error occurred while executing this line:
/home/jenkins/workspace/Lucene-Solr-6.x-Linux/lucene/common-build.xml:1014: There were test failures: 581 suites (10 ignored), 2324 tests, 1 error, 116 ignored (70 assumptions) [seed: 6F42133EBE049F7E]
Total time: 58 minutes 20 seconds
Build step 'Invoke Ant' marked build as failure
Archiving artifacts
[WARNINGS] Skipping publisher since build result is FAILURE
Recording test results
Email was triggered for: Failure - Any
Sending email for trigger: Failure - Any