You are viewing a plain text version of this content. The canonical link for it is here.
Posted to builds@hbase.apache.org by Apache Jenkins Server <je...@builds.apache.org> on 2015/03/21 01:20:25 UTC

Build failed in Jenkins: HBase-1.1 #308

See <https://builds.apache.org/job/HBase-1.1/308/changes>

Changes:

[matteo.bertozzi] HBASE-13282 Fix the minor issues of running Canary on kerberized environment (Srikanth Srungarapu)

------------------------------------------
[...truncated 1875 lines...]
Tests run: 7, Failures: 0, Errors: 0, Skipped: 0, Time elapsed: 5.811 sec - in org.apache.hadoop.hbase.TestMetaTableLocator
Running org.apache.hadoop.hbase.ipc.TestDelayedRpc
Tests run: 3, Failures: 0, Errors: 0, Skipped: 0, Time elapsed: 33.518 sec - in org.apache.hadoop.hbase.security.access.TestAccessController2
Tests run: 4, Failures: 0, Errors: 0, Skipped: 0, Time elapsed: 3.584 sec - in org.apache.hadoop.hbase.ipc.TestDelayedRpc
Running org.apache.hadoop.hbase.ipc.TestHBaseClient
Tests run: 1, Failures: 0, Errors: 0, Skipped: 0, Time elapsed: 0.419 sec - in org.apache.hadoop.hbase.ipc.TestHBaseClient
Running org.apache.hadoop.hbase.TestFullLogReconstruction
Running org.apache.hadoop.hbase.ipc.TestProtoBufRpc
Tests run: 1, Failures: 0, Errors: 0, Skipped: 0, Time elapsed: 1.763 sec - in org.apache.hadoop.hbase.ipc.TestProtoBufRpc
Running org.apache.hadoop.hbase.TestGlobalMemStoreSize
Tests run: 7, Failures: 0, Errors: 0, Skipped: 0, Time elapsed: 51.99 sec - in org.apache.hadoop.hbase.security.access.TestTablePermissions
Running org.apache.hadoop.hbase.TestJMXListener
Tests run: 1, Failures: 0, Errors: 0, Skipped: 0, Time elapsed: 17.714 sec - in org.apache.hadoop.hbase.TestGlobalMemStoreSize
Running org.apache.hadoop.hbase.constraint.TestConstraint
Tests run: 2, Failures: 0, Errors: 0, Skipped: 0, Time elapsed: 16.614 sec - in org.apache.hadoop.hbase.TestJMXListener
Running org.apache.hadoop.hbase.trace.TestHTraceHooks
Tests run: 5, Failures: 0, Errors: 0, Skipped: 0, Time elapsed: 14.04 sec - in org.apache.hadoop.hbase.constraint.TestConstraint
Running org.apache.hadoop.hbase.io.hfile.TestHFileBlockIndex
Running org.apache.hadoop.hbase.io.hfile.TestHFileSeek
Tests run: 1, Failures: 0, Errors: 0, Skipped: 0, Time elapsed: 3.376 sec - in org.apache.hadoop.hbase.trace.TestHTraceHooks
Tests run: 1, Failures: 0, Errors: 0, Skipped: 0, Time elapsed: 39.021 sec - in org.apache.hadoop.hbase.TestFullLogReconstruction
Tests run: 1, Failures: 0, Errors: 0, Skipped: 0, Time elapsed: 1.772 sec - in org.apache.hadoop.hbase.io.hfile.TestHFileSeek
Running org.apache.hadoop.hbase.io.hfile.TestForceCacheImportantBlocks
Running org.apache.hadoop.hbase.io.hfile.TestCacheConfig
Tests run: 6, Failures: 0, Errors: 0, Skipped: 0, Time elapsed: 1.595 sec - in org.apache.hadoop.hbase.io.hfile.TestCacheConfig
Running org.apache.hadoop.hbase.io.hfile.TestCacheOnWrite
Tests run: 10, Failures: 0, Errors: 0, Skipped: 0, Time elapsed: 9.804 sec - in org.apache.hadoop.hbase.io.hfile.TestHFileBlockIndex
Running org.apache.hadoop.hbase.io.hfile.TestScannerSelectionUsingTTL
Running org.apache.hadoop.hbase.io.hfile.TestHFileBlock
Tests run: 4, Failures: 0, Errors: 0, Skipped: 0, Time elapsed: 42.156 sec - in org.apache.hadoop.hbase.io.hfile.TestForceCacheImportantBlocks
Running org.apache.hadoop.hbase.io.TestFileLink
Tests run: 5, Failures: 0, Errors: 0, Skipped: 0, Time elapsed: 23.463 sec - in org.apache.hadoop.hbase.io.TestFileLink
Running org.apache.hadoop.hbase.io.encoding.TestEncodedSeekers
Tests run: 6, Failures: 0, Errors: 0, Skipped: 0, Time elapsed: 66.549 sec - in org.apache.hadoop.hbase.io.hfile.TestScannerSelectionUsingTTL
Running org.apache.hadoop.hbase.io.encoding.TestChangingEncoding
Tests run: 28, Failures: 0, Errors: 0, Skipped: 0, Time elapsed: 101.84 sec - in org.apache.hadoop.hbase.io.hfile.TestHFileBlock
Running org.apache.hadoop.hbase.io.encoding.TestDataBlockEncoders
Tests run: 20, Failures: 0, Errors: 0, Skipped: 0, Time elapsed: 127.795 sec - in org.apache.hadoop.hbase.io.encoding.TestEncodedSeekers
Running org.apache.hadoop.hbase.io.encoding.TestBufferedDataBlockEncoder
Tests run: 1, Failures: 0, Errors: 0, Skipped: 0, Time elapsed: 14.952 sec - in org.apache.hadoop.hbase.io.encoding.TestBufferedDataBlockEncoder
Running org.apache.hadoop.hbase.io.encoding.TestLoadAndSwitchEncodeOnDisk
Tests run: 1, Failures: 0, Errors: 0, Skipped: 0, Time elapsed: 28.984 sec - in org.apache.hadoop.hbase.io.encoding.TestLoadAndSwitchEncodeOnDisk
Running org.apache.hadoop.hbase.TestRegionRebalancing
Tests run: 3, Failures: 0, Errors: 0, Skipped: 0, Time elapsed: 181.814 sec - in org.apache.hadoop.hbase.io.encoding.TestChangingEncoding
Running org.apache.hadoop.hbase.TestHColumnDescriptorDefaultVersions
Tests run: 28, Failures: 0, Errors: 0, Skipped: 0, Time elapsed: 178.32 sec - in org.apache.hadoop.hbase.io.encoding.TestDataBlockEncoders
Tests run: 3, Failures: 0, Errors: 0, Skipped: 0, Time elapsed: 30.015 sec - in org.apache.hadoop.hbase.TestHColumnDescriptorDefaultVersions
Tests run: 2, Failures: 0, Errors: 0, Skipped: 0, Time elapsed: 67.524 sec - in org.apache.hadoop.hbase.TestRegionRebalancing
Running org.apache.hadoop.hbase.mapred.TestTableMapReduceUtil
Running org.apache.hadoop.hbase.mapred.TestTableInputFormat
Running org.apache.hadoop.hbase.mapred.TestTableMapReduce
Tests run: 55, Failures: 0, Errors: 0, Skipped: 0, Time elapsed: 479.57 sec - in org.apache.hadoop.hbase.security.access.TestAccessController
Running org.apache.hadoop.hbase.mapred.TestTableSnapshotInputFormat
Tests run: 4, Failures: 0, Errors: 0, Skipped: 0, Time elapsed: 107.324 sec - in org.apache.hadoop.hbase.mapred.TestTableMapReduceUtil
Running org.apache.hadoop.hbase.replication.TestReplicationTrackerZKImpl
Tests run: 5, Failures: 0, Errors: 0, Skipped: 0, Time elapsed: 1.358 sec - in org.apache.hadoop.hbase.replication.TestReplicationTrackerZKImpl
Tests run: 8, Failures: 0, Errors: 0, Skipped: 0, Time elapsed: 98.853 sec - in org.apache.hadoop.hbase.mapred.TestTableInputFormat
Tests run: 216, Failures: 0, Errors: 0, Skipped: 0, Time elapsed: 451.018 sec - in org.apache.hadoop.hbase.io.hfile.TestCacheOnWrite
Tests run: 2, Failures: 0, Errors: 0, Skipped: 0, Time elapsed: 108.85 sec - in org.apache.hadoop.hbase.mapred.TestTableMapReduce
Running org.apache.hadoop.hbase.replication.TestReplicationEndpoint
Tests run: 3, Failures: 0, Errors: 0, Skipped: 0, Time elapsed: 9.633 sec - in org.apache.hadoop.hbase.replication.TestReplicationEndpoint
Running org.apache.hadoop.hbase.replication.TestReplicationDisableInactivePeer
Running org.apache.hadoop.hbase.replication.TestReplicationKillMasterRSCompressed
Running org.apache.hadoop.hbase.replication.regionserver.TestReplicationSink
Tests run: 5, Failures: 0, Errors: 0, Skipped: 0, Time elapsed: 3.323 sec - in org.apache.hadoop.hbase.replication.regionserver.TestReplicationSink
Running org.apache.hadoop.hbase.replication.regionserver.TestReplicationSourceManager
Running org.apache.hadoop.hbase.replication.TestPerTableCFReplication
Tests run: 4, Failures: 0, Errors: 0, Skipped: 0, Time elapsed: 6.295 sec - in org.apache.hadoop.hbase.replication.regionserver.TestReplicationSourceManager
Tests run: 1, Failures: 0, Errors: 0, Skipped: 0, Time elapsed: 24.943 sec - in org.apache.hadoop.hbase.replication.TestReplicationDisableInactivePeer
Running org.apache.hadoop.hbase.replication.regionserver.TestReplicationWALReaderManager
Running org.apache.hadoop.hbase.replication.regionserver.TestRegionReplicaReplicationEndpoint
Tests run: 1, Failures: 0, Errors: 0, Skipped: 0, Time elapsed: 31.756 sec - in org.apache.hadoop.hbase.replication.TestReplicationKillMasterRSCompressed
Running org.apache.hadoop.hbase.replication.regionserver.TestRegionReplicaReplicationEndpointNoMaster
Tests run: 2, Failures: 0, Errors: 0, Skipped: 0, Time elapsed: 38.894 sec - in org.apache.hadoop.hbase.replication.TestPerTableCFReplication
Running org.apache.hadoop.hbase.replication.TestReplicationSource
Tests run: 1, Failures: 0, Errors: 0, Skipped: 0, Time elapsed: 0.776 sec - in org.apache.hadoop.hbase.replication.TestReplicationSource
Running org.apache.hadoop.hbase.replication.TestReplicationChangingPeerRegionservers
Tests run: 4, Failures: 0, Errors: 0, Skipped: 0, Time elapsed: 54.698 sec - in org.apache.hadoop.hbase.replication.regionserver.TestRegionReplicaReplicationEndpointNoMaster
Tests run: 1, Failures: 0, Errors: 0, Skipped: 0, Time elapsed: 12.637 sec - in org.apache.hadoop.hbase.replication.TestReplicationChangingPeerRegionservers
Tests run: 9, Failures: 0, Errors: 0, Skipped: 0, Time elapsed: 92.045 sec - in org.apache.hadoop.hbase.replication.regionserver.TestRegionReplicaReplicationEndpoint
Running org.apache.hadoop.hbase.replication.TestMultiSlaveReplication
Running org.apache.hadoop.hbase.replication.TestReplicationSyncUpTool
Running org.apache.hadoop.hbase.replication.TestReplicationKillMasterRS
Tests run: 1, Failures: 0, Errors: 0, Skipped: 0, Time elapsed: 43.802 sec - in org.apache.hadoop.hbase.replication.TestMultiSlaveReplication
Tests run: 1, Failures: 0, Errors: 0, Skipped: 0, Time elapsed: 54.419 sec - in org.apache.hadoop.hbase.replication.TestReplicationKillMasterRS
Tests run: 1, Failures: 0, Errors: 0, Skipped: 0, Time elapsed: 75.012 sec - in org.apache.hadoop.hbase.replication.TestReplicationSyncUpTool
Running org.apache.hadoop.hbase.replication.TestReplicationStateZKImpl
Running org.apache.hadoop.hbase.replication.TestReplicationWithTags
Tests run: 6, Failures: 0, Errors: 0, Skipped: 0, Time elapsed: 3.541 sec - in org.apache.hadoop.hbase.replication.TestReplicationStateZKImpl
Tests run: 1, Failures: 0, Errors: 0, Skipped: 0, Time elapsed: 7.34 sec - in org.apache.hadoop.hbase.replication.TestReplicationWithTags
Running org.apache.hadoop.hbase.replication.TestMasterReplication
Running org.apache.hadoop.hbase.replication.TestReplicationKillSlaveRS
Running org.apache.hadoop.hbase.replication.TestReplicationSmallTests
Tests run: 1, Failures: 0, Errors: 0, Skipped: 0, Time elapsed: 24.674 sec - in org.apache.hadoop.hbase.replication.TestReplicationKillSlaveRS
Running org.apache.hadoop.hbase.util.TestMergeTool
Tests run: 8, Failures: 0, Errors: 0, Skipped: 0, Time elapsed: 262.183 sec - in org.apache.hadoop.hbase.replication.regionserver.TestReplicationWALReaderManager
Running org.apache.hadoop.hbase.util.TestFSTableDescriptors
Tests run: 15, Failures: 0, Errors: 0, Skipped: 0, Time elapsed: 2.701 sec - in org.apache.hadoop.hbase.util.TestFSTableDescriptors
Running org.apache.hadoop.hbase.util.TestHBaseFsckEncryption
Tests run: 6, Failures: 0, Errors: 0, Skipped: 0, Time elapsed: 392.179 sec - in org.apache.hadoop.hbase.mapred.TestTableSnapshotInputFormat
Tests run: 1, Failures: 0, Errors: 0, Skipped: 0, Time elapsed: 29.201 sec - in org.apache.hadoop.hbase.util.TestMergeTool
Running org.apache.hadoop.hbase.util.TestIdLock
Running org.apache.hadoop.hbase.util.TestMiniClusterLoadSequential
Tests run: 10, Failures: 0, Errors: 0, Skipped: 0, Time elapsed: 59.266 sec - in org.apache.hadoop.hbase.replication.TestReplicationSmallTests
Tests run: 1, Failures: 0, Errors: 0, Skipped: 0, Time elapsed: 16.567 sec - in org.apache.hadoop.hbase.util.TestHBaseFsckEncryption
Tests run: 1, Failures: 0, Errors: 0, Skipped: 0, Time elapsed: 15.535 sec - in org.apache.hadoop.hbase.util.TestIdLock
Running org.apache.hadoop.hbase.util.TestMergeTable
Running org.apache.hadoop.hbase.util.TestMiniClusterLoadParallel
Running org.apache.hadoop.hbase.util.TestHBaseFsck
Tests run: 3, Failures: 0, Errors: 0, Skipped: 0, Time elapsed: 110.578 sec - in org.apache.hadoop.hbase.replication.TestMasterReplication
Running org.apache.hadoop.hbase.util.TestFSUtils
Tests run: 1, Failures: 0, Errors: 0, Skipped: 0, Time elapsed: 38.886 sec - in org.apache.hadoop.hbase.util.TestMergeTable
Tests run: 7, Failures: 0, Errors: 0, Skipped: 0, Time elapsed: 23.795 sec - in org.apache.hadoop.hbase.util.TestFSUtils
Running org.apache.hadoop.hbase.util.TestProcessBasedCluster
Tests run: 1, Failures: 0, Errors: 0, Skipped: 0, Time elapsed: 0.115 sec - in org.apache.hadoop.hbase.util.TestProcessBasedCluster
Running org.apache.hadoop.hbase.util.TestTableName
Tests run: 6, Failures: 0, Errors: 0, Skipped: 0, Time elapsed: 2.164 sec - in org.apache.hadoop.hbase.util.TestTableName
Running org.apache.hadoop.hbase.util.TestMiniClusterLoadEncoded
Running org.apache.hadoop.hbase.util.TestRegionSplitter
Tests run: 4, Failures: 0, Errors: 0, Skipped: 0, Time elapsed: 85.271 sec - in org.apache.hadoop.hbase.util.TestMiniClusterLoadSequential
Tests run: 4, Failures: 0, Errors: 0, Skipped: 0, Time elapsed: 76.788 sec - in org.apache.hadoop.hbase.util.TestMiniClusterLoadParallel
Running org.apache.hadoop.hbase.util.TestFSVisitor
Tests run: 6, Failures: 0, Errors: 0, Skipped: 0, Time elapsed: 25.577 sec - in org.apache.hadoop.hbase.util.TestRegionSplitter
Tests run: 3, Failures: 0, Errors: 0, Skipped: 0, Time elapsed: 5.414 sec - in org.apache.hadoop.hbase.util.TestFSVisitor
Running org.apache.hadoop.hbase.util.hbck.TestOfflineMetaRebuildBase
Running org.apache.hadoop.hbase.util.hbck.TestOfflineMetaRebuildOverlap
Running org.apache.hadoop.hbase.util.TestCoprocessorScanPolicy
Tests run: 4, Failures: 0, Errors: 0, Skipped: 0, Time elapsed: 9.223 sec - in org.apache.hadoop.hbase.util.TestCoprocessorScanPolicy
Running org.apache.hadoop.hbase.util.hbck.TestOfflineMetaRebuildHole
Tests run: 1, Failures: 0, Errors: 0, Skipped: 0, Time elapsed: 36.882 sec - in org.apache.hadoop.hbase.util.hbck.TestOfflineMetaRebuildOverlap
Running org.apache.hadoop.hbase.util.TestDefaultEnvironmentEdge
Tests run: 1, Failures: 0, Errors: 0, Skipped: 0, Time elapsed: 0.35 sec - in org.apache.hadoop.hbase.util.TestDefaultEnvironmentEdge
Tests run: 1, Failures: 0, Errors: 0, Skipped: 0, Time elapsed: 38.483 sec - in org.apache.hadoop.hbase.util.hbck.TestOfflineMetaRebuildBase
Running org.apache.hadoop.hbase.util.TestFSHDFSUtils
Tests run: 3, Failures: 0, Errors: 0, Skipped: 0, Time elapsed: 5.332 sec - in org.apache.hadoop.hbase.util.TestFSHDFSUtils
Running org.apache.hadoop.hbase.TestMetaTableAccessorNoCluster
Tests run: 1, Failures: 0, Errors: 0, Skipped: 0, Time elapsed: 32.78 sec - in org.apache.hadoop.hbase.util.hbck.TestOfflineMetaRebuildHole
Tests run: 5, Failures: 0, Errors: 0, Skipped: 0, Time elapsed: 82.813 sec - in org.apache.hadoop.hbase.util.TestMiniClusterLoadEncoded
Tests run: 2, Failures: 0, Errors: 0, Skipped: 0, Time elapsed: 3.696 sec - in org.apache.hadoop.hbase.TestMetaTableAccessorNoCluster
Running org.apache.hadoop.hbase.migration.TestUpgradeTo96
Running org.apache.hadoop.hbase.TestNamespace
Tests run: 5, Failures: 0, Errors: 0, Skipped: 0, Time elapsed: 3.703 sec - in org.apache.hadoop.hbase.migration.TestUpgradeTo96
Running org.apache.hadoop.hbase.TestInfoServers
Tests run: 3, Failures: 0, Errors: 0, Skipped: 0, Time elapsed: 7.045 sec - in org.apache.hadoop.hbase.TestInfoServers
Running org.apache.hadoop.hbase.migration.TestNamespaceUpgrade
Tests run: 9, Failures: 0, Errors: 0, Skipped: 1, Time elapsed: 27.62 sec - in org.apache.hadoop.hbase.TestNamespace
Running org.apache.hadoop.hbase.TestMetaTableAccessor
Tests run: 11, Failures: 0, Errors: 0, Skipped: 0, Time elapsed: 17.405 sec - in org.apache.hadoop.hbase.TestMetaTableAccessor
Tests run: 5, Failures: 0, Errors: 0, Skipped: 0, Time elapsed: 31.594 sec - in org.apache.hadoop.hbase.migration.TestNamespaceUpgrade
Tests run: 51, Failures: 0, Errors: 0, Skipped: 1, Time elapsed: 447.506 sec - in org.apache.hadoop.hbase.util.TestHBaseFsck

Results :

Failed tests: 
  TestRegionObserverInterface.testLegacyRecovery:685->verifyMethodResult:751 Result of org.apache.hadoop.hbase.coprocessor.SimpleRegionObserver$Legacy.getCtPreWALRestore is expected to be 1, while we get 0

Tests in error: 
  TestImportTSVWithVisibilityLabels.provisionCluster:120 ? IO Shutting down
  TestTimeRangeMapRed.beforeClass:86 ? IO Shutting down
  TestFSHLog.testFindMemStoresEligibleForFlush ? IO Failed to replace a bad data...


Tests run: 2344, Failures: 1, Errors: 3, Skipped: 17

[INFO] ------------------------------------------------------------------------
[INFO] Reactor Summary:
[INFO] 
[INFO] HBase ............................................. SUCCESS [3.392s]
[INFO] HBase - Checkstyle ................................ SUCCESS [1.913s]
[INFO] HBase - Annotations ............................... SUCCESS [3.228s]
[INFO] HBase - Common .................................... SUCCESS [1:19.786s]
[INFO] HBase - Protocol .................................. SUCCESS [8.168s]
[INFO] HBase - Client .................................... SUCCESS [1:17.866s]
[INFO] HBase - Hadoop Compatibility ...................... SUCCESS [7.078s]
[INFO] HBase - Hadoop Two Compatibility .................. SUCCESS [6.128s]
[INFO] HBase - Prefix Tree ............................... SUCCESS [8.026s]
[INFO] HBase - Server .................................... FAILURE [2:41:56.333s]
[INFO] HBase - Testing Util .............................. SKIPPED
[INFO] HBase - Thrift .................................... SKIPPED
[INFO] HBase - Rest ...................................... SKIPPED
[INFO] HBase - Shell ..................................... SKIPPED
[INFO] HBase - Integration Tests ......................... SKIPPED
[INFO] HBase - Examples .................................. SKIPPED
[INFO] HBase - Assembly .................................. SKIPPED
[INFO] ------------------------------------------------------------------------
[INFO] BUILD FAILURE
[INFO] ------------------------------------------------------------------------
[INFO] Total time: 2:45:14.445s
[INFO] Finished at: Sat Mar 21 00:16:57 UTC 2015
[INFO] Final Memory: 57M/1413M
[INFO] ------------------------------------------------------------------------
[ERROR] Failed to execute goal org.apache.maven.plugins:maven-surefire-plugin:2.18:test (secondPartTestsExecution) on project hbase-server: ExecutionException: java.lang.RuntimeException: The forked VM terminated without properly saying goodbye. VM crash or System.exit called?
[ERROR] Command was /bin/sh -c cd /x1/jenkins/jenkins-slave/workspace/HBase-1.1/hbase-server && /x1/jenkins/jenkins-slave/tools/hudson.model.JDK/jdk-1.7u51/jre/bin/java -enableassertions -XX:MaxDirectMemorySize=1G -Xmx2800m -XX:MaxPermSize=256m -Djava.security.egd=file:/dev/./urandom -Djava.net.preferIPv4Stack=true -Djava.awt.headless=true -jar /x1/jenkins/jenkins-slave/workspace/HBase-1.1/hbase-server/target/surefire/surefirebooter3703732709599682125.jar /x1/jenkins/jenkins-slave/workspace/HBase-1.1/hbase-server/target/surefire/surefire123181286240760693tmp /x1/jenkins/jenkins-slave/workspace/HBase-1.1/hbase-server/target/surefire/surefire_8796239417109462989902tmp
[ERROR] -> [Help 1]
[ERROR] 
[ERROR] To see the full stack trace of the errors, re-run Maven with the -e switch.
[ERROR] Re-run Maven using the -X switch to enable full debug logging.
[ERROR] 
[ERROR] For more information about the errors and possible solutions, please read the following articles:
[ERROR] [Help 1] http://cwiki.apache.org/confluence/display/MAVEN/MojoFailureException
[ERROR] 
[ERROR] After correcting the problems, you can resume the build with the command
[ERROR]   mvn <goals> -rf :hbase-server
Build step 'Invoke top-level Maven targets' marked build as failure
Performing Post build task...
Match found for :.* : True
Logical operation result is TRUE
Running script  :   ZOMBIE_TESTS_COUNT=`jps | grep surefirebooter | wc -l`
  if [[ $ZOMBIE_TESTS_COUNT != 0 ]] ; then
    #It seems sometimes the tests are not dying immediately. Let's give them 10s
    echo "Suspicious java process found - waiting 10s to see if there are just slow to stop"
    sleep 10   
    ZOMBIE_TESTS_COUNT=`jps | grep surefirebooter | wc -l`
    if [[ $ZOMBIE_TESTS_COUNT != 0 ]] ; then
      echo "There are $ZOMBIE_TESTS_COUNT zombie tests, they should have been killed by surefire but survived"
      echo "************ BEGIN zombies jstack extract"
      ZB_STACK=`jps | grep surefirebooter | cut -d ' ' -f 1 | xargs -n 1 jstack | grep ".test" | grep "\.java"`
      jps | grep surefirebooter | cut -d ' ' -f 1 | xargs -n 1 jstack
      echo "************ END  zombies jstack extract"
      JIRA_COMMENT="$JIRA_COMMENT

     {color:red}-1 core zombie tests{color}.  There are ${ZOMBIE_TESTS_COUNT} zombie test(s): ${ZB_STACK}"
      BAD=1
      jps | grep surefirebooter | cut -d ' ' -f 1 | xargs kill -9
    else
      echo "We're ok: there is no zombie test, but some tests took some time to stop"
    fi
  else
    echo "We're ok: there is no zombie test"
  fi
[HBase-1.1] $ /bin/bash -xe /tmp/hudson1952867566277154455.sh
++ jps
++ grep surefirebooter
++ wc -l
+ ZOMBIE_TESTS_COUNT=0
+ [[ 0 != 0 ]]
+ echo 'We'\''re ok: there is no zombie test'
We're ok: there is no zombie test
POST BUILD TASK : SUCCESS
END OF POST BUILD TASK : 0
Archiving artifacts
Sending artifact delta relative to HBase-1.1 #305
Archived 1873 artifacts
Archive block size is 32768
Received 27 blocks and 464164397 bytes
Compression is 0.2%
Took 2 min 55 sec
Recording test results
Updating HBASE-13282

Jenkins build is back to normal : HBase-1.1 #311

Posted by Apache Jenkins Server <je...@builds.apache.org>.
See <https://builds.apache.org/job/HBase-1.1/311/>


Build failed in Jenkins: HBase-1.1 #310

Posted by Apache Jenkins Server <je...@builds.apache.org>.
See <https://builds.apache.org/job/HBase-1.1/310/changes>

Changes:

[zhangduo] HBASE-13308 Fix flaky TestEndToEndSplitTransaction

------------------------------------------
[...truncated 1850 lines...]
Running org.apache.hadoop.hbase.client.replication.TestReplicationAdmin
Tests run: 5, Failures: 0, Errors: 0, Skipped: 0, Time elapsed: 0.51 sec - in org.apache.hadoop.hbase.client.replication.TestReplicationAdmin
Tests run: 8, Failures: 0, Errors: 0, Skipped: 0, Time elapsed: 14.207 sec - in org.apache.hadoop.hbase.client.replication.TestReplicationAdminWithClusters
Running org.apache.hadoop.hbase.client.TestFromClientSideNoCodec
Tests run: 2, Failures: 0, Errors: 0, Skipped: 0, Time elapsed: 2.413 sec - in org.apache.hadoop.hbase.client.TestFromClientSideNoCodec
Running org.apache.hadoop.hbase.client.TestRpcControllerFactory
Tests run: 1, Failures: 0, Errors: 0, Skipped: 0, Time elapsed: 2.091 sec - in org.apache.hadoop.hbase.client.TestRpcControllerFactory
Running org.apache.hadoop.hbase.client.TestHTableMultiplexer
Tests run: 1, Failures: 0, Errors: 0, Skipped: 0, Time elapsed: 8.126 sec - in org.apache.hadoop.hbase.client.TestHTableMultiplexer
Running org.apache.hadoop.hbase.client.TestClientPushback
Tests run: 1, Failures: 0, Errors: 0, Skipped: 0, Time elapsed: 1.738 sec - in org.apache.hadoop.hbase.client.TestClientPushback
Tests run: 5, Failures: 0, Errors: 0, Skipped: 0, Time elapsed: 95.816 sec - in org.apache.hadoop.hbase.client.TestRestoreSnapshotFromClient
Running org.apache.hadoop.hbase.client.TestTableSnapshotScanner
Running org.apache.hadoop.hbase.client.TestHTablePool$TestHTableThreadLocalPool
Running org.apache.hadoop.hbase.client.TestRestoreSnapshotFromClientWithRegionReplicas
Tests run: 9, Failures: 0, Errors: 0, Skipped: 0, Time elapsed: 3.284 sec - in org.apache.hadoop.hbase.client.TestHTablePool$TestHTableThreadLocalPool
Running org.apache.hadoop.hbase.client.TestClientScannerRPCTimeout
Tests run: 14, Failures: 0, Errors: 0, Skipped: 0, Time elapsed: 112.849 sec - in org.apache.hadoop.hbase.client.TestReplicasClient
Tests run: 1, Failures: 0, Errors: 0, Skipped: 0, Time elapsed: 7.876 sec - in org.apache.hadoop.hbase.client.TestClientScannerRPCTimeout
Running org.apache.hadoop.hbase.client.TestAdmin2
Running org.apache.hadoop.hbase.client.TestHTableUtil
Tests run: 2, Failures: 0, Errors: 0, Skipped: 0, Time elapsed: 3.358 sec - in org.apache.hadoop.hbase.client.TestHTableUtil
Tests run: 3, Failures: 0, Errors: 0, Skipped: 0, Time elapsed: 56.815 sec - in org.apache.hadoop.hbase.client.TestTableSnapshotScanner
Running org.apache.hadoop.hbase.client.TestUpdateConfiguration
Tests run: 2, Failures: 0, Errors: 0, Skipped: 0, Time elapsed: 0.485 sec - in org.apache.hadoop.hbase.client.TestUpdateConfiguration
Running org.apache.hadoop.hbase.client.TestScannersFromClientSide
Tests run: 5, Failures: 0, Errors: 0, Skipped: 0, Time elapsed: 6.738 sec - in org.apache.hadoop.hbase.client.TestScannersFromClientSide
Running org.apache.hadoop.hbase.client.TestFromClientSide
Tests run: 21, Failures: 0, Errors: 0, Skipped: 3, Time elapsed: 155.767 sec - in org.apache.hadoop.hbase.client.TestHCM
Running org.apache.hadoop.hbase.client.TestSnapshotFromClientWithRegionReplicas
Tests run: 23, Failures: 0, Errors: 0, Skipped: 0, Time elapsed: 65.707 sec - in org.apache.hadoop.hbase.client.TestAdmin2
Running org.apache.hadoop.hbase.client.TestCheckAndMutate
Tests run: 1, Failures: 0, Errors: 0, Skipped: 0, Time elapsed: 2.595 sec - in org.apache.hadoop.hbase.client.TestCheckAndMutate
Tests run: 5, Failures: 0, Errors: 0, Skipped: 0, Time elapsed: 14.845 sec - in org.apache.hadoop.hbase.client.TestSnapshotFromClientWithRegionReplicas
Running org.apache.hadoop.hbase.client.TestResultSizeEstimation
Tests run: 2, Failures: 0, Errors: 0, Skipped: 0, Time elapsed: 3.105 sec - in org.apache.hadoop.hbase.client.TestResultSizeEstimation
Running org.apache.hadoop.hbase.client.TestSnapshotMetadata
Running org.apache.hadoop.hbase.client.TestClientOperationInterrupt
Tests run: 5, Failures: 0, Errors: 0, Skipped: 0, Time elapsed: 121.037 sec - in org.apache.hadoop.hbase.client.TestRestoreSnapshotFromClientWithRegionReplicas
Running org.apache.hadoop.hbase.client.TestFromClientSideWithCoprocessor
Running org.apache.hadoop.hbase.TestDrainingServer
Tests run: 2, Failures: 0, Errors: 0, Skipped: 0, Time elapsed: 2.279 sec - in org.apache.hadoop.hbase.TestDrainingServer
Tests run: 4, Failures: 0, Errors: 0, Skipped: 0, Time elapsed: 16.568 sec - in org.apache.hadoop.hbase.client.TestSnapshotMetadata
Running org.apache.hadoop.hbase.util.hbck.TestOfflineMetaRebuildBase
Running org.apache.hadoop.hbase.TestMetaTableAccessor
Tests run: 11, Failures: 0, Errors: 0, Skipped: 0, Time elapsed: 10.556 sec - in org.apache.hadoop.hbase.TestMetaTableAccessor
Running org.apache.hadoop.hbase.util.hbck.TestOfflineMetaRebuildOverlap
Tests run: 1, Failures: 0, Errors: 0, Skipped: 0, Time elapsed: 24.74 sec - in org.apache.hadoop.hbase.util.hbck.TestOfflineMetaRebuildBase
Running org.apache.hadoop.hbase.util.hbck.TestOfflineMetaRebuildHole
Tests run: 1, Failures: 0, Errors: 0, Skipped: 0, Time elapsed: 21.89 sec - in org.apache.hadoop.hbase.util.hbck.TestOfflineMetaRebuildOverlap
Running org.apache.hadoop.hbase.util.TestTableName
Tests run: 1, Failures: 0, Errors: 0, Skipped: 0, Time elapsed: 54.221 sec - in org.apache.hadoop.hbase.client.TestClientOperationInterrupt
Tests run: 6, Failures: 0, Errors: 0, Skipped: 0, Time elapsed: 0.73 sec - in org.apache.hadoop.hbase.util.TestTableName
Running org.apache.hadoop.hbase.util.TestMiniClusterLoadEncoded
Tests run: 81, Failures: 0, Errors: 0, Skipped: 4, Time elapsed: 102.319 sec - in org.apache.hadoop.hbase.client.TestFromClientSide
Running org.apache.hadoop.hbase.util.TestMiniClusterLoadSequential
Running org.apache.hadoop.hbase.util.TestCoprocessorScanPolicy
Tests run: 1, Failures: 0, Errors: 0, Skipped: 0, Time elapsed: 22.855 sec - in org.apache.hadoop.hbase.util.hbck.TestOfflineMetaRebuildHole
Running org.apache.hadoop.hbase.util.TestIdLock
Tests run: 4, Failures: 0, Errors: 0, Skipped: 0, Time elapsed: 5.405 sec - in org.apache.hadoop.hbase.util.TestCoprocessorScanPolicy
Running org.apache.hadoop.hbase.util.TestMergeTable
Tests run: 1, Failures: 0, Errors: 0, Skipped: 0, Time elapsed: 15.506 sec - in org.apache.hadoop.hbase.util.TestIdLock
Running org.apache.hadoop.hbase.util.TestHBaseFsckEncryption
Tests run: 1, Failures: 0, Errors: 0, Skipped: 0, Time elapsed: 24.243 sec - in org.apache.hadoop.hbase.util.TestMergeTable
Running org.apache.hadoop.hbase.util.TestMiniClusterLoadParallel
Tests run: 1, Failures: 0, Errors: 0, Skipped: 0, Time elapsed: 13.788 sec - in org.apache.hadoop.hbase.util.TestHBaseFsckEncryption
Tests run: 5, Failures: 0, Errors: 0, Skipped: 0, Time elapsed: 47.749 sec - in org.apache.hadoop.hbase.util.TestMiniClusterLoadEncoded
Running org.apache.hadoop.hbase.util.TestProcessBasedCluster
Tests run: 1, Failures: 0, Errors: 0, Skipped: 0, Time elapsed: 0.125 sec - in org.apache.hadoop.hbase.util.TestProcessBasedCluster
Tests run: 81, Failures: 0, Errors: 0, Skipped: 4, Time elapsed: 99.806 sec - in org.apache.hadoop.hbase.client.TestFromClientSideWithCoprocessor
Running org.apache.hadoop.hbase.util.TestMergeTool
Running org.apache.hadoop.hbase.util.TestFSTableDescriptors
Tests run: 4, Failures: 0, Errors: 0, Skipped: 0, Time elapsed: 46.562 sec - in org.apache.hadoop.hbase.util.TestMiniClusterLoadSequential
Running org.apache.hadoop.hbase.util.TestHBaseFsck
Running org.apache.hadoop.hbase.util.TestFSHDFSUtils
Tests run: 15, Failures: 0, Errors: 0, Skipped: 0, Time elapsed: 4.763 sec - in org.apache.hadoop.hbase.util.TestFSTableDescriptors
Running org.apache.hadoop.hbase.util.TestFSVisitor
Tests run: 3, Failures: 0, Errors: 0, Skipped: 0, Time elapsed: 5.421 sec - in org.apache.hadoop.hbase.util.TestFSHDFSUtils
Running org.apache.hadoop.hbase.util.TestFSUtils
Tests run: 3, Failures: 0, Errors: 0, Skipped: 0, Time elapsed: 3.779 sec - in org.apache.hadoop.hbase.util.TestFSVisitor
Running org.apache.hadoop.hbase.util.TestDefaultEnvironmentEdge
Tests run: 1, Failures: 0, Errors: 0, Skipped: 0, Time elapsed: 0.567 sec - in org.apache.hadoop.hbase.util.TestDefaultEnvironmentEdge
Tests run: 1, Failures: 0, Errors: 0, Skipped: 0, Time elapsed: 24.007 sec - in org.apache.hadoop.hbase.util.TestMergeTool
Running org.apache.hadoop.hbase.util.TestRegionSplitter
Tests run: 7, Failures: 0, Errors: 0, Skipped: 0, Time elapsed: 13.042 sec - in org.apache.hadoop.hbase.util.TestFSUtils
Running org.apache.hadoop.hbase.wal.TestWALFiltering
Tests run: 6, Failures: 0, Errors: 0, Skipped: 0, Time elapsed: 6.649 sec - in org.apache.hadoop.hbase.util.TestRegionSplitter
Running org.apache.hadoop.hbase.wal.TestDefaultWALProviderWithHLogKey
Running org.apache.hadoop.hbase.wal.TestWALReaderOnSecureWAL
Tests run: 4, Failures: 0, Errors: 0, Skipped: 0, Time elapsed: 44.915 sec - in org.apache.hadoop.hbase.util.TestMiniClusterLoadParallel
Tests run: 2, Failures: 0, Errors: 0, Skipped: 0, Time elapsed: 2.322 sec - in org.apache.hadoop.hbase.wal.TestWALReaderOnSecureWAL
Running org.apache.hadoop.hbase.wal.TestSecureWAL
Tests run: 1, Failures: 0, Errors: 0, Skipped: 0, Time elapsed: 1.545 sec - in org.apache.hadoop.hbase.wal.TestSecureWAL
Tests run: 5, Failures: 0, Errors: 0, Skipped: 0, Time elapsed: 7.604 sec - in org.apache.hadoop.hbase.wal.TestDefaultWALProviderWithHLogKey
Running org.apache.hadoop.hbase.wal.TestWALSplitCompressed
Running org.apache.hadoop.hbase.wal.TestDefaultWALProvider
Running org.apache.hadoop.hbase.wal.TestWALSplit
Tests run: 5, Failures: 0, Errors: 0, Skipped: 0, Time elapsed: 6.504 sec - in org.apache.hadoop.hbase.wal.TestDefaultWALProvider
Tests run: 1, Failures: 0, Errors: 0, Skipped: 0, Time elapsed: 25.547 sec - in org.apache.hadoop.hbase.wal.TestWALFiltering
Running org.apache.hadoop.hbase.wal.TestWALFactory
Running org.apache.hadoop.hbase.wal.TestBoundedRegionGroupingProvider
Tests run: 9, Failures: 0, Errors: 0, Skipped: 0, Time elapsed: 12.129 sec - in org.apache.hadoop.hbase.wal.TestWALFactory
Tests run: 5, Failures: 0, Errors: 0, Skipped: 0, Time elapsed: 19.803 sec - in org.apache.hadoop.hbase.wal.TestBoundedRegionGroupingProvider
Running org.apache.hadoop.hbase.constraint.TestConstraint
Running org.apache.hadoop.hbase.TestNamespace
Tests run: 5, Failures: 0, Errors: 0, Skipped: 0, Time elapsed: 8.591 sec - in org.apache.hadoop.hbase.constraint.TestConstraint
Tests run: 9, Failures: 0, Errors: 0, Skipped: 1, Time elapsed: 7.116 sec - in org.apache.hadoop.hbase.TestNamespace
Running org.apache.hadoop.hbase.TestMetaMigrationConvertingToPB
Running org.apache.hadoop.hbase.TestInfoServers
Tests run: 3, Failures: 0, Errors: 0, Skipped: 0, Time elapsed: 2.311 sec - in org.apache.hadoop.hbase.TestMetaMigrationConvertingToPB
Running org.apache.hadoop.hbase.TestRegionRebalancing
Tests run: 3, Failures: 0, Errors: 0, Skipped: 0, Time elapsed: 2.707 sec - in org.apache.hadoop.hbase.TestInfoServers
Running org.apache.hadoop.hbase.filter.TestMultiRowRangeFilter
Tests run: 18, Failures: 0, Errors: 0, Skipped: 0, Time elapsed: 10.384 sec - in org.apache.hadoop.hbase.filter.TestMultiRowRangeFilter
Tests run: 2, Failures: 0, Errors: 0, Skipped: 0, Time elapsed: 27.195 sec - in org.apache.hadoop.hbase.TestRegionRebalancing
Running org.apache.hadoop.hbase.filter.TestScanRowPrefix
Tests run: 1, Failures: 0, Errors: 0, Skipped: 0, Time elapsed: 2.512 sec - in org.apache.hadoop.hbase.filter.TestScanRowPrefix
Running org.apache.hadoop.hbase.filter.TestFilterWrapper
Tests run: 1, Failures: 0, Errors: 0, Skipped: 0, Time elapsed: 1.649 sec - in org.apache.hadoop.hbase.filter.TestFilterWrapper
Running org.apache.hadoop.hbase.filter.TestFuzzyRowAndColumnRangeFilter
Running org.apache.hadoop.hbase.filter.TestColumnRangeFilter
Tests run: 1, Failures: 0, Errors: 0, Skipped: 0, Time elapsed: 2.805 sec - in org.apache.hadoop.hbase.filter.TestFuzzyRowAndColumnRangeFilter
Tests run: 1, Failures: 0, Errors: 0, Skipped: 0, Time elapsed: 7.592 sec - in org.apache.hadoop.hbase.filter.TestColumnRangeFilter
Running org.apache.hadoop.hbase.filter.TestFilterWithScanLimits
Tests run: 1, Failures: 0, Errors: 0, Skipped: 0, Time elapsed: 2.585 sec - in org.apache.hadoop.hbase.filter.TestFilterWithScanLimits
Running org.apache.hadoop.hbase.io.TestFileLink
Running org.apache.hadoop.hbase.io.hfile.TestScannerSelectionUsingTTL
Tests run: 5, Failures: 0, Errors: 0, Skipped: 0, Time elapsed: 12.333 sec - in org.apache.hadoop.hbase.io.TestFileLink
Running org.apache.hadoop.hbase.io.hfile.TestCacheConfig
Tests run: 6, Failures: 0, Errors: 0, Skipped: 0, Time elapsed: 1.58 sec - in org.apache.hadoop.hbase.io.hfile.TestCacheConfig
Running org.apache.hadoop.hbase.io.hfile.TestHFileSeek
Tests run: 1, Failures: 0, Errors: 0, Skipped: 0, Time elapsed: 1.9 sec - in org.apache.hadoop.hbase.io.hfile.TestHFileSeek
Running org.apache.hadoop.hbase.io.hfile.TestForceCacheImportantBlocks
Tests run: 4, Failures: 0, Errors: 0, Skipped: 0, Time elapsed: 32.555 sec - in org.apache.hadoop.hbase.io.hfile.TestForceCacheImportantBlocks
Running org.apache.hadoop.hbase.io.hfile.TestCacheOnWrite
Tests run: 31, Failures: 0, Errors: 0, Skipped: 0, Time elapsed: 189.109 sec - in org.apache.hadoop.hbase.wal.TestWALSplitCompressed
Tests run: 6, Failures: 0, Errors: 0, Skipped: 0, Time elapsed: 62.875 sec - in org.apache.hadoop.hbase.io.hfile.TestScannerSelectionUsingTTL
Running org.apache.hadoop.hbase.io.hfile.TestHFileBlock
Tests run: 31, Failures: 0, Errors: 0, Skipped: 0, Time elapsed: 189.93 sec - in org.apache.hadoop.hbase.wal.TestWALSplit
Running org.apache.hadoop.hbase.io.hfile.TestHFileBlockIndex
Running org.apache.hadoop.hbase.io.encoding.TestLoadAndSwitchEncodeOnDisk
Tests run: 10, Failures: 0, Errors: 0, Skipped: 0, Time elapsed: 13.466 sec - in org.apache.hadoop.hbase.io.hfile.TestHFileBlockIndex
Running org.apache.hadoop.hbase.io.encoding.TestBufferedDataBlockEncoder
Tests run: 1, Failures: 0, Errors: 0, Skipped: 0, Time elapsed: 26.902 sec - in org.apache.hadoop.hbase.io.encoding.TestLoadAndSwitchEncodeOnDisk
Running org.apache.hadoop.hbase.io.encoding.TestEncodedSeekers
Tests run: 1, Failures: 0, Errors: 0, Skipped: 0, Time elapsed: 24.757 sec - in org.apache.hadoop.hbase.io.encoding.TestBufferedDataBlockEncoder
Running org.apache.hadoop.hbase.io.encoding.TestDataBlockEncoders
Tests run: 51, Failures: 0, Errors: 0, Skipped: 1, Time elapsed: 286.886 sec - in org.apache.hadoop.hbase.util.TestHBaseFsck
Running org.apache.hadoop.hbase.io.encoding.TestChangingEncoding
Tests run: 28, Failures: 0, Errors: 0, Skipped: 0, Time elapsed: 93.172 sec - in org.apache.hadoop.hbase.io.hfile.TestHFileBlock
Running org.apache.hadoop.hbase.TestClusterBootOrder
Tests run: 2, Failures: 0, Errors: 0, Skipped: 0, Time elapsed: 27.03 sec - in org.apache.hadoop.hbase.TestClusterBootOrder
Tests run: 20, Failures: 0, Errors: 0, Skipped: 0, Time elapsed: 118.838 sec - in org.apache.hadoop.hbase.io.encoding.TestEncodedSeekers
Tests run: 3, Failures: 0, Errors: 0, Skipped: 0, Time elapsed: 109.236 sec - in org.apache.hadoop.hbase.io.encoding.TestChangingEncoding
Killed
Killed

Results :




Tests run: 2232, Failures: 0, Errors: 0, Skipped: 18

[INFO] ------------------------------------------------------------------------
[INFO] Reactor Summary:
[INFO] 
[INFO] HBase ............................................. SUCCESS [3.692s]
[INFO] HBase - Checkstyle ................................ SUCCESS [0.751s]
[INFO] HBase - Annotations ............................... SUCCESS [1.153s]
[INFO] HBase - Common .................................... SUCCESS [1:31.861s]
[INFO] HBase - Protocol .................................. SUCCESS [10.998s]
[INFO] HBase - Client .................................... SUCCESS [1:26.829s]
[INFO] HBase - Hadoop Compatibility ...................... SUCCESS [8.502s]
[INFO] HBase - Hadoop Two Compatibility .................. SUCCESS [9.429s]
[INFO] HBase - Prefix Tree ............................... SUCCESS [11.597s]
[INFO] HBase - Server .................................... FAILURE [1:21:21.669s]
[INFO] HBase - Testing Util .............................. SKIPPED
[INFO] HBase - Thrift .................................... SKIPPED
[INFO] HBase - Rest ...................................... SKIPPED
[INFO] HBase - Shell ..................................... SKIPPED
[INFO] HBase - Integration Tests ......................... SKIPPED
[INFO] HBase - Examples .................................. SKIPPED
[INFO] HBase - Assembly .................................. SKIPPED
[INFO] ------------------------------------------------------------------------
[INFO] BUILD FAILURE
[INFO] ------------------------------------------------------------------------
[INFO] Total time: 1:25:08.633s
[INFO] Finished at: Sat Mar 21 14:56:55 UTC 2015
[INFO] Final Memory: 87M/929M
[INFO] ------------------------------------------------------------------------
[ERROR] Failed to execute goal org.apache.maven.plugins:maven-surefire-plugin:2.18:test (secondPartTestsExecution) on project hbase-server: ExecutionException: java.lang.RuntimeException: The forked VM terminated without properly saying goodbye. VM crash or System.exit called?
[ERROR] Command was /bin/sh -c cd <https://builds.apache.org/job/HBase-1.1/ws/hbase-server> && /home/jenkins/jenkins-slave/tools/hudson.model.JDK/jdk-1.7u51/jre/bin/java -enableassertions -XX:MaxDirectMemorySize=1G -Xmx2800m -XX:MaxPermSize=256m -Djava.security.egd=file:/dev/./urandom -Djava.net.preferIPv4Stack=true -Djava.awt.headless=true -jar <https://builds.apache.org/job/HBase-1.1/ws/hbase-server/target/surefire/surefirebooter3862687460561787830.jar> <https://builds.apache.org/job/HBase-1.1/ws/hbase-server/target/surefire/surefire3682961682553937587tmp> <https://builds.apache.org/job/HBase-1.1/ws/hbase-server/target/surefire/surefire_11623647576775696629777tmp>
[ERROR] -> [Help 1]
[ERROR] 
[ERROR] To see the full stack trace of the errors, re-run Maven with the -e switch.
[ERROR] Re-run Maven using the -X switch to enable full debug logging.
[ERROR] 
[ERROR] For more information about the errors and possible solutions, please read the following articles:
[ERROR] [Help 1] http://cwiki.apache.org/confluence/display/MAVEN/MojoFailureException
[ERROR] 
[ERROR] After correcting the problems, you can resume the build with the command
[ERROR]   mvn <goals> -rf :hbase-server
Build step 'Invoke top-level Maven targets' marked build as failure
Performing Post build task...
Match found for :.* : True
Logical operation result is TRUE
Running script  :   ZOMBIE_TESTS_COUNT=`jps | grep surefirebooter | wc -l`
  if [[ $ZOMBIE_TESTS_COUNT != 0 ]] ; then
    #It seems sometimes the tests are not dying immediately. Let's give them 10s
    echo "Suspicious java process found - waiting 10s to see if there are just slow to stop"
    sleep 10   
    ZOMBIE_TESTS_COUNT=`jps | grep surefirebooter | wc -l`
    if [[ $ZOMBIE_TESTS_COUNT != 0 ]] ; then
      echo "There are $ZOMBIE_TESTS_COUNT zombie tests, they should have been killed by surefire but survived"
      echo "************ BEGIN zombies jstack extract"
      ZB_STACK=`jps | grep surefirebooter | cut -d ' ' -f 1 | xargs -n 1 jstack | grep ".test" | grep "\.java"`
      jps | grep surefirebooter | cut -d ' ' -f 1 | xargs -n 1 jstack
      echo "************ END  zombies jstack extract"
      JIRA_COMMENT="$JIRA_COMMENT

     {color:red}-1 core zombie tests{color}.  There are ${ZOMBIE_TESTS_COUNT} zombie test(s): ${ZB_STACK}"
      BAD=1
      jps | grep surefirebooter | cut -d ' ' -f 1 | xargs kill -9
    else
      echo "We're ok: there is no zombie test, but some tests took some time to stop"
    fi
  else
    echo "We're ok: there is no zombie test"
  fi
[HBase-1.1] $ /bin/bash -xe /tmp/hudson8714677263401363306.sh
++ jps
++ wc -l
++ grep surefirebooter
+ ZOMBIE_TESTS_COUNT=0
+ [[ 0 != 0 ]]
+ echo 'We'\''re ok: there is no zombie test'
We're ok: there is no zombie test
POST BUILD TASK : SUCCESS
END OF POST BUILD TASK : 0
Archiving artifacts
Sending artifact delta relative to HBase-1.1 #305
Archived 1916 artifacts
Archive block size is 32768
Received 39 blocks and 462108807 bytes
Compression is 0.3%
Took 2 min 46 sec
Recording test results
Updating HBASE-13308

Build failed in Jenkins: HBase-1.1 #309

Posted by Apache Jenkins Server <je...@builds.apache.org>.
See <https://builds.apache.org/job/HBase-1.1/309/changes>

Changes:

[apurtell] HBASE-13303 Fix size calculation of results on the region server

------------------------------------------
[...truncated 1860 lines...]
Running org.apache.hadoop.hbase.security.visibility.TestVisibilityLabelsWithSLGStack
Tests run: 1, Failures: 0, Errors: 0, Skipped: 0, Time elapsed: 2.153 sec - in org.apache.hadoop.hbase.security.visibility.TestVisibilityLabelsWithSLGStack
Running org.apache.hadoop.hbase.security.visibility.TestVisibilityLabelsReplication
Running org.apache.hadoop.hbase.security.visibility.TestVisibilityLabelsWithDeletes
Tests run: 23, Failures: 0, Errors: 0, Skipped: 0, Time elapsed: 16.947 sec - in org.apache.hadoop.hbase.security.visibility.TestVisibilityLabelsWithDistributedLogReplay
Tests run: 13, Failures: 0, Errors: 0, Skipped: 0, Time elapsed: 45.991 sec - in org.apache.hadoop.hbase.TestPartialResultsFromClientSide
Tests run: 1, Failures: 0, Errors: 0, Skipped: 0, Time elapsed: 19.267 sec - in org.apache.hadoop.hbase.security.visibility.TestVisibilityLabelsReplication
Running org.apache.hadoop.hbase.security.visibility.TestEnforcingScanLabelGenerator
Tests run: 1, Failures: 0, Errors: 0, Skipped: 0, Time elapsed: 2.847 sec - in org.apache.hadoop.hbase.security.visibility.TestEnforcingScanLabelGenerator
Running org.apache.hadoop.hbase.security.visibility.TestDefaultScanLabelGeneratorStack
Tests run: 1, Failures: 0, Errors: 0, Skipped: 0, Time elapsed: 3.188 sec - in org.apache.hadoop.hbase.security.visibility.TestDefaultScanLabelGeneratorStack
Running org.apache.hadoop.hbase.security.visibility.TestVisibilityWithCheckAuths
Running org.apache.hadoop.hbase.security.visibility.TestVisibilityLabelsOpWithDifferentUsersNoACL
Tests run: 1, Failures: 0, Errors: 0, Skipped: 0, Time elapsed: 2.809 sec - in org.apache.hadoop.hbase.security.visibility.TestVisibilityLabelsOpWithDifferentUsersNoACL
Tests run: 2, Failures: 0, Errors: 0, Skipped: 0, Time elapsed: 3.466 sec - in org.apache.hadoop.hbase.security.visibility.TestVisibilityWithCheckAuths
Running org.apache.hadoop.hbase.security.visibility.TestVisibilityLabelsWithDefaultVisLabelService
Running org.apache.hadoop.hbase.security.visibility.TestVisibilityLablesWithGroups
Running org.apache.hadoop.hbase.security.visibility.TestVisibilityLabelsWithACL
Tests run: 1, Failures: 0, Errors: 0, Skipped: 0, Time elapsed: 3.271 sec - in org.apache.hadoop.hbase.security.visibility.TestVisibilityLablesWithGroups
Tests run: 5, Failures: 0, Errors: 0, Skipped: 0, Time elapsed: 7.457 sec - in org.apache.hadoop.hbase.security.visibility.TestVisibilityLabelsWithACL
Running org.apache.hadoop.hbase.security.visibility.TestVisibilityLabelsWithCustomVisLabService
Tests run: 23, Failures: 0, Errors: 0, Skipped: 0, Time elapsed: 19.74 sec - in org.apache.hadoop.hbase.security.visibility.TestVisibilityLabelsWithDefaultVisLabelService
Running org.apache.hadoop.hbase.security.access.TestAccessController2
Tests run: 37, Failures: 0, Errors: 0, Skipped: 0, Time elapsed: 56.775 sec - in org.apache.hadoop.hbase.security.visibility.TestVisibilityLabelsWithDeletes
Tests run: 8, Failures: 0, Errors: 0, Skipped: 0, Time elapsed: 203.844 sec - in org.apache.hadoop.hbase.replication.regionserver.TestReplicationWALReaderManager
Running org.apache.hadoop.hbase.security.access.TestAccessController
Running org.apache.hadoop.hbase.security.access.TestTablePermissions
Tests run: 19, Failures: 0, Errors: 0, Skipped: 0, Time elapsed: 17.863 sec - in org.apache.hadoop.hbase.security.visibility.TestVisibilityLabelsWithCustomVisLabService
Running org.apache.hadoop.hbase.security.access.TestAccessControlFilter
Tests run: 1, Failures: 0, Errors: 0, Skipped: 0, Time elapsed: 3.519 sec - in org.apache.hadoop.hbase.security.access.TestAccessControlFilter
Running org.apache.hadoop.hbase.security.access.TestCellACLs
Tests run: 3, Failures: 0, Errors: 0, Skipped: 0, Time elapsed: 21.587 sec - in org.apache.hadoop.hbase.security.access.TestAccessController2
Running org.apache.hadoop.hbase.security.access.TestZKPermissionsWatcher
Running org.apache.hadoop.hbase.security.access.TestNamespaceCommands
Tests run: 2, Failures: 0, Errors: 0, Skipped: 0, Time elapsed: 9.639 sec - in org.apache.hadoop.hbase.security.access.TestCellACLs
Tests run: 1, Failures: 0, Errors: 0, Skipped: 0, Time elapsed: 4.373 sec - in org.apache.hadoop.hbase.security.access.TestZKPermissionsWatcher
Running org.apache.hadoop.hbase.security.access.TestScanEarlyTermination
Tests run: 7, Failures: 0, Errors: 0, Skipped: 0, Time elapsed: 11.677 sec - in org.apache.hadoop.hbase.security.access.TestNamespaceCommands
Tests run: 7, Failures: 0, Errors: 0, Skipped: 0, Time elapsed: 32.859 sec - in org.apache.hadoop.hbase.security.access.TestTablePermissions
Running org.apache.hadoop.hbase.security.access.TestCellACLWithMultipleVersions
Tests run: 1, Failures: 0, Errors: 0, Skipped: 0, Time elapsed: 4.874 sec - in org.apache.hadoop.hbase.security.access.TestScanEarlyTermination
Running org.apache.hadoop.hbase.security.token.TestZKSecretWatcher
Running org.apache.hadoop.hbase.security.token.TestTokenAuthentication
Tests run: 3, Failures: 0, Errors: 0, Skipped: 0, Time elapsed: 0.554 sec - in org.apache.hadoop.hbase.security.token.TestTokenAuthentication
Running org.apache.hadoop.hbase.TestMetaTableAccessorNoCluster
Tests run: 2, Failures: 0, Errors: 0, Skipped: 0, Time elapsed: 3.358 sec - in org.apache.hadoop.hbase.TestMetaTableAccessorNoCluster
Running org.apache.hadoop.hbase.TestMetaTableLocator
Tests run: 1, Failures: 0, Errors: 0, Skipped: 0, Time elapsed: 13.259 sec - in org.apache.hadoop.hbase.security.token.TestZKSecretWatcher
Tests run: 7, Failures: 0, Errors: 0, Skipped: 0, Time elapsed: 3.494 sec - in org.apache.hadoop.hbase.TestMetaTableLocator
Running org.apache.hadoop.hbase.TestHBaseTestingUtility
Running org.apache.hadoop.hbase.security.token.TestGenerateDelegationToken
Running org.apache.hadoop.hbase.TestZooKeeper
Tests run: 1, Failures: 0, Errors: 0, Skipped: 0, Time elapsed: 2.862 sec - in org.apache.hadoop.hbase.security.token.TestGenerateDelegationToken
Running org.apache.hadoop.hbase.snapshot.TestSnapshotDescriptionUtils
Tests run: 2, Failures: 0, Errors: 0, Skipped: 0, Time elapsed: 0.209 sec - in org.apache.hadoop.hbase.snapshot.TestSnapshotDescriptionUtils
Tests run: 8, Failures: 0, Errors: 0, Skipped: 0, Time elapsed: 28.572 sec - in org.apache.hadoop.hbase.security.access.TestCellACLWithMultipleVersions
Running org.apache.hadoop.hbase.snapshot.TestFlushSnapshotFromClient
Running org.apache.hadoop.hbase.snapshot.TestSecureExportSnapshot
Tests run: 11, Failures: 0, Errors: 0, Skipped: 0, Time elapsed: 51.724 sec - in org.apache.hadoop.hbase.TestHBaseTestingUtility
Tests run: 9, Failures: 0, Errors: 0, Skipped: 0, Time elapsed: 44.872 sec - in org.apache.hadoop.hbase.snapshot.TestFlushSnapshotFromClient
Running org.apache.hadoop.hbase.snapshot.TestRestoreFlushSnapshotFromClient
Running org.apache.hadoop.hbase.snapshot.TestExportSnapshot
Tests run: 5, Failures: 0, Errors: 0, Skipped: 0, Time elapsed: 60.921 sec - in org.apache.hadoop.hbase.snapshot.TestRestoreFlushSnapshotFromClient
Running org.apache.hadoop.hbase.TestInfoServers
Tests run: 3, Failures: 0, Errors: 0, Skipped: 0, Time elapsed: 2.787 sec - in org.apache.hadoop.hbase.TestInfoServers
Running org.apache.hadoop.hbase.procedure.TestZKProcedureControllers
Tests run: 4, Failures: 0, Errors: 0, Skipped: 0, Time elapsed: 1.69 sec - in org.apache.hadoop.hbase.procedure.TestZKProcedureControllers
Running org.apache.hadoop.hbase.procedure.TestZKProcedure
Tests run: 4, Failures: 0, Errors: 0, Skipped: 0, Time elapsed: 2.303 sec - in org.apache.hadoop.hbase.procedure.TestZKProcedure
Tests run: 12, Failures: 0, Errors: 0, Skipped: 0, Time elapsed: 162.726 sec - in org.apache.hadoop.hbase.TestZooKeeper
Running org.apache.hadoop.hbase.io.hfile.TestCacheOnWrite
Running org.apache.hadoop.hbase.io.hfile.TestForceCacheImportantBlocks
Tests run: 55, Failures: 0, Errors: 0, Skipped: 0, Time elapsed: 258.445 sec - in org.apache.hadoop.hbase.security.access.TestAccessController
Running org.apache.hadoop.hbase.io.hfile.TestHFileBlock
Tests run: 4, Failures: 0, Errors: 0, Skipped: 0, Time elapsed: 39.811 sec - in org.apache.hadoop.hbase.io.hfile.TestForceCacheImportantBlocks
Running org.apache.hadoop.hbase.io.hfile.TestHFileBlockIndex
Tests run: 10, Failures: 0, Errors: 0, Skipped: 0, Time elapsed: 14.014 sec - in org.apache.hadoop.hbase.io.hfile.TestHFileBlockIndex
Running org.apache.hadoop.hbase.io.hfile.TestHFileSeek
Tests run: 1, Failures: 0, Errors: 0, Skipped: 0, Time elapsed: 2.914 sec - in org.apache.hadoop.hbase.io.hfile.TestHFileSeek
Running org.apache.hadoop.hbase.io.hfile.TestScannerSelectionUsingTTL
Tests run: 28, Failures: 0, Errors: 0, Skipped: 0, Time elapsed: 92.592 sec - in org.apache.hadoop.hbase.io.hfile.TestHFileBlock
Running org.apache.hadoop.hbase.io.hfile.TestCacheConfig
Tests run: 6, Failures: 0, Errors: 0, Skipped: 0, Time elapsed: 1.777 sec - in org.apache.hadoop.hbase.io.hfile.TestCacheConfig
Running org.apache.hadoop.hbase.io.encoding.TestDataBlockEncoders
Tests run: 6, Failures: 0, Errors: 0, Skipped: 0, Time elapsed: 64.002 sec - in org.apache.hadoop.hbase.io.hfile.TestScannerSelectionUsingTTL
Running org.apache.hadoop.hbase.io.encoding.TestEncodedSeekers
Tests run: 9, Failures: 0, Errors: 0, Skipped: 0, Time elapsed: 328.203 sec - in org.apache.hadoop.hbase.snapshot.TestSecureExportSnapshot
Running org.apache.hadoop.hbase.io.encoding.TestBufferedDataBlockEncoder
Tests run: 1, Failures: 0, Errors: 0, Skipped: 0, Time elapsed: 17.583 sec - in org.apache.hadoop.hbase.io.encoding.TestBufferedDataBlockEncoder
Running org.apache.hadoop.hbase.io.encoding.TestChangingEncoding
Tests run: 9, Failures: 0, Errors: 0, Skipped: 0, Time elapsed: 309.68 sec - in org.apache.hadoop.hbase.snapshot.TestExportSnapshot
Running org.apache.hadoop.hbase.io.encoding.TestLoadAndSwitchEncodeOnDisk
Tests run: 1, Failures: 0, Errors: 0, Skipped: 0, Time elapsed: 26.962 sec - in org.apache.hadoop.hbase.io.encoding.TestLoadAndSwitchEncodeOnDisk
Running org.apache.hadoop.hbase.io.TestFileLink
Tests run: 20, Failures: 0, Errors: 0, Skipped: 0, Time elapsed: 120.221 sec - in org.apache.hadoop.hbase.io.encoding.TestEncodedSeekers
Tests run: 5, Failures: 0, Errors: 0, Skipped: 0, Time elapsed: 13.559 sec - in org.apache.hadoop.hbase.io.TestFileLink
Running org.apache.hadoop.hbase.wal.TestWALFiltering
Running org.apache.hadoop.hbase.wal.TestWALFactory
Tests run: 9, Failures: 0, Errors: 0, Skipped: 0, Time elapsed: 11.792 sec - in org.apache.hadoop.hbase.wal.TestWALFactory
Running org.apache.hadoop.hbase.wal.TestWALReaderOnSecureWAL
Tests run: 2, Failures: 0, Errors: 0, Skipped: 0, Time elapsed: 2.614 sec - in org.apache.hadoop.hbase.wal.TestWALReaderOnSecureWAL
Tests run: 1, Failures: 0, Errors: 0, Skipped: 0, Time elapsed: 24.936 sec - in org.apache.hadoop.hbase.wal.TestWALFiltering
Running org.apache.hadoop.hbase.wal.TestDefaultWALProvider
Running org.apache.hadoop.hbase.wal.TestWALSplit
Tests run: 5, Failures: 0, Errors: 0, Skipped: 0, Time elapsed: 6.616 sec - in org.apache.hadoop.hbase.wal.TestDefaultWALProvider
Running org.apache.hadoop.hbase.wal.TestSecureWAL
Tests run: 1, Failures: 0, Errors: 0, Skipped: 0, Time elapsed: 1.346 sec - in org.apache.hadoop.hbase.wal.TestSecureWAL
Running org.apache.hadoop.hbase.wal.TestDefaultWALProviderWithHLogKey
Tests run: 5, Failures: 0, Errors: 0, Skipped: 0, Time elapsed: 6.846 sec - in org.apache.hadoop.hbase.wal.TestDefaultWALProviderWithHLogKey
Running org.apache.hadoop.hbase.wal.TestBoundedRegionGroupingProvider
Tests run: 3, Failures: 0, Errors: 0, Skipped: 0, Time elapsed: 110.023 sec - in org.apache.hadoop.hbase.io.encoding.TestChangingEncoding
Running org.apache.hadoop.hbase.wal.TestWALSplitCompressed
Tests run: 5, Failures: 0, Errors: 0, Skipped: 0, Time elapsed: 20.368 sec - in org.apache.hadoop.hbase.wal.TestBoundedRegionGroupingProvider
Running org.apache.hadoop.hbase.zookeeper.TestZooKeeperACL
Tests run: 6, Failures: 0, Errors: 0, Skipped: 0, Time elapsed: 0.269 sec - in org.apache.hadoop.hbase.zookeeper.TestZooKeeperACL
Running org.apache.hadoop.hbase.zookeeper.TestZKLeaderManager
Tests run: 1, Failures: 0, Errors: 0, Skipped: 0, Time elapsed: 0.136 sec - in org.apache.hadoop.hbase.zookeeper.TestZKLeaderManager
Running org.apache.hadoop.hbase.zookeeper.TestZooKeeperNodeTracker
Tests run: 3, Failures: 0, Errors: 0, Skipped: 0, Time elapsed: 0.871 sec - in org.apache.hadoop.hbase.zookeeper.TestZooKeeperNodeTracker
Running org.apache.hadoop.hbase.zookeeper.TestRecoverableZooKeeper
Tests run: 1, Failures: 0, Errors: 0, Skipped: 0, Time elapsed: 1.239 sec - in org.apache.hadoop.hbase.zookeeper.TestRecoverableZooKeeper
Running org.apache.hadoop.hbase.zookeeper.TestZKTableStateManager
Tests run: 1, Failures: 0, Errors: 0, Skipped: 0, Time elapsed: 0.739 sec - in org.apache.hadoop.hbase.zookeeper.TestZKTableStateManager
Running org.apache.hadoop.hbase.zookeeper.TestZKMulti
Tests run: 8, Failures: 0, Errors: 0, Skipped: 0, Time elapsed: 0.633 sec - in org.apache.hadoop.hbase.zookeeper.TestZKMulti
Running org.apache.hadoop.hbase.zookeeper.lock.TestZKInterProcessReadWriteLock
Tests run: 28, Failures: 0, Errors: 0, Skipped: 0, Time elapsed: 242.416 sec - in org.apache.hadoop.hbase.io.encoding.TestDataBlockEncoders
Running org.apache.hadoop.hbase.zookeeper.TestHQuorumPeer
Tests run: 4, Failures: 0, Errors: 0, Skipped: 0, Time elapsed: 1.409 sec - in org.apache.hadoop.hbase.zookeeper.TestHQuorumPeer
Running org.apache.hadoop.hbase.TestIOFencing
Tests run: 6, Failures: 0, Errors: 0, Skipped: 0, Time elapsed: 24.549 sec - in org.apache.hadoop.hbase.zookeeper.lock.TestZKInterProcessReadWriteLock
Running org.apache.hadoop.hbase.constraint.TestConstraint
Tests run: 216, Failures: 0, Errors: 0, Skipped: 0, Time elapsed: 406.227 sec - in org.apache.hadoop.hbase.io.hfile.TestCacheOnWrite
Tests run: 5, Failures: 0, Errors: 0, Skipped: 0, Time elapsed: 6.137 sec - in org.apache.hadoop.hbase.constraint.TestConstraint
Running org.apache.hadoop.hbase.TestMovedRegionsCleaner
Running org.apache.hadoop.hbase.backup.TestHFileArchiving
Tests run: 1, Failures: 0, Errors: 0, Skipped: 0, Time elapsed: 10.991 sec - in org.apache.hadoop.hbase.TestMovedRegionsCleaner
Running org.apache.hadoop.hbase.backup.example.TestZooKeeperTableArchiveClient
Tests run: 3, Failures: 0, Errors: 0, Skipped: 0, Time elapsed: 3.972 sec - in org.apache.hadoop.hbase.backup.example.TestZooKeeperTableArchiveClient
Running org.apache.hadoop.hbase.TestHColumnDescriptorDefaultVersions
Tests run: 3, Failures: 0, Errors: 0, Skipped: 0, Time elapsed: 14.838 sec - in org.apache.hadoop.hbase.TestHColumnDescriptorDefaultVersions
Running org.apache.hadoop.hbase.ipc.TestProtoBufRpc
Tests run: 1, Failures: 0, Errors: 0, Skipped: 0, Time elapsed: 1.782 sec - in org.apache.hadoop.hbase.ipc.TestProtoBufRpc
Running org.apache.hadoop.hbase.ipc.TestDelayedRpc
Tests run: 4, Failures: 0, Errors: 0, Skipped: 0, Time elapsed: 4.167 sec - in org.apache.hadoop.hbase.ipc.TestDelayedRpc
Tests run: 5, Failures: 0, Errors: 0, Skipped: 0, Time elapsed: 41.452 sec - in org.apache.hadoop.hbase.backup.TestHFileArchiving
Running org.apache.hadoop.hbase.ipc.TestHBaseClient
Tests run: 1, Failures: 0, Errors: 0, Skipped: 0, Time elapsed: 0.393 sec - in org.apache.hadoop.hbase.ipc.TestHBaseClient
Running org.apache.hadoop.hbase.TestNamespace
Tests run: 9, Failures: 0, Errors: 0, Skipped: 1, Time elapsed: 7.762 sec - in org.apache.hadoop.hbase.TestNamespace
Tests run: 31, Failures: 0, Errors: 0, Skipped: 0, Time elapsed: 192.752 sec - in org.apache.hadoop.hbase.wal.TestWALSplit
Tests run: 31, Failures: 0, Errors: 0, Skipped: 0, Time elapsed: 200.685 sec - in org.apache.hadoop.hbase.wal.TestWALSplitCompressed
Tests run: 2, Failures: 0, Errors: 0, Skipped: 0, Time elapsed: 213.254 sec - in org.apache.hadoop.hbase.TestIOFencing

Results :

Failed tests: 
  TestSplitTransactionOnCluster.testFailedSplit:1327 null



Tests run: 2476, Failures: 1, Errors: 0, Skipped: 18

[INFO] ------------------------------------------------------------------------
[INFO] Reactor Summary:
[INFO] 
[INFO] HBase ............................................. SUCCESS [3.233s]
[INFO] HBase - Checkstyle ................................ SUCCESS [0.620s]
[INFO] HBase - Annotations ............................... SUCCESS [0.921s]
[INFO] HBase - Common .................................... SUCCESS [1:22.244s]
[INFO] HBase - Protocol .................................. SUCCESS [9.457s]
[INFO] HBase - Client .................................... SUCCESS [1:16.079s]
[INFO] HBase - Hadoop Compatibility ...................... SUCCESS [7.132s]
[INFO] HBase - Hadoop Two Compatibility .................. SUCCESS [6.776s]
[INFO] HBase - Prefix Tree ............................... SUCCESS [8.986s]
[INFO] HBase - Server .................................... FAILURE [1:12:24.795s]
[INFO] HBase - Testing Util .............................. SKIPPED
[INFO] HBase - Thrift .................................... SKIPPED
[INFO] HBase - Rest ...................................... SKIPPED
[INFO] HBase - Shell ..................................... SKIPPED
[INFO] HBase - Integration Tests ......................... SKIPPED
[INFO] HBase - Examples .................................. SKIPPED
[INFO] HBase - Assembly .................................. SKIPPED
[INFO] ------------------------------------------------------------------------
[INFO] BUILD FAILURE
[INFO] ------------------------------------------------------------------------
[INFO] Total time: 1:15:42.312s
[INFO] Finished at: Sat Mar 21 02:47:12 UTC 2015
[INFO] Final Memory: 86M/784M
[INFO] ------------------------------------------------------------------------
[ERROR] Failed to execute goal org.apache.maven.plugins:maven-surefire-plugin:2.18:test (secondPartTestsExecution) on project hbase-server: There are test failures.
[ERROR] 
[ERROR] Please refer to <https://builds.apache.org/job/HBase-1.1/ws/hbase-server/target/surefire-reports> for the individual test results.
[ERROR] -> [Help 1]
[ERROR] 
[ERROR] To see the full stack trace of the errors, re-run Maven with the -e switch.
[ERROR] Re-run Maven using the -X switch to enable full debug logging.
[ERROR] 
[ERROR] For more information about the errors and possible solutions, please read the following articles:
[ERROR] [Help 1] http://cwiki.apache.org/confluence/display/MAVEN/MojoFailureException
[ERROR] 
[ERROR] After correcting the problems, you can resume the build with the command
[ERROR]   mvn <goals> -rf :hbase-server
Build step 'Invoke top-level Maven targets' marked build as failure
Performing Post build task...
Match found for :.* : True
Logical operation result is TRUE
Running script  :   ZOMBIE_TESTS_COUNT=`jps | grep surefirebooter | wc -l`
  if [[ $ZOMBIE_TESTS_COUNT != 0 ]] ; then
    #It seems sometimes the tests are not dying immediately. Let's give them 10s
    echo "Suspicious java process found - waiting 10s to see if there are just slow to stop"
    sleep 10   
    ZOMBIE_TESTS_COUNT=`jps | grep surefirebooter | wc -l`
    if [[ $ZOMBIE_TESTS_COUNT != 0 ]] ; then
      echo "There are $ZOMBIE_TESTS_COUNT zombie tests, they should have been killed by surefire but survived"
      echo "************ BEGIN zombies jstack extract"
      ZB_STACK=`jps | grep surefirebooter | cut -d ' ' -f 1 | xargs -n 1 jstack | grep ".test" | grep "\.java"`
      jps | grep surefirebooter | cut -d ' ' -f 1 | xargs -n 1 jstack
      echo "************ END  zombies jstack extract"
      JIRA_COMMENT="$JIRA_COMMENT

     {color:red}-1 core zombie tests{color}.  There are ${ZOMBIE_TESTS_COUNT} zombie test(s): ${ZB_STACK}"
      BAD=1
      jps | grep surefirebooter | cut -d ' ' -f 1 | xargs kill -9
    else
      echo "We're ok: there is no zombie test, but some tests took some time to stop"
    fi
  else
    echo "We're ok: there is no zombie test"
  fi
[HBase-1.1] $ /bin/bash -xe /tmp/hudson5345975409696306024.sh
++ jps
++ grep surefirebooter
++ wc -l
+ ZOMBIE_TESTS_COUNT=0
+ [[ 0 != 0 ]]
+ echo 'We'\''re ok: there is no zombie test'
We're ok: there is no zombie test
POST BUILD TASK : SUCCESS
END OF POST BUILD TASK : 0
Archiving artifacts
Sending artifact delta relative to HBase-1.1 #305
Archived 1920 artifacts
Archive block size is 32768
Received 39 blocks and 471754013 bytes
Compression is 0.3%
Took 2 min 18 sec
Recording test results
Updating HBASE-13303