You are viewing a plain text version of this content. The canonical link for it is here.
Posted to commits@beam.apache.org by Apache Jenkins Server <je...@builds.apache.org> on 2018/09/10 09:18:32 UTC
Build failed in Jenkins: beam_PostCommit_Go_GradleBuild #884
See <https://builds.apache.org/job/beam_PostCommit_Go_GradleBuild/884/display/redirect?page=changes>
Changes:
[robertwb] Update container versions of NumPy and TensorFlow.
------------------------------------------
[...truncated 538.06 KB...]
],
"parallel_input": {
"@type": "OutputReference",
"step_name": "e8",
"output_name": "i0"
},
"serialized_fn": "e9"
}
},
{
"kind": "ParallelDo",
"name": "e10",
"properties": {
"user_name": "passert.Hash(out)/beam.addFixedKeyFn",
"output_info": [
{
"user_name": "i0",
"output_name": "i0",
"encoding": {
"@type": "kind:windowed_value",
"component_encodings": [
{
"@type": "kind:pair",
"component_encodings": [
{
"@type": "kind:length_prefix",
"component_encodings": [
{
"@type": "Cgd2YXJpbnR6EgIIAhqFAQpxZ2l0aHViLmNvbS9hcGFjaGUvYmVhbS9zZGtzL2dvL3Rlc3QvdmVuZG9yL2dpdGh1Yi5jb20vYXBhY2hlL2JlYW0vc2Rrcy9nby9wa2cvYmVhbS9jb3JlL3J1bnRpbWUvY29kZXJ4LmVuY1ZhckludFoSEAgWIgQIGUAPKgYIFBICCAgikQEKcWdpdGh1Yi5jb20vYXBhY2hlL2JlYW0vc2Rrcy9nby90ZXN0L3ZlbmRvci9naXRodWIuY29tL2FwYWNoZS9iZWFtL3Nka3MvZ28vcGtnL2JlYW0vY29yZS9ydW50aW1lL2NvZGVyeC5kZWNWYXJJbnRaEhwIFiIECBlAAyIGCBQSAggIKgQIGUAPKgQIGUAB"
}
]
},
{
"@type": "kind:bytes"
}
],
"is_pair_like": true
},
{
"@type": "kind:global_window"
}
],
"is_wrapper": true
}
}
],
"parallel_input": {
"@type": "OutputReference",
"step_name": "e9",
"output_name": "i0"
},
"serialized_fn": "e10"
}
},
{
"kind": "GroupByKey",
"name": "e11",
"properties": {
"user_name": "passert.Hash(out)/CoGBK",
"output_info": [
{
"user_name": "i0",
"output_name": "i0",
"encoding": {
"@type": "kind:windowed_value",
"component_encodings": [
{
"@type": "kind:pair",
"component_encodings": [
{
"@type": "kind:length_prefix",
"component_encodings": [
{
"@type": "Cgd2YXJpbnR6EgIIAhqFAQpxZ2l0aHViLmNvbS9hcGFjaGUvYmVhbS9zZGtzL2dvL3Rlc3QvdmVuZG9yL2dpdGh1Yi5jb20vYXBhY2hlL2JlYW0vc2Rrcy9nby9wa2cvYmVhbS9jb3JlL3J1bnRpbWUvY29kZXJ4LmVuY1ZhckludFoSEAgWIgQIGUAPKgYIFBICCAgikQEKcWdpdGh1Yi5jb20vYXBhY2hlL2JlYW0vc2Rrcy9nby90ZXN0L3ZlbmRvci9naXRodWIuY29tL2FwYWNoZS9iZWFtL3Nka3MvZ28vcGtnL2JlYW0vY29yZS9ydW50aW1lL2NvZGVyeC5kZWNWYXJJbnRaEhwIFiIECBlAAyIGCBQSAggIKgQIGUAPKgQIGUAB"
}
]
},
{
"@type": "kind:stream",
"component_encodings": [
{
"@type": "kind:bytes"
}
],
"is_stream_like": true
}
],
"is_pair_like": true
},
{
"@type": "kind:global_window"
}
],
"is_wrapper": true
}
}
],
"parallel_input": {
"@type": "OutputReference",
"step_name": "e10",
"output_name": "i0"
},
"serialized_fn": "%0A%29%22%27%0A%02c4%12%21%0A%1F%0A%1D%0A%1Bbeam:coder:global_window:v1j9%0A%25%0A%23%0A%21beam:windowfn:global_windows:v0.1%10%01%1A%02c4%22%02:%00%28%010%018%02H%01"
}
},
{
"kind": "ParallelDo",
"name": "e12",
"properties": {
"user_name": "passert.Hash(out)/passert.hashFn",
"output_info": [
{
"user_name": "bogus",
"output_name": "bogus",
"encoding": {
"@type": "kind:windowed_value",
"component_encodings": [
{
"@type": "kind:bytes"
},
{
"@type": "kind:global_window"
}
],
"is_wrapper": true
}
}
],
"parallel_input": {
"@type": "OutputReference",
"step_name": "e11",
"output_name": "i0"
},
"serialized_fn": "e12"
}
}
],
"type": "JOB_TYPE_BATCH"
}
2018/09/10 09:14:58 Submitted job: 2018-09-10_02_14_57-15489830698261354992
2018/09/10 09:14:58 Console: https://console.cloud.google.com/dataflow/job/2018-09-10_02_14_57-15489830698261354992?project=apache-beam-testing
2018/09/10 09:14:58 Logs: https://console.cloud.google.com/logs/viewer?project=apache-beam-testing&resource=dataflow_step%2Fjob_id%2F2018-09-10_02_14_57-15489830698261354992
2018/09/10 09:14:58 Submitted job: 2018-09-10_02_14_57-9783834903876139676
2018/09/10 09:14:58 Console: https://console.cloud.google.com/dataflow/job/2018-09-10_02_14_57-9783834903876139676?project=apache-beam-testing
2018/09/10 09:14:58 Logs: https://console.cloud.google.com/logs/viewer?project=apache-beam-testing&resource=dataflow_step%2Fjob_id%2F2018-09-10_02_14_57-9783834903876139676
2018/09/10 09:14:58 Job state: JOB_STATE_PENDING ...
2018/09/10 09:14:58 Job state: JOB_STATE_PENDING ...
2018/09/10 09:14:58 Submitted job: 2018-09-10_02_14_57-4585969788975821373
2018/09/10 09:14:58 Console: https://console.cloud.google.com/dataflow/job/2018-09-10_02_14_57-4585969788975821373?project=apache-beam-testing
2018/09/10 09:14:58 Logs: https://console.cloud.google.com/logs/viewer?project=apache-beam-testing&resource=dataflow_step%2Fjob_id%2F2018-09-10_02_14_57-4585969788975821373
2018/09/10 09:14:58 Job state: JOB_STATE_PENDING ...
2018/09/10 09:14:58 Submitted job: 2018-09-10_02_14_57-10617164289014926335
2018/09/10 09:14:58 Console: https://console.cloud.google.com/dataflow/job/2018-09-10_02_14_57-10617164289014926335?project=apache-beam-testing
2018/09/10 09:14:58 Logs: https://console.cloud.google.com/logs/viewer?project=apache-beam-testing&resource=dataflow_step%2Fjob_id%2F2018-09-10_02_14_57-10617164289014926335
2018/09/10 09:14:58 Job state: JOB_STATE_PENDING ...
2018/09/10 09:14:58 Submitted job: 2018-09-10_02_14_57-8497031027486190171
2018/09/10 09:14:58 Console: https://console.cloud.google.com/dataflow/job/2018-09-10_02_14_57-8497031027486190171?project=apache-beam-testing
2018/09/10 09:14:58 Logs: https://console.cloud.google.com/logs/viewer?project=apache-beam-testing&resource=dataflow_step%2Fjob_id%2F2018-09-10_02_14_57-8497031027486190171
2018/09/10 09:14:58 Job state: JOB_STATE_PENDING ...
2018/09/10 09:15:28 Job still running ...
2018/09/10 09:15:28 Job still running ...
2018/09/10 09:15:28 Job still running ...
2018/09/10 09:15:28 Job still running ...
2018/09/10 09:15:28 Job still running ...
2018/09/10 09:15:58 Job still running ...
2018/09/10 09:15:58 Job still running ...
2018/09/10 09:15:58 Job still running ...
2018/09/10 09:15:58 Job still running ...
2018/09/10 09:15:58 Job still running ...
2018/09/10 09:16:28 Job still running ...
2018/09/10 09:16:28 Job still running ...
2018/09/10 09:16:28 Job still running ...
2018/09/10 09:16:28 Job still running ...
2018/09/10 09:16:28 Job still running ...
2018/09/10 09:16:58 Job still running ...
2018/09/10 09:16:58 Job still running ...
2018/09/10 09:16:58 Job still running ...
2018/09/10 09:16:58 Job still running ...
2018/09/10 09:16:59 Job still running ...
2018/09/10 09:17:28 Job still running ...
2018/09/10 09:17:28 Job still running ...
2018/09/10 09:17:28 Job still running ...
2018/09/10 09:17:28 Job still running ...
2018/09/10 09:17:29 Job still running ...
2018/09/10 09:17:58 Job still running ...
2018/09/10 09:17:58 Job succeeded!
2018/09/10 09:17:58 Test pardo:multioutput completed
2018/09/10 09:17:58 Job succeeded!
2018/09/10 09:17:58 Test wordcount:memfs completed
2018/09/10 09:17:58 Job still running ...
2018/09/10 09:17:59 Job succeeded!
2018/09/10 09:17:59 Test wordcount:kinglear completed
2018/09/10 09:18:28 Job succeeded!
2018/09/10 09:18:28 Test flatten:flatten completed
2018/09/10 09:18:28 Job succeeded!
2018/09/10 09:18:28 Test cogbk:cogbk completed
2018/09/10 09:18:28 Result: all tests passed!
# TODO(herohde) 5/9/2018: run other runner tests here to reuse the container image?
# Delete the container locally and remotely
docker rmi $CONTAINER:$TAG || echo "Failed to remove container"
Untagged: us.gcr.io/apache-beam-testing/jenkins/go:20180910-091350
Untagged: us.gcr.io/apache-beam-testing/jenkins/go@sha256:fe6bec361bcbce6300338c4cbf5bbf9c88b21ea4ee333764df8e024ec120da43
Deleted: sha256:924dfa90b350ee8018b3cada82ab0e5b75c212f7f217f197aa498db7c45dfaca
Deleted: sha256:e9cf94abad162c8c742f177115a0c8abdc934775eb2ba47f414eddfa64c108af
Deleted: sha256:a429a4f2c761b4341f020a56f5d644885453956d12abba82f8c21b8db612b8d7
Deleted: sha256:748126b2b5c2358e4f0f21d9a95ad99839b21f2e287acac0dd42c462ee2f442d
Deleted: sha256:376367239574f4399bb2e1c41df268b20bba51a50b5a7871eb0025aab582b2f0
Deleted: sha256:15df162495fa308b8fcd24f7806e373679f1553fb6544506b25ec7df5294a380
gcloud --quiet container images delete $CONTAINER:$TAG || echo "Failed to delete container"
Digests:
- us.gcr.io/apache-beam-testing/jenkins/go@sha256:fe6bec361bcbce6300338c4cbf5bbf9c88b21ea4ee333764df8e024ec120da43
Associated tags:
- 20180910-091350
Tags:
- us.gcr.io/apache-beam-testing/jenkins/go:20180910-091350
Deleted [us.gcr.io/apache-beam-testing/jenkins/go:20180910-091350].
Deleted [us.gcr.io/apache-beam-testing/jenkins/go@sha256:fe6bec361bcbce6300338c4cbf5bbf9c88b21ea4ee333764df8e024ec120da43].
# Clean up tempdir
rm -rf $TMPDIR
echo ">>> SUCCESS"
>>> SUCCESS
:goIntegrationTests (Thread[Task worker for ':',5,main]) completed. Took 4 mins 42.737 secs.
FAILURE: Build failed with an exception.
* What went wrong:
Execution failed for task ':beam-sdks-go:test'.
> There are 1 failed tests. Please see <https://builds.apache.org/job/beam_PostCommit_Go_GradleBuild/ws/src/sdks/go/.gogradle/reports/test/index.html> for more details.
* Try:
Run with --stacktrace option to get the stack trace. Run with --debug option to get more log output. Run with --scan to get full insights.
* Get more help at https://help.gradle.org
Deprecated Gradle features were used in this build, making it incompatible with Gradle 5.0.
See https://docs.gradle.org/4.8/userguide/command_line_interface.html#sec:command_line_warnings
BUILD FAILED in 6m 40s
44 actionable tasks: 44 executed
Publishing build scan...
https://gradle.com/s/5u2evtxasomp2
Build step 'Invoke Gradle script' changed build result to FAILURE
Build step 'Invoke Gradle script' marked build as failure
Jenkins build is back to normal : beam_PostCommit_Go_GradleBuild
#886
Posted by Apache Jenkins Server <je...@builds.apache.org>.
See <https://builds.apache.org/job/beam_PostCommit_Go_GradleBuild/886/display/redirect>
Build failed in Jenkins: beam_PostCommit_Go_GradleBuild #885
Posted by Apache Jenkins Server <je...@builds.apache.org>.
See <https://builds.apache.org/job/beam_PostCommit_Go_GradleBuild/885/display/redirect>
------------------------------------------
[...truncated 538.30 KB...]
}
],
"parallel_input": {
"@type": "OutputReference",
"step_name": "e8",
"output_name": "i0"
},
"serialized_fn": "e9"
}
},
{
"kind": "ParallelDo",
"name": "e10",
"properties": {
"user_name": "passert.Hash(out)/beam.addFixedKeyFn",
"output_info": [
{
"user_name": "i0",
"output_name": "i0",
"encoding": {
"@type": "kind:windowed_value",
"component_encodings": [
{
"@type": "kind:pair",
"component_encodings": [
{
"@type": "kind:length_prefix",
"component_encodings": [
{
"@type": "Cgd2YXJpbnR6EgIIAhqFAQpxZ2l0aHViLmNvbS9hcGFjaGUvYmVhbS9zZGtzL2dvL3Rlc3QvdmVuZG9yL2dpdGh1Yi5jb20vYXBhY2hlL2JlYW0vc2Rrcy9nby9wa2cvYmVhbS9jb3JlL3J1bnRpbWUvY29kZXJ4LmVuY1ZhckludFoSEAgWIgQIGUAPKgYIFBICCAgikQEKcWdpdGh1Yi5jb20vYXBhY2hlL2JlYW0vc2Rrcy9nby90ZXN0L3ZlbmRvci9naXRodWIuY29tL2FwYWNoZS9iZWFtL3Nka3MvZ28vcGtnL2JlYW0vY29yZS9ydW50aW1lL2NvZGVyeC5kZWNWYXJJbnRaEhwIFiIECBlAAyIGCBQSAggIKgQIGUAPKgQIGUAB"
}
]
},
{
"@type": "kind:bytes"
}
],
"is_pair_like": true
},
{
"@type": "kind:global_window"
}
],
"is_wrapper": true
}
}
],
"parallel_input": {
"@type": "OutputReference",
"step_name": "e9",
"output_name": "i0"
},
"serialized_fn": "e10"
}
},
{
"kind": "GroupByKey",
"name": "e11",
"properties": {
"user_name": "passert.Hash(out)/CoGBK",
"output_info": [
{
"user_name": "i0",
"output_name": "i0",
"encoding": {
"@type": "kind:windowed_value",
"component_encodings": [
{
"@type": "kind:pair",
"component_encodings": [
{
"@type": "kind:length_prefix",
"component_encodings": [
{
"@type": "Cgd2YXJpbnR6EgIIAhqFAQpxZ2l0aHViLmNvbS9hcGFjaGUvYmVhbS9zZGtzL2dvL3Rlc3QvdmVuZG9yL2dpdGh1Yi5jb20vYXBhY2hlL2JlYW0vc2Rrcy9nby9wa2cvYmVhbS9jb3JlL3J1bnRpbWUvY29kZXJ4LmVuY1ZhckludFoSEAgWIgQIGUAPKgYIFBICCAgikQEKcWdpdGh1Yi5jb20vYXBhY2hlL2JlYW0vc2Rrcy9nby90ZXN0L3ZlbmRvci9naXRodWIuY29tL2FwYWNoZS9iZWFtL3Nka3MvZ28vcGtnL2JlYW0vY29yZS9ydW50aW1lL2NvZGVyeC5kZWNWYXJJbnRaEhwIFiIECBlAAyIGCBQSAggIKgQIGUAPKgQIGUAB"
}
]
},
{
"@type": "kind:stream",
"component_encodings": [
{
"@type": "kind:bytes"
}
],
"is_stream_like": true
}
],
"is_pair_like": true
},
{
"@type": "kind:global_window"
}
],
"is_wrapper": true
}
}
],
"parallel_input": {
"@type": "OutputReference",
"step_name": "e10",
"output_name": "i0"
},
"serialized_fn": "%0A%29%22%27%0A%02c4%12%21%0A%1F%0A%1D%0A%1Bbeam:coder:global_window:v1j9%0A%25%0A%23%0A%21beam:windowfn:global_windows:v0.1%10%01%1A%02c4%22%02:%00%28%010%018%02H%01"
}
},
{
"kind": "ParallelDo",
"name": "e12",
"properties": {
"user_name": "passert.Hash(out)/passert.hashFn",
"output_info": [
{
"user_name": "bogus",
"output_name": "bogus",
"encoding": {
"@type": "kind:windowed_value",
"component_encodings": [
{
"@type": "kind:bytes"
},
{
"@type": "kind:global_window"
}
],
"is_wrapper": true
}
}
],
"parallel_input": {
"@type": "OutputReference",
"step_name": "e11",
"output_name": "i0"
},
"serialized_fn": "e12"
}
}
],
"type": "JOB_TYPE_BATCH"
}
2018/09/10 12:03:08 Submitted job: 2018-09-10_05_03_07-13275799599656784250
2018/09/10 12:03:08 Console: https://console.cloud.google.com/dataflow/job/2018-09-10_05_03_07-13275799599656784250?project=apache-beam-testing
2018/09/10 12:03:08 Logs: https://console.cloud.google.com/logs/viewer?project=apache-beam-testing&resource=dataflow_step%2Fjob_id%2F2018-09-10_05_03_07-13275799599656784250
2018/09/10 12:03:08 Submitted job: 2018-09-10_05_03_07-5124214710300785918
2018/09/10 12:03:08 Console: https://console.cloud.google.com/dataflow/job/2018-09-10_05_03_07-5124214710300785918?project=apache-beam-testing
2018/09/10 12:03:08 Logs: https://console.cloud.google.com/logs/viewer?project=apache-beam-testing&resource=dataflow_step%2Fjob_id%2F2018-09-10_05_03_07-5124214710300785918
2018/09/10 12:03:08 Job state: JOB_STATE_PENDING ...
2018/09/10 12:03:08 Job state: JOB_STATE_PENDING ...
2018/09/10 12:03:08 Submitted job: 2018-09-10_05_03_07-1810214652153239953
2018/09/10 12:03:08 Console: https://console.cloud.google.com/dataflow/job/2018-09-10_05_03_07-1810214652153239953?project=apache-beam-testing
2018/09/10 12:03:08 Logs: https://console.cloud.google.com/logs/viewer?project=apache-beam-testing&resource=dataflow_step%2Fjob_id%2F2018-09-10_05_03_07-1810214652153239953
2018/09/10 12:03:08 Job state: JOB_STATE_PENDING ...
2018/09/10 12:03:08 Submitted job: 2018-09-10_05_03_07-3681109822383613294
2018/09/10 12:03:08 Console: https://console.cloud.google.com/dataflow/job/2018-09-10_05_03_07-3681109822383613294?project=apache-beam-testing
2018/09/10 12:03:08 Logs: https://console.cloud.google.com/logs/viewer?project=apache-beam-testing&resource=dataflow_step%2Fjob_id%2F2018-09-10_05_03_07-3681109822383613294
2018/09/10 12:03:08 Submitted job: 2018-09-10_05_03_07-3390706347143603152
2018/09/10 12:03:08 Console: https://console.cloud.google.com/dataflow/job/2018-09-10_05_03_07-3390706347143603152?project=apache-beam-testing
2018/09/10 12:03:08 Logs: https://console.cloud.google.com/logs/viewer?project=apache-beam-testing&resource=dataflow_step%2Fjob_id%2F2018-09-10_05_03_07-3390706347143603152
2018/09/10 12:03:08 Job state: JOB_STATE_PENDING ...
2018/09/10 12:03:08 Job state: JOB_STATE_PENDING ...
2018/09/10 12:03:38 Job still running ...
2018/09/10 12:03:38 Job still running ...
2018/09/10 12:03:38 Job still running ...
2018/09/10 12:03:38 Job still running ...
2018/09/10 12:03:38 Job still running ...
2018/09/10 12:04:08 Job still running ...
2018/09/10 12:04:08 Job still running ...
2018/09/10 12:04:08 Job still running ...
2018/09/10 12:04:08 Job still running ...
2018/09/10 12:04:08 Job still running ...
2018/09/10 12:04:38 Job still running ...
2018/09/10 12:04:38 Job still running ...
2018/09/10 12:04:38 Job still running ...
2018/09/10 12:04:38 Job still running ...
2018/09/10 12:04:38 Job still running ...
2018/09/10 12:05:08 Job still running ...
2018/09/10 12:05:08 Job still running ...
2018/09/10 12:05:08 Job still running ...
2018/09/10 12:05:08 Job still running ...
2018/09/10 12:05:08 Job still running ...
2018/09/10 12:05:38 Job still running ...
2018/09/10 12:05:38 Job still running ...
2018/09/10 12:05:38 Job still running ...
2018/09/10 12:05:38 Job still running ...
2018/09/10 12:05:39 Job still running ...
2018/09/10 12:06:08 Job succeeded!
2018/09/10 12:06:08 Test pardo:multioutput completed
2018/09/10 12:06:08 Job succeeded!
2018/09/10 12:06:08 Test flatten:flatten completed
2018/09/10 12:06:08 Job still running ...
2018/09/10 12:06:09 Job succeeded!
2018/09/10 12:06:09 Test wordcount:memfs completed
2018/09/10 12:06:09 Job succeeded!
2018/09/10 12:06:09 Test wordcount:kinglear completed
2018/09/10 12:06:38 Job succeeded!
2018/09/10 12:06:38 Test cogbk:cogbk completed
2018/09/10 12:06:38 Result: all tests passed!
# TODO(herohde) 5/9/2018: run other runner tests here to reuse the container image?
# Delete the container locally and remotely
docker rmi $CONTAINER:$TAG || echo "Failed to remove container"
Untagged: us.gcr.io/apache-beam-testing/jenkins/go:20180910-120210
Untagged: us.gcr.io/apache-beam-testing/jenkins/go@sha256:82fdf17f49d5589876ee5d8a2eb8115f49e7f0c3ef5e4a0a54c7ab0302de03df
Deleted: sha256:a9e0c8e18c74db1887e1cd7ccd2e6ce2e641d8b57086b3767d19f61f80dae880
Deleted: sha256:3923853c872454fff70921c12a08414867d98f38bfa457566271fadd7b753fba
Deleted: sha256:a0af7e21d838c19c99bd401b1e04c04d578fb8a42f17523efd513fa2b00f6855
Deleted: sha256:00e0f2e35a6ddb99f92984a362c856cf8a163f051820cff967e4eed960dd3c5e
Deleted: sha256:096bab38fc1a7559b2c197cc491547ab8b319a44fd329125bcef55274d8f5469
Deleted: sha256:d864f4cae52ebe750bf48701ad90694e69e9f74ee35a43d036e7d268a9a91101
gcloud --quiet container images delete $CONTAINER:$TAG || echo "Failed to delete container"
Digests:
- us.gcr.io/apache-beam-testing/jenkins/go@sha256:82fdf17f49d5589876ee5d8a2eb8115f49e7f0c3ef5e4a0a54c7ab0302de03df
Associated tags:
- 20180910-120210
Tags:
- us.gcr.io/apache-beam-testing/jenkins/go:20180910-120210
Deleted [us.gcr.io/apache-beam-testing/jenkins/go:20180910-120210].
Deleted [us.gcr.io/apache-beam-testing/jenkins/go@sha256:82fdf17f49d5589876ee5d8a2eb8115f49e7f0c3ef5e4a0a54c7ab0302de03df].
# Clean up tempdir
rm -rf $TMPDIR
>>> SUCCESS
echo ">>> SUCCESS"
:goIntegrationTests (Thread[Task worker for ':',5,main]) completed. Took 4 mins 31.655 secs.
FAILURE: Build failed with an exception.
* What went wrong:
Execution failed for task ':beam-sdks-go:test'.
> There are 1 failed tests. Please see <https://builds.apache.org/job/beam_PostCommit_Go_GradleBuild/ws/src/sdks/go/.gogradle/reports/test/index.html> for more details.
* Try:
Run with --stacktrace option to get the stack trace. Run with --debug option to get more log output. Run with --scan to get full insights.
* Get more help at https://help.gradle.org
Deprecated Gradle features were used in this build, making it incompatible with Gradle 5.0.
See https://docs.gradle.org/4.8/userguide/command_line_interface.html#sec:command_line_warnings
BUILD FAILED in 6m 31s
44 actionable tasks: 44 executed
Publishing build scan...
https://gradle.com/s/2y4p3rkkgekks
Build step 'Invoke Gradle script' changed build result to FAILURE
Build step 'Invoke Gradle script' marked build as failure