You are viewing a plain text version of this content. The canonical link for it is here.
Posted to dev@oozie.apache.org by Apache Jenkins Server <je...@builds.apache.org> on 2016/08/12 11:10:48 UTC

Build failed in Jenkins: oozie-trunk-precommit-build #3222

See <https://builds.apache.org/job/oozie-trunk-precommit-build/3222/>

------------------------------------------
[...truncated 5751 lines...]
[INFO] ------------------------------------------------------------------------
[INFO] Building Apache Oozie Docs 4.3.0-SNAPSHOT
[INFO] ------------------------------------------------------------------------
[INFO] 
[INFO] --- maven-remote-resources-plugin:1.5:process (default) @ oozie-docs ---
[INFO] 
[INFO] --- maven-resources-plugin:2.5:resources (default-resources) @ oozie-docs ---
[debug] execute contextualize
[INFO] Using 'UTF-8' encoding to copy filtered resources.
[INFO] skip non existing resourceDirectory <https://builds.apache.org/job/oozie-trunk-precommit-build/ws/docs/src/main/resources>
[INFO] Copying 3 resources
[INFO] 
[INFO] --- maven-compiler-plugin:2.3.2:compile (default-compile) @ oozie-docs ---
[INFO] Nothing to compile - all classes are up to date
[INFO] 
[INFO] --- maven-resources-plugin:2.5:testResources (default-testResources) @ oozie-docs ---
[debug] execute contextualize
[INFO] Using 'UTF-8' encoding to copy filtered resources.
[INFO] skip non existing resourceDirectory <https://builds.apache.org/job/oozie-trunk-precommit-build/ws/docs/src/test/resources>
[INFO] Copying 3 resources
[INFO] 
[INFO] --- maven-compiler-plugin:2.3.2:testCompile (default-testCompile) @ oozie-docs ---
[INFO] No sources to compile
[INFO] 
[INFO] --- maven-surefire-plugin:2.12.2:test (default-test) @ oozie-docs ---
[INFO] Tests are skipped.
[INFO] 
[INFO] --- maven-site-plugin:2.0-beta-6:site (default) @ oozie-docs ---
[INFO] Unable to load parent project from a relative path: 1 problem was encountered while building the effective model
[FATAL] Non-readable POM <https://builds.apache.org/job/oozie-trunk-precommit-build/ws/../pom.xml>: <https://builds.apache.org/job/oozie-trunk-precommit-build/ws/../pom.xml> (No such file or directory) @ 
 for project  at <https://builds.apache.org/job/oozie-trunk-precommit-build/ws/../pom.xml> for project  at <https://builds.apache.org/job/oozie-trunk-precommit-build/ws/../pom.xml>
[INFO] Parent project loaded from repository.
[INFO] 
[INFO] --- maven-war-plugin:2.4:war (default-war) @ oozie-docs ---
[INFO] Packaging webapp
[INFO] Assembling webapp [oozie-docs] in [<https://builds.apache.org/job/oozie-trunk-precommit-build/ws/docs/target/oozie-docs-4.3.0-SNAPSHOT]>
[INFO] Processing war project
[INFO] Copying webapp webResources [<https://builds.apache.org/job/oozie-trunk-precommit-build/ws/docs/target/site]> to [<https://builds.apache.org/job/oozie-trunk-precommit-build/ws/docs/target/oozie-docs-4.3.0-SNAPSHOT]>
[INFO] Copying webapp webResources [<https://builds.apache.org/job/oozie-trunk-precommit-build/ws/docs/../client/target/site]> to [<https://builds.apache.org/job/oozie-trunk-precommit-build/ws/docs/target/oozie-docs-4.3.0-SNAPSHOT]>
[INFO] Copying webapp webResources [<https://builds.apache.org/job/oozie-trunk-precommit-build/ws/docs/../core/target/site]> to [<https://builds.apache.org/job/oozie-trunk-precommit-build/ws/docs/target/oozie-docs-4.3.0-SNAPSHOT]>
[INFO] Copying webapp webResources [<https://builds.apache.org/job/oozie-trunk-precommit-build/ws/docs/..]> to [<https://builds.apache.org/job/oozie-trunk-precommit-build/ws/docs/target/oozie-docs-4.3.0-SNAPSHOT]>
[INFO] Copying webapp webResources [<https://builds.apache.org/job/oozie-trunk-precommit-build/ws/docs/../core/src/main/resources]> to [<https://builds.apache.org/job/oozie-trunk-precommit-build/ws/docs/target/oozie-docs-4.3.0-SNAPSHOT]>
[INFO] Copying webapp resources [<https://builds.apache.org/job/oozie-trunk-precommit-build/ws/docs/src/main/webapp]>
[INFO] Webapp assembled in [1871 msecs]
[INFO] Building war: <https://builds.apache.org/job/oozie-trunk-precommit-build/ws/docs/target/oozie-docs-4.3.0-SNAPSHOT.war>
[INFO] 
[INFO] --- maven-site-plugin:2.0-beta-6:attach-descriptor (attach-descriptor) @ oozie-docs ---
[INFO] 
[INFO] --- maven-assembly-plugin:2.2.1:single (default-cli) @ oozie-docs ---
[INFO] Reading assembly descriptor: ../src/main/assemblies/docs.xml
[INFO] Building zip: <https://builds.apache.org/job/oozie-trunk-precommit-build/ws/docs/target/oozie-docs-4.3.0-SNAPSHOT-docs.zip>
[INFO]                                                                         
[INFO] ------------------------------------------------------------------------
[INFO] Building Apache Oozie WebApp 4.3.0-SNAPSHOT
[INFO] ------------------------------------------------------------------------
[INFO] 
[INFO] --- maven-remote-resources-plugin:1.5:process (default) @ oozie-webapp ---
[INFO] 
[INFO] --- maven-resources-plugin:2.5:resources (default-resources) @ oozie-webapp ---
[debug] execute contextualize
[INFO] Using 'UTF-8' encoding to copy filtered resources.
[INFO] Copying 1 resource
[INFO] Copying 3 resources
[INFO] 
[INFO] --- maven-compiler-plugin:2.3.2:compile (default-compile) @ oozie-webapp ---
[INFO] No sources to compile
[INFO] 
[INFO] --- maven-resources-plugin:2.5:testResources (default-testResources) @ oozie-webapp ---
[debug] execute contextualize
[INFO] Using 'UTF-8' encoding to copy filtered resources.
[INFO] skip non existing resourceDirectory <https://builds.apache.org/job/oozie-trunk-precommit-build/ws/webapp/src/test/resources>
[INFO] Copying 3 resources
[INFO] 
[INFO] --- maven-compiler-plugin:2.3.2:testCompile (default-testCompile) @ oozie-webapp ---
[INFO] No sources to compile
[INFO] 
[INFO] --- maven-surefire-plugin:2.12.2:test (default-test) @ oozie-webapp ---
[INFO] Tests are skipped.
[INFO] 
[INFO] --- maven-dependency-plugin:2.4:copy (copy-sharelib) @ oozie-webapp ---
[INFO] Configured Artifact: org.apache.oozie:oozie-sharelib-pig:?:jar
[INFO] Configured Artifact: org.apache.oozie:oozie-sharelib-hive:?:jar
[INFO] Configured Artifact: org.apache.oozie:oozie-sharelib-sqoop:?:jar
[INFO] Configured Artifact: org.apache.oozie:oozie-sharelib-streaming:?:jar
[INFO] Configured Artifact: org.apache.oozie:oozie-sharelib-oozie:?:jar
[INFO] Configured Artifact: org.apache.oozie:oozie-sharelib-hcatalog:?:jar
[INFO] Configured Artifact: org.apache.oozie:oozie-sharelib-distcp:?:jar
[INFO] Configured Artifact: org.apache.oozie:oozie-sharelib-hive2:?:jar
[INFO] Configured Artifact: org.apache.oozie:oozie-sharelib-spark:?:jar
[INFO] Copying oozie-sharelib-pig-4.3.0-SNAPSHOT.jar to <https://builds.apache.org/job/oozie-trunk-precommit-build/ws/webapp/target/oozie-webapp-4.3.0-SNAPSHOT/WEB-INF/lib/oozie-sharelib-pig-4.3.0-SNAPSHOT.jar>
[INFO] Copying oozie-sharelib-hive-4.3.0-SNAPSHOT.jar to <https://builds.apache.org/job/oozie-trunk-precommit-build/ws/webapp/target/oozie-webapp-4.3.0-SNAPSHOT/WEB-INF/lib/oozie-sharelib-hive-4.3.0-SNAPSHOT.jar>
[INFO] Copying oozie-sharelib-sqoop-4.3.0-SNAPSHOT.jar to <https://builds.apache.org/job/oozie-trunk-precommit-build/ws/webapp/target/oozie-webapp-4.3.0-SNAPSHOT/WEB-INF/lib/oozie-sharelib-sqoop-4.3.0-SNAPSHOT.jar>
[INFO] Copying oozie-sharelib-streaming-4.3.0-SNAPSHOT.jar to <https://builds.apache.org/job/oozie-trunk-precommit-build/ws/webapp/target/oozie-webapp-4.3.0-SNAPSHOT/WEB-INF/lib/oozie-sharelib-streaming-4.3.0-SNAPSHOT.jar>
[INFO] Copying oozie-sharelib-oozie-4.3.0-SNAPSHOT.jar to <https://builds.apache.org/job/oozie-trunk-precommit-build/ws/webapp/target/oozie-webapp-4.3.0-SNAPSHOT/WEB-INF/lib/oozie-sharelib-oozie-4.3.0-SNAPSHOT.jar>
[INFO] Copying oozie-sharelib-hcatalog-4.3.0-SNAPSHOT.jar to <https://builds.apache.org/job/oozie-trunk-precommit-build/ws/webapp/target/oozie-webapp-4.3.0-SNAPSHOT/WEB-INF/lib/oozie-sharelib-hcatalog-4.3.0-SNAPSHOT.jar>
[INFO] Copying oozie-sharelib-distcp-4.3.0-SNAPSHOT.jar to <https://builds.apache.org/job/oozie-trunk-precommit-build/ws/webapp/target/oozie-webapp-4.3.0-SNAPSHOT/WEB-INF/lib/oozie-sharelib-distcp-4.3.0-SNAPSHOT.jar>
[INFO] Copying oozie-sharelib-hive2-4.3.0-SNAPSHOT.jar to <https://builds.apache.org/job/oozie-trunk-precommit-build/ws/webapp/target/oozie-webapp-4.3.0-SNAPSHOT/WEB-INF/lib/oozie-sharelib-hive2-4.3.0-SNAPSHOT.jar>
[INFO] Copying oozie-sharelib-spark-4.3.0-SNAPSHOT.jar to <https://builds.apache.org/job/oozie-trunk-precommit-build/ws/webapp/target/oozie-webapp-4.3.0-SNAPSHOT/WEB-INF/lib/oozie-sharelib-spark-4.3.0-SNAPSHOT.jar>
[INFO] 
[INFO] --- maven-project-info-reports-plugin:2.3:dependencies (default) @ oozie-webapp ---
[INFO] 
[INFO] --- maven-war-plugin:2.4:war (default-war) @ oozie-webapp ---
[INFO] Packaging webapp
[INFO] Assembling webapp [oozie-webapp] in [<https://builds.apache.org/job/oozie-trunk-precommit-build/ws/webapp/target/oozie-webapp-4.3.0-SNAPSHOT]>
[INFO] Processing war project
[INFO] Copying webapp webResources [<https://builds.apache.org/job/oozie-trunk-precommit-build/ws/webapp/target/site]> to [<https://builds.apache.org/job/oozie-trunk-precommit-build/ws/webapp/target/oozie-webapp-4.3.0-SNAPSHOT]>
[INFO] Copying webapp resources [<https://builds.apache.org/job/oozie-trunk-precommit-build/ws/webapp/src/main/webapp]>
[INFO] Processing overlay [ id org.apache.oozie:oozie-docs]
[INFO] Webapp assembled in [1994 msecs]
[INFO] Building war: <https://builds.apache.org/job/oozie-trunk-precommit-build/ws/webapp/target/oozie-webapp-4.3.0-SNAPSHOT.war>
[INFO] 
[INFO] --- maven-site-plugin:2.0-beta-6:attach-descriptor (attach-descriptor) @ oozie-webapp ---
[INFO] 
[INFO] --- maven-assembly-plugin:2.2.1:single (default-cli) @ oozie-webapp ---
[INFO] Reading assembly descriptor: ../src/main/assemblies/empty.xml
[INFO]                                                                         
[INFO] ------------------------------------------------------------------------
[INFO] Building Apache Oozie Tools 4.3.0-SNAPSHOT
[INFO] ------------------------------------------------------------------------
[INFO] 
[INFO] --- maven-remote-resources-plugin:1.5:process (default) @ oozie-tools ---
[INFO] 
[INFO] --- maven-resources-plugin:2.5:resources (default-resources) @ oozie-tools ---
[debug] execute contextualize
[INFO] Using 'UTF-8' encoding to copy filtered resources.
[INFO] skip non existing resourceDirectory <https://builds.apache.org/job/oozie-trunk-precommit-build/ws/tools/src/main/resources>
[INFO] Copying 3 resources
[INFO] 
[INFO] --- maven-compiler-plugin:2.3.2:compile (default-compile) @ oozie-tools ---
[INFO] Nothing to compile - all classes are up to date
[INFO] 
[INFO] --- maven-resources-plugin:2.5:testResources (default-testResources) @ oozie-tools ---
[debug] execute contextualize
[INFO] Using 'UTF-8' encoding to copy filtered resources.
[INFO] Copying 10 resources
[INFO] Copying 3 resources
[INFO] 
[INFO] --- maven-compiler-plugin:2.3.2:testCompile (default-testCompile) @ oozie-tools ---
[INFO] Compiling 7 source files to <https://builds.apache.org/job/oozie-trunk-precommit-build/ws/tools/target/test-classes>
[INFO] -------------------------------------------------------------
[ERROR] COMPILATION ERROR : 
[INFO] -------------------------------------------------------------
[ERROR] <https://builds.apache.org/job/oozie-trunk-precommit-build/ws/tools/src/test/java/org/apache/oozie/tools/TestDbLoadDump.java>:[45,7] error: class TestDBLoadDump is public, should be declared in a file named TestDBLoadDump.java
[INFO] 1 error
[INFO] -------------------------------------------------------------
[INFO] ------------------------------------------------------------------------
[INFO] Reactor Summary:
[INFO] 
[INFO] Apache Oozie Main .................................. SUCCESS [  1.613 s]
[INFO] Apache Oozie Hadoop Utils .......................... SUCCESS [  0.815 s]
[INFO] Apache Oozie Hadoop Distcp hadoop-1-4.3.0-SNAPSHOT . SUCCESS [  0.128 s]
[INFO] Apache Oozie Hadoop Auth hadoop-1-4.3.0-SNAPSHOT ... SUCCESS [  0.243 s]
[INFO] Apache Oozie Hadoop Libs ........................... SUCCESS [  0.030 s]
[INFO] Apache Oozie Client ................................ SUCCESS [ 28.589 s]
[INFO] Apache Oozie Share Lib Oozie ....................... SUCCESS [  1.047 s]
[INFO] Apache Oozie Share Lib HCatalog .................... SUCCESS [  1.461 s]
[INFO] Apache Oozie Share Lib Distcp ...................... SUCCESS [  0.265 s]
[INFO] Apache Oozie Core .................................. SUCCESS [ 35.639 s]
[INFO] Apache Oozie Share Lib Streaming ................... SUCCESS [  2.081 s]
[INFO] Apache Oozie Share Lib Pig ......................... SUCCESS [  1.116 s]
[INFO] Apache Oozie Share Lib Hive ........................ SUCCESS [  3.082 s]
[INFO] Apache Oozie Share Lib Hive 2 ...................... SUCCESS [  2.544 s]
[INFO] Apache Oozie Share Lib Sqoop ....................... SUCCESS [  0.532 s]
[INFO] Apache Oozie Examples .............................. SUCCESS [  2.306 s]
[INFO] Apache Oozie Share Lib Spark ....................... SUCCESS [  5.950 s]
[INFO] Apache Oozie Share Lib ............................. SUCCESS [ 18.661 s]
[INFO] Apache Oozie Docs .................................. SUCCESS [ 11.929 s]
[INFO] Apache Oozie WebApp ................................ SUCCESS [ 28.220 s]
[INFO] Apache Oozie Tools ................................. FAILURE [  1.851 s]
[INFO] Apache Oozie MiniOozie ............................. SKIPPED
[INFO] Apache Oozie Distro ................................ SKIPPED
[INFO] Apache Oozie ZooKeeper Security Tests .............. SKIPPED
[INFO] ------------------------------------------------------------------------
[INFO] BUILD FAILURE
[INFO] ------------------------------------------------------------------------
[INFO] Total time: 02:30 min
[INFO] Finished at: 2016-08-12T11:10:28+00:00
[INFO] Final Memory: 87M/1015M
[INFO] ------------------------------------------------------------------------
[ERROR] Failed to execute goal org.apache.maven.plugins:maven-compiler-plugin:2.3.2:testCompile (default-testCompile) on project oozie-tools: Compilation failure
[ERROR] <https://builds.apache.org/job/oozie-trunk-precommit-build/ws/tools/src/test/java/org/apache/oozie/tools/TestDbLoadDump.java>:[45,7] error: class TestDBLoadDump is public, should be declared in a file named TestDBLoadDump.java
[ERROR] -> [Help 1]
[ERROR] 
[ERROR] To see the full stack trace of the errors, re-run Maven with the -e switch.
[ERROR] Re-run Maven using the -X switch to enable full debug logging.
[ERROR] 
[ERROR] For more information about the errors and possible solutions, please read the following articles:
[ERROR] [Help 1] http://cwiki.apache.org/confluence/display/MAVEN/MojoFailureException
[ERROR] 
[ERROR] After correcting the problems, you can resume the build with the command
[ERROR]   mvn <goals> -rf :oozie-tools

Reports
  Running test-patch task CLEAN
  Running test-patch task RAW_PATCH_ANALYSIS
  Running test-patch task RAT
  Running test-patch task JAVADOC
  Running test-patch task COMPILE
  Running test-patch task BACKWARDS_COMPATIBILITY
  Running test-patch task TESTS
  Running test-patch task DISTRO


Testing JIRA OOZIE-2632

Cleaning local git workspace

----------------------------

+1 PATCH_APPLIES
+1 CLEAN
-1 RAW_PATCH_ANALYSIS
    +1 the patch does not introduce any @author tags
    +1 the patch does not introduce any tabs
    +1 the patch does not introduce any trailing spaces
    -1 the patch contains 12 line(s) longer than 132 characters
    +1 the patch does adds/modifies 5 testcase(s)
-1 RAT
    -1 the patch seems to introduce 8 new RAT warning(s)
+1 JAVADOC
    +1 the patch does not seem to introduce new Javadoc warnings
-1 COMPILE
    +1 HEAD compiles
    -1 patch does not compile
    +1 the patch does not seem to introduce new javac warnings
+1 BACKWARDS_COMPATIBILITY
    +1 the patch does not change any JPA Entity/Colum/Basic/Lob/Transient annotations
    +1 the patch does not modify JPA files
-1 TESTS - patch does not compile, cannot run testcases
-1 DISTRO
    -1 distro tarball fails with the patch

----------------------------
-1 Overall result, please check the reported -1(s)


The full output of the test-patch run is available at

   https://builds.apache.org/job/oozie-trunk-precommit-build/3222/

Adding comment to JIRA
Comment added.

test-patch exit code: 1

Build step 'Execute shell' marked build as failure
Archiving artifacts
Compressed 545.19 KB of artifacts by 29.3% relative to #3212
Recording test results

Jenkins build is back to normal : oozie-trunk-precommit-build #3233

Posted by Apache Jenkins Server <je...@builds.apache.org>.
See <https://builds.apache.org/job/oozie-trunk-precommit-build/3233/>


Build failed in Jenkins: oozie-trunk-precommit-build #3232

Posted by Apache Jenkins Server <je...@builds.apache.org>.
See <https://builds.apache.org/job/oozie-trunk-precommit-build/3232/>

------------------------------------------
[...truncated 6460 lines...]
[INFO] --- maven-compiler-plugin:2.3.2:compile (default-compile) @ oozie-tools ---
[INFO] Nothing to compile - all classes are up to date
[INFO] 
[INFO] --- maven-resources-plugin:2.5:testResources (default-testResources) @ oozie-tools ---
[debug] execute contextualize
[INFO] Using 'UTF-8' encoding to copy filtered resources.
[INFO] Copying 2 resources
[INFO] Copying 3 resources
[INFO] 
[INFO] --- maven-compiler-plugin:2.3.2:testCompile (default-testCompile) @ oozie-tools ---
[INFO] Nothing to compile - all classes are up to date
[INFO] 
[INFO] --- maven-surefire-plugin:2.12.2:test (default-test) @ oozie-tools ---
[INFO] Tests are skipped.
[INFO] 
[INFO] --- maven-jar-plugin:2.3.1:jar (default-jar) @ oozie-tools ---
[INFO] Building jar: <https://builds.apache.org/job/oozie-trunk-precommit-build/ws/tools/target/oozie-tools-4.3.0-SNAPSHOT.jar>
[INFO] 
[INFO] --- maven-site-plugin:2.0-beta-6:attach-descriptor (attach-descriptor) @ oozie-tools ---
[INFO] 
[INFO] --- maven-assembly-plugin:2.2.1:single (default-cli) @ oozie-tools ---
[INFO] Reading assembly descriptor: ../src/main/assemblies/tools.xml
[WARNING] The following patterns were never triggered in this artifact exclusion filter:
o  '*:*:pom:*'

[INFO] Copying files to <https://builds.apache.org/job/oozie-trunk-precommit-build/ws/tools/target/oozie-tools-4.3.0-SNAPSHOT-tools>
[WARNING] Assembly file: <https://builds.apache.org/job/oozie-trunk-precommit-build/ws/tools/target/oozie-tools-4.3.0-SNAPSHOT-tools> is not a regular file (it may be a directory). It cannot be attached to the project build for installation or deployment.
[INFO]                                                                         
[INFO] ------------------------------------------------------------------------
[INFO] Building Apache Oozie MiniOozie 4.3.0-SNAPSHOT
[INFO] ------------------------------------------------------------------------
[INFO] 
[INFO] --- maven-remote-resources-plugin:1.5:process (default) @ oozie-mini ---
[INFO] 
[INFO] --- maven-resources-plugin:2.5:resources (default-resources) @ oozie-mini ---
[debug] execute contextualize
[INFO] Using 'UTF-8' encoding to copy filtered resources.
[INFO] skip non existing resourceDirectory <https://builds.apache.org/job/oozie-trunk-precommit-build/ws/minitest/src/main/resources>
[INFO] Copying 3 resources
[INFO] 
[INFO] --- maven-compiler-plugin:2.3.2:compile (default-compile) @ oozie-mini ---
[INFO] No sources to compile
[INFO] 
[INFO] --- maven-resources-plugin:2.5:testResources (default-testResources) @ oozie-mini ---
[debug] execute contextualize
[INFO] Using 'UTF-8' encoding to copy filtered resources.
[INFO] Copying 3 resources
[INFO] Copying 3 resources
[INFO] 
[INFO] --- maven-compiler-plugin:2.3.2:testCompile (default-testCompile) @ oozie-mini ---
[INFO] Nothing to compile - all classes are up to date
[INFO] 
[INFO] --- maven-surefire-plugin:2.12.2:test (default-test) @ oozie-mini ---
[INFO] Tests are skipped.
[INFO] 
[INFO] --- maven-jar-plugin:2.3.1:jar (default-jar) @ oozie-mini ---
[INFO] Building jar: <https://builds.apache.org/job/oozie-trunk-precommit-build/ws/minitest/target/oozie-mini-4.3.0-SNAPSHOT.jar>
[INFO] 
[INFO] --- maven-site-plugin:2.0-beta-6:attach-descriptor (attach-descriptor) @ oozie-mini ---
[INFO] 
[INFO] --- maven-assembly-plugin:2.2.1:single (default-cli) @ oozie-mini ---
[INFO] Reading assembly descriptor: src/main/assemblies/empty.xml
[INFO]                                                                         
[INFO] ------------------------------------------------------------------------
[INFO] Building Apache Oozie Distro 4.3.0-SNAPSHOT
[INFO] ------------------------------------------------------------------------
[INFO] 
[INFO] --- maven-remote-resources-plugin:1.5:process (default) @ oozie-distro ---
[INFO] 
[INFO] --- maven-resources-plugin:2.5:resources (default-resources) @ oozie-distro ---
[debug] execute contextualize
[INFO] Using 'UTF-8' encoding to copy filtered resources.
[INFO] skip non existing resourceDirectory <https://builds.apache.org/job/oozie-trunk-precommit-build/ws/distro/src/main/resources>
[INFO] Copying 3 resources
[INFO] 
[INFO] --- maven-compiler-plugin:2.3.2:compile (default-compile) @ oozie-distro ---
[INFO] No sources to compile
[INFO] 
[INFO] --- maven-resources-plugin:2.5:testResources (default-testResources) @ oozie-distro ---
[debug] execute contextualize
[INFO] Using 'UTF-8' encoding to copy filtered resources.
[INFO] skip non existing resourceDirectory <https://builds.apache.org/job/oozie-trunk-precommit-build/ws/distro/src/test/resources>
[INFO] Copying 3 resources
[INFO] 
[INFO] --- maven-compiler-plugin:2.3.2:testCompile (default-testCompile) @ oozie-distro ---
[INFO] No sources to compile
[INFO] 
[INFO] --- maven-surefire-plugin:2.12.2:test (default-test) @ oozie-distro ---
[INFO] Tests are skipped.
[INFO] 
[INFO] --- maven-jar-plugin:2.3.1:jar (default-jar) @ oozie-distro ---
[INFO] Building jar: <https://builds.apache.org/job/oozie-trunk-precommit-build/ws/distro/target/oozie-distro-4.3.0-SNAPSHOT.jar>
[INFO] 
[INFO] --- maven-site-plugin:2.0-beta-6:attach-descriptor (attach-descriptor) @ oozie-distro ---
[INFO] 
[INFO] --- maven-antrun-plugin:1.6:run (default) @ oozie-distro ---
[INFO] Executing tasks

main:
      [get] Getting: http://archive.apache.org/dist/tomcat/tomcat-6/v6.0.44/bin/apache-tomcat-6.0.44.tar.gz
      [get] To: <https://builds.apache.org/job/oozie-trunk-precommit-build/ws/distro/downloads/tomcat-6.0.44.tar.gz>
..........................................................................................................................................................................................................................................................................................................................................
    [mkdir] Created dir: <https://builds.apache.org/job/oozie-trunk-precommit-build/ws/distro/target/tomcat>
   [gunzip] Expanding <https://builds.apache.org/job/oozie-trunk-precommit-build/ws/distro/downloads/tomcat-6.0.44.tar.gz> to <https://builds.apache.org/job/oozie-trunk-precommit-build/ws/distro/target/tomcat/tomcat-6.0.44.tar>
    [untar] Expanding: <https://builds.apache.org/job/oozie-trunk-precommit-build/ws/distro/target/tomcat/tomcat-6.0.44.tar> into <https://builds.apache.org/job/oozie-trunk-precommit-build/ws/distro/target/tomcat>
   [delete] Deleting directory <https://builds.apache.org/job/oozie-trunk-precommit-build/ws/distro/target/tomcat/oozie-server/webapps>
    [mkdir] Created dir: <https://builds.apache.org/job/oozie-trunk-precommit-build/ws/distro/target/tomcat/oozie-server/webapps>
   [delete] Deleting: <https://builds.apache.org/job/oozie-trunk-precommit-build/ws/distro/target/tomcat/oozie-server/conf/server.xml>
     [copy] Copying 1 file to <https://builds.apache.org/job/oozie-trunk-precommit-build/ws/distro/target/tomcat/oozie-server/conf>
     [copy] Copying 1 file to <https://builds.apache.org/job/oozie-trunk-precommit-build/ws/distro/target/tomcat/oozie-server/conf>
    [mkdir] Created dir: <https://builds.apache.org/job/oozie-trunk-precommit-build/ws/distro/target/tomcat/oozie-server/conf/ssl>
     [copy] Copying 1 file to <https://builds.apache.org/job/oozie-trunk-precommit-build/ws/distro/target/tomcat/oozie-server/conf/ssl>
     [copy] Copying 1 file to <https://builds.apache.org/job/oozie-trunk-precommit-build/ws/distro/target/tomcat/oozie-server/conf/ssl>
     [copy] Copying 1 file to <https://builds.apache.org/job/oozie-trunk-precommit-build/ws/distro/target/tomcat/oozie-server/conf/ssl>
     [copy] Copying 3 files to <https://builds.apache.org/job/oozie-trunk-precommit-build/ws/distro/target/tomcat/oozie-server/webapps/ROOT>
[INFO] Executed tasks
[INFO] 
[INFO] --- maven-assembly-plugin:2.2.1:single (default-cli) @ oozie-distro ---
[INFO] Reading assembly descriptor: ../src/main/assemblies/distro.xml
[INFO] Copying files to <https://builds.apache.org/job/oozie-trunk-precommit-build/ws/distro/target/oozie-4.3.0-SNAPSHOT-distro>
[WARNING] Assembly file: <https://builds.apache.org/job/oozie-trunk-precommit-build/ws/distro/target/oozie-4.3.0-SNAPSHOT-distro> is not a regular file (it may be a directory). It cannot be attached to the project build for installation or deployment.
[INFO] Building tar : <https://builds.apache.org/job/oozie-trunk-precommit-build/ws/distro/target/oozie-4.3.0-SNAPSHOT-distro.tar.gz>
[INFO]                                                                         
[INFO] ------------------------------------------------------------------------
[INFO] Building Apache Oozie ZooKeeper Security Tests 4.3.0-SNAPSHOT
[INFO] ------------------------------------------------------------------------
[INFO] 
[INFO] --- maven-remote-resources-plugin:1.5:process (default) @ oozie-zookeeper-security-tests ---
[INFO] 
[INFO] --- maven-resources-plugin:2.5:resources (default-resources) @ oozie-zookeeper-security-tests ---
[debug] execute contextualize
[INFO] Using 'UTF-8' encoding to copy filtered resources.
[INFO] skip non existing resourceDirectory <https://builds.apache.org/job/oozie-trunk-precommit-build/ws/zookeeper-security-tests/src/main/resources>
[INFO] Copying 3 resources
[INFO] 
[INFO] --- maven-compiler-plugin:2.3.2:compile (default-compile) @ oozie-zookeeper-security-tests ---
[INFO] No sources to compile
[INFO] 
[INFO] --- maven-resources-plugin:2.5:testResources (default-testResources) @ oozie-zookeeper-security-tests ---
[debug] execute contextualize
[INFO] Using 'UTF-8' encoding to copy filtered resources.
[INFO] skip non existing resourceDirectory <https://builds.apache.org/job/oozie-trunk-precommit-build/ws/zookeeper-security-tests/src/test/resources>
[INFO] Copying 3 resources
[INFO] 
[INFO] --- maven-compiler-plugin:2.3.2:testCompile (default-testCompile) @ oozie-zookeeper-security-tests ---
[INFO] Nothing to compile - all classes are up to date
[INFO] 
[INFO] --- maven-surefire-plugin:2.12.2:test (default-test) @ oozie-zookeeper-security-tests ---
[INFO] Tests are skipped.
[INFO] 
[INFO] --- maven-jar-plugin:2.3.1:jar (default-jar) @ oozie-zookeeper-security-tests ---
[INFO] Building jar: <https://builds.apache.org/job/oozie-trunk-precommit-build/ws/zookeeper-security-tests/target/oozie-zookeeper-security-tests-4.3.0-SNAPSHOT.jar>
[INFO] 
[INFO] --- maven-site-plugin:2.0-beta-6:attach-descriptor (attach-descriptor) @ oozie-zookeeper-security-tests ---
[INFO] 
[INFO] --- maven-assembly-plugin:2.2.1:single (default-cli) @ oozie-zookeeper-security-tests ---
[INFO] Reading assembly descriptor: src/main/assemblies/empty.xml
[INFO] ------------------------------------------------------------------------
[INFO] Reactor Summary:
[INFO] 
[INFO] Apache Oozie Main .................................. SUCCESS [  2.104 s]
[INFO] Apache Oozie Hadoop Utils .......................... SUCCESS [  0.784 s]
[INFO] Apache Oozie Hadoop Distcp hadoop-1-4.3.0-SNAPSHOT . SUCCESS [  0.111 s]
[INFO] Apache Oozie Hadoop Auth hadoop-1-4.3.0-SNAPSHOT ... SUCCESS [  0.193 s]
[INFO] Apache Oozie Hadoop Libs ........................... SUCCESS [  0.024 s]
[INFO] Apache Oozie Client ................................ SUCCESS [ 29.912 s]
[INFO] Apache Oozie Share Lib Oozie ....................... SUCCESS [  1.055 s]
[INFO] Apache Oozie Share Lib HCatalog .................... SUCCESS [  1.606 s]
[INFO] Apache Oozie Share Lib Distcp ...................... SUCCESS [  0.254 s]
[INFO] Apache Oozie Core .................................. SUCCESS [ 58.954 s]
[INFO] Apache Oozie Share Lib Streaming ................... SUCCESS [  2.683 s]
[INFO] Apache Oozie Share Lib Pig ......................... SUCCESS [  1.031 s]
[INFO] Apache Oozie Share Lib Hive ........................ SUCCESS [  3.060 s]
[INFO] Apache Oozie Share Lib Hive 2 ...................... SUCCESS [  2.952 s]
[INFO] Apache Oozie Share Lib Sqoop ....................... SUCCESS [  0.699 s]
[INFO] Apache Oozie Examples .............................. SUCCESS [  2.313 s]
[INFO] Apache Oozie Share Lib Spark ....................... SUCCESS [  7.314 s]
[INFO] Apache Oozie Share Lib ............................. SUCCESS [ 19.937 s]
[INFO] Apache Oozie Docs .................................. SUCCESS [ 12.827 s]
[INFO] Apache Oozie WebApp ................................ SUCCESS [ 29.969 s]
[INFO] Apache Oozie Tools ................................. SUCCESS [  0.768 s]
[INFO] Apache Oozie MiniOozie ............................. SUCCESS [  0.363 s]
[INFO] Apache Oozie Distro ................................ SUCCESS [ 43.248 s]
[INFO] Apache Oozie ZooKeeper Security Tests .............. SUCCESS [  2.595 s]
[INFO] ------------------------------------------------------------------------
[INFO] BUILD SUCCESS
[INFO] ------------------------------------------------------------------------
[INFO] Total time: 03:46 min
[INFO] Finished at: 2016-08-18T09:26:53+00:00
[INFO] Final Memory: 76M/970M
[INFO] ------------------------------------------------------------------------

Reports
  Running test-patch task CLEAN
  Running test-patch task RAW_PATCH_ANALYSIS
  Running test-patch task RAT
  Running test-patch task JAVADOC
  Running test-patch task COMPILE
  Running test-patch task BACKWARDS_COMPATIBILITY
  Running test-patch task TESTS
  Running test-patch task DISTRO


Testing JIRA OOZIE-2231

Cleaning local git workspace

----------------------------

+1 PATCH_APPLIES
+1 CLEAN
-1 RAW_PATCH_ANALYSIS
    +1 the patch does not introduce any @author tags
    +1 the patch does not introduce any tabs
    +1 the patch does not introduce any trailing spaces
    +1 the patch does not introduce any line longer than 132
    -1 the patch does not add/modify any testcase
+1 RAT
    +1 the patch does not seem to introduce new RAT warnings
+1 JAVADOC
    +1 the patch does not seem to introduce new Javadoc warnings
+1 COMPILE
    +1 HEAD compiles
    +1 patch compiles
    +1 the patch does not seem to introduce new javac warnings
+1 BACKWARDS_COMPATIBILITY
    +1 the patch does not change any JPA Entity/Colum/Basic/Lob/Transient annotations
    +1 the patch does not modify JPA files
+1 TESTS
    Tests run: 1793
+1 DISTRO
    +1 distro tarball builds with the patch 

----------------------------
-1 Overall result, please check the reported -1(s)


The full output of the test-patch run is available at

   https://builds.apache.org/job/oozie-trunk-precommit-build/3232/

Adding comment to JIRA
Comment added.

test-patch exit code: 1

Build step 'Execute shell' marked build as failure
Archiving artifacts
Recording test results

Build failed in Jenkins: oozie-trunk-precommit-build #3231

Posted by Apache Jenkins Server <je...@builds.apache.org>.
See <https://builds.apache.org/job/oozie-trunk-precommit-build/3231/>

------------------------------------------
[...truncated 6229 lines...]
[INFO] Nothing to compile - all classes are up to date
[INFO] 
[INFO] --- maven-resources-plugin:2.5:testResources (default-testResources) @ oozie-tools ---
[debug] execute contextualize
[INFO] Using 'UTF-8' encoding to copy filtered resources.
[INFO] Copying 2 resources
[INFO] Copying 3 resources
[INFO] 
[INFO] --- maven-compiler-plugin:2.3.2:testCompile (default-testCompile) @ oozie-tools ---
[INFO] Nothing to compile - all classes are up to date
[INFO] 
[INFO] --- maven-surefire-plugin:2.12.2:test (default-test) @ oozie-tools ---
[INFO] Tests are skipped.
[INFO] 
[INFO] --- maven-jar-plugin:2.3.1:jar (default-jar) @ oozie-tools ---
[INFO] Building jar: <https://builds.apache.org/job/oozie-trunk-precommit-build/ws/tools/target/oozie-tools-4.3.0-SNAPSHOT.jar>
[INFO] 
[INFO] --- maven-site-plugin:2.0-beta-6:attach-descriptor (attach-descriptor) @ oozie-tools ---
[INFO] 
[INFO] --- maven-assembly-plugin:2.2.1:single (default-cli) @ oozie-tools ---
[INFO] Reading assembly descriptor: ../src/main/assemblies/tools.xml
[WARNING] The following patterns were never triggered in this artifact exclusion filter:
o  '*:*:pom:*'

[INFO] Copying files to <https://builds.apache.org/job/oozie-trunk-precommit-build/ws/tools/target/oozie-tools-4.3.0-SNAPSHOT-tools>
[WARNING] Assembly file: <https://builds.apache.org/job/oozie-trunk-precommit-build/ws/tools/target/oozie-tools-4.3.0-SNAPSHOT-tools> is not a regular file (it may be a directory). It cannot be attached to the project build for installation or deployment.
[INFO]                                                                         
[INFO] ------------------------------------------------------------------------
[INFO] Building Apache Oozie MiniOozie 4.3.0-SNAPSHOT
[INFO] ------------------------------------------------------------------------
[INFO] 
[INFO] --- maven-remote-resources-plugin:1.5:process (default) @ oozie-mini ---
[INFO] 
[INFO] --- maven-resources-plugin:2.5:resources (default-resources) @ oozie-mini ---
[debug] execute contextualize
[INFO] Using 'UTF-8' encoding to copy filtered resources.
[INFO] skip non existing resourceDirectory <https://builds.apache.org/job/oozie-trunk-precommit-build/ws/minitest/src/main/resources>
[INFO] Copying 3 resources
[INFO] 
[INFO] --- maven-compiler-plugin:2.3.2:compile (default-compile) @ oozie-mini ---
[INFO] No sources to compile
[INFO] 
[INFO] --- maven-resources-plugin:2.5:testResources (default-testResources) @ oozie-mini ---
[debug] execute contextualize
[INFO] Using 'UTF-8' encoding to copy filtered resources.
[INFO] Copying 3 resources
[INFO] Copying 3 resources
[INFO] 
[INFO] --- maven-compiler-plugin:2.3.2:testCompile (default-testCompile) @ oozie-mini ---
[INFO] Nothing to compile - all classes are up to date
[INFO] 
[INFO] --- maven-surefire-plugin:2.12.2:test (default-test) @ oozie-mini ---
[INFO] Tests are skipped.
[INFO] 
[INFO] --- maven-jar-plugin:2.3.1:jar (default-jar) @ oozie-mini ---
[INFO] Building jar: <https://builds.apache.org/job/oozie-trunk-precommit-build/ws/minitest/target/oozie-mini-4.3.0-SNAPSHOT.jar>
[INFO] 
[INFO] --- maven-site-plugin:2.0-beta-6:attach-descriptor (attach-descriptor) @ oozie-mini ---
[INFO] 
[INFO] --- maven-assembly-plugin:2.2.1:single (default-cli) @ oozie-mini ---
[INFO] Reading assembly descriptor: src/main/assemblies/empty.xml
[INFO]                                                                         
[INFO] ------------------------------------------------------------------------
[INFO] Building Apache Oozie Distro 4.3.0-SNAPSHOT
[INFO] ------------------------------------------------------------------------
[INFO] 
[INFO] --- maven-remote-resources-plugin:1.5:process (default) @ oozie-distro ---
[INFO] 
[INFO] --- maven-resources-plugin:2.5:resources (default-resources) @ oozie-distro ---
[debug] execute contextualize
[INFO] Using 'UTF-8' encoding to copy filtered resources.
[INFO] skip non existing resourceDirectory <https://builds.apache.org/job/oozie-trunk-precommit-build/ws/distro/src/main/resources>
[INFO] Copying 3 resources
[INFO] 
[INFO] --- maven-compiler-plugin:2.3.2:compile (default-compile) @ oozie-distro ---
[INFO] No sources to compile
[INFO] 
[INFO] --- maven-resources-plugin:2.5:testResources (default-testResources) @ oozie-distro ---
[debug] execute contextualize
[INFO] Using 'UTF-8' encoding to copy filtered resources.
[INFO] skip non existing resourceDirectory <https://builds.apache.org/job/oozie-trunk-precommit-build/ws/distro/src/test/resources>
[INFO] Copying 3 resources
[INFO] 
[INFO] --- maven-compiler-plugin:2.3.2:testCompile (default-testCompile) @ oozie-distro ---
[INFO] No sources to compile
[INFO] 
[INFO] --- maven-surefire-plugin:2.12.2:test (default-test) @ oozie-distro ---
[INFO] Tests are skipped.
[INFO] 
[INFO] --- maven-jar-plugin:2.3.1:jar (default-jar) @ oozie-distro ---
[INFO] Building jar: <https://builds.apache.org/job/oozie-trunk-precommit-build/ws/distro/target/oozie-distro-4.3.0-SNAPSHOT.jar>
[INFO] 
[INFO] --- maven-site-plugin:2.0-beta-6:attach-descriptor (attach-descriptor) @ oozie-distro ---
[INFO] 
[INFO] --- maven-antrun-plugin:1.6:run (default) @ oozie-distro ---
[INFO] Executing tasks

main:
      [get] Getting: http://archive.apache.org/dist/tomcat/tomcat-6/v6.0.44/bin/apache-tomcat-6.0.44.tar.gz
      [get] To: <https://builds.apache.org/job/oozie-trunk-precommit-build/ws/distro/downloads/tomcat-6.0.44.tar.gz>
............................................................................................................................................................................................................................................................................................................................................................
    [mkdir] Created dir: <https://builds.apache.org/job/oozie-trunk-precommit-build/ws/distro/target/tomcat>
   [gunzip] Expanding <https://builds.apache.org/job/oozie-trunk-precommit-build/ws/distro/downloads/tomcat-6.0.44.tar.gz> to <https://builds.apache.org/job/oozie-trunk-precommit-build/ws/distro/target/tomcat/tomcat-6.0.44.tar>
    [untar] Expanding: <https://builds.apache.org/job/oozie-trunk-precommit-build/ws/distro/target/tomcat/tomcat-6.0.44.tar> into <https://builds.apache.org/job/oozie-trunk-precommit-build/ws/distro/target/tomcat>
   [delete] Deleting directory <https://builds.apache.org/job/oozie-trunk-precommit-build/ws/distro/target/tomcat/oozie-server/webapps>
    [mkdir] Created dir: <https://builds.apache.org/job/oozie-trunk-precommit-build/ws/distro/target/tomcat/oozie-server/webapps>
   [delete] Deleting: <https://builds.apache.org/job/oozie-trunk-precommit-build/ws/distro/target/tomcat/oozie-server/conf/server.xml>
     [copy] Copying 1 file to <https://builds.apache.org/job/oozie-trunk-precommit-build/ws/distro/target/tomcat/oozie-server/conf>
     [copy] Copying 1 file to <https://builds.apache.org/job/oozie-trunk-precommit-build/ws/distro/target/tomcat/oozie-server/conf>
    [mkdir] Created dir: <https://builds.apache.org/job/oozie-trunk-precommit-build/ws/distro/target/tomcat/oozie-server/conf/ssl>
     [copy] Copying 1 file to <https://builds.apache.org/job/oozie-trunk-precommit-build/ws/distro/target/tomcat/oozie-server/conf/ssl>
     [copy] Copying 1 file to <https://builds.apache.org/job/oozie-trunk-precommit-build/ws/distro/target/tomcat/oozie-server/conf/ssl>
     [copy] Copying 1 file to <https://builds.apache.org/job/oozie-trunk-precommit-build/ws/distro/target/tomcat/oozie-server/conf/ssl>
     [copy] Copying 3 files to <https://builds.apache.org/job/oozie-trunk-precommit-build/ws/distro/target/tomcat/oozie-server/webapps/ROOT>
[INFO] Executed tasks
[INFO] 
[INFO] --- maven-assembly-plugin:2.2.1:single (default-cli) @ oozie-distro ---
[INFO] Reading assembly descriptor: ../src/main/assemblies/distro.xml
[INFO] Copying files to <https://builds.apache.org/job/oozie-trunk-precommit-build/ws/distro/target/oozie-4.3.0-SNAPSHOT-distro>
[WARNING] Assembly file: <https://builds.apache.org/job/oozie-trunk-precommit-build/ws/distro/target/oozie-4.3.0-SNAPSHOT-distro> is not a regular file (it may be a directory). It cannot be attached to the project build for installation or deployment.
[INFO] Building tar : <https://builds.apache.org/job/oozie-trunk-precommit-build/ws/distro/target/oozie-4.3.0-SNAPSHOT-distro.tar.gz>
[INFO]                                                                         
[INFO] ------------------------------------------------------------------------
[INFO] Building Apache Oozie ZooKeeper Security Tests 4.3.0-SNAPSHOT
[INFO] ------------------------------------------------------------------------
[INFO] 
[INFO] --- maven-remote-resources-plugin:1.5:process (default) @ oozie-zookeeper-security-tests ---
[INFO] 
[INFO] --- maven-resources-plugin:2.5:resources (default-resources) @ oozie-zookeeper-security-tests ---
[debug] execute contextualize
[INFO] Using 'UTF-8' encoding to copy filtered resources.
[INFO] skip non existing resourceDirectory <https://builds.apache.org/job/oozie-trunk-precommit-build/ws/zookeeper-security-tests/src/main/resources>
[INFO] Copying 3 resources
[INFO] 
[INFO] --- maven-compiler-plugin:2.3.2:compile (default-compile) @ oozie-zookeeper-security-tests ---
[INFO] No sources to compile
[INFO] 
[INFO] --- maven-resources-plugin:2.5:testResources (default-testResources) @ oozie-zookeeper-security-tests ---
[debug] execute contextualize
[INFO] Using 'UTF-8' encoding to copy filtered resources.
[INFO] skip non existing resourceDirectory <https://builds.apache.org/job/oozie-trunk-precommit-build/ws/zookeeper-security-tests/src/test/resources>
[INFO] Copying 3 resources
[INFO] 
[INFO] --- maven-compiler-plugin:2.3.2:testCompile (default-testCompile) @ oozie-zookeeper-security-tests ---
[INFO] Nothing to compile - all classes are up to date
[INFO] 
[INFO] --- maven-surefire-plugin:2.12.2:test (default-test) @ oozie-zookeeper-security-tests ---
[INFO] Tests are skipped.
[INFO] 
[INFO] --- maven-jar-plugin:2.3.1:jar (default-jar) @ oozie-zookeeper-security-tests ---
[INFO] Building jar: <https://builds.apache.org/job/oozie-trunk-precommit-build/ws/zookeeper-security-tests/target/oozie-zookeeper-security-tests-4.3.0-SNAPSHOT.jar>
[INFO] 
[INFO] --- maven-site-plugin:2.0-beta-6:attach-descriptor (attach-descriptor) @ oozie-zookeeper-security-tests ---
[INFO] 
[INFO] --- maven-assembly-plugin:2.2.1:single (default-cli) @ oozie-zookeeper-security-tests ---
[INFO] Reading assembly descriptor: src/main/assemblies/empty.xml
[INFO] ------------------------------------------------------------------------
[INFO] Reactor Summary:
[INFO] 
[INFO] Apache Oozie Main .................................. SUCCESS [  1.509 s]
[INFO] Apache Oozie Hadoop Utils .......................... SUCCESS [  0.693 s]
[INFO] Apache Oozie Hadoop Distcp hadoop-1-4.3.0-SNAPSHOT . SUCCESS [  0.113 s]
[INFO] Apache Oozie Hadoop Auth hadoop-1-4.3.0-SNAPSHOT ... SUCCESS [  0.201 s]
[INFO] Apache Oozie Hadoop Libs ........................... SUCCESS [  0.022 s]
[INFO] Apache Oozie Client ................................ SUCCESS [ 26.609 s]
[INFO] Apache Oozie Share Lib Oozie ....................... SUCCESS [  1.044 s]
[INFO] Apache Oozie Share Lib HCatalog .................... SUCCESS [  1.565 s]
[INFO] Apache Oozie Share Lib Distcp ...................... SUCCESS [  0.254 s]
[INFO] Apache Oozie Core .................................. SUCCESS [ 34.014 s]
[INFO] Apache Oozie Share Lib Streaming ................... SUCCESS [  2.012 s]
[INFO] Apache Oozie Share Lib Pig ......................... SUCCESS [  1.111 s]
[INFO] Apache Oozie Share Lib Hive ........................ SUCCESS [  3.185 s]
[INFO] Apache Oozie Share Lib Hive 2 ...................... SUCCESS [  2.472 s]
[INFO] Apache Oozie Share Lib Sqoop ....................... SUCCESS [  0.509 s]
[INFO] Apache Oozie Examples .............................. SUCCESS [  2.200 s]
[INFO] Apache Oozie Share Lib Spark ....................... SUCCESS [  6.178 s]
[INFO] Apache Oozie Share Lib ............................. SUCCESS [ 18.522 s]
[INFO] Apache Oozie Docs .................................. SUCCESS [ 11.553 s]
[INFO] Apache Oozie WebApp ................................ SUCCESS [ 28.072 s]
[INFO] Apache Oozie Tools ................................. SUCCESS [  0.795 s]
[INFO] Apache Oozie MiniOozie ............................. SUCCESS [  0.318 s]
[INFO] Apache Oozie Distro ................................ SUCCESS [ 38.547 s]
[INFO] Apache Oozie ZooKeeper Security Tests .............. SUCCESS [  2.502 s]
[INFO] ------------------------------------------------------------------------
[INFO] BUILD SUCCESS
[INFO] ------------------------------------------------------------------------
[INFO] Total time: 03:05 min
[INFO] Finished at: 2016-08-17T18:51:58+00:00
[INFO] Final Memory: 76M/989M
[INFO] ------------------------------------------------------------------------

Reports
  Running test-patch task CLEAN
  Running test-patch task RAW_PATCH_ANALYSIS
  Running test-patch task RAT
  Running test-patch task JAVADOC
  Running test-patch task COMPILE
  Running test-patch task BACKWARDS_COMPATIBILITY
  Running test-patch task TESTS
  Running test-patch task DISTRO


Testing JIRA OOZIE-2641

Cleaning local git workspace

----------------------------

+1 PATCH_APPLIES
+1 CLEAN
-1 RAW_PATCH_ANALYSIS
    +1 the patch does not introduce any @author tags
    +1 the patch does not introduce any tabs
    +1 the patch does not introduce any trailing spaces
    +1 the patch does not introduce any line longer than 132
    -1 the patch does not add/modify any testcase
+1 RAT
    +1 the patch does not seem to introduce new RAT warnings
+1 JAVADOC
    +1 the patch does not seem to introduce new Javadoc warnings
+1 COMPILE
    +1 HEAD compiles
    +1 patch compiles
    +1 the patch does not seem to introduce new javac warnings
+1 BACKWARDS_COMPATIBILITY
    +1 the patch does not change any JPA Entity/Colum/Basic/Lob/Transient annotations
    +1 the patch does not modify JPA files
+1 TESTS
    Tests run: 1793
+1 DISTRO
    +1 distro tarball builds with the patch 

----------------------------
-1 Overall result, please check the reported -1(s)


The full output of the test-patch run is available at

   https://builds.apache.org/job/oozie-trunk-precommit-build/3231/

Adding comment to JIRA
Comment added.

test-patch exit code: 1

Build step 'Execute shell' marked build as failure
Archiving artifacts
Compressed 490.43 KB of artifacts by 39.1% relative to #3212
Recording test results

Build failed in Jenkins: oozie-trunk-precommit-build #3230

Posted by Apache Jenkins Server <je...@builds.apache.org>.
See <https://builds.apache.org/job/oozie-trunk-precommit-build/3230/>

------------------------------------------
[...truncated 14184 lines...]
[INFO] Copying 3 resources
[INFO] 
[INFO] --- maven-compiler-plugin:2.3.2:testCompile (default-testCompile) @ oozie-tools ---
[INFO] Nothing to compile - all classes are up to date
[INFO] 
[INFO] --- maven-surefire-plugin:2.12.2:test (default-test) @ oozie-tools ---
[INFO] Tests are skipped.
[INFO] 
[INFO] --- maven-jar-plugin:2.3.1:jar (default-jar) @ oozie-tools ---
[INFO] Building jar: <https://builds.apache.org/job/oozie-trunk-precommit-build/ws/tools/target/oozie-tools-4.3.0-SNAPSHOT.jar>
[INFO] 
[INFO] --- maven-site-plugin:2.0-beta-6:attach-descriptor (attach-descriptor) @ oozie-tools ---
[INFO] 
[INFO] --- maven-assembly-plugin:2.2.1:single (default-cli) @ oozie-tools ---
[INFO] Reading assembly descriptor: ../src/main/assemblies/tools.xml
[WARNING] The following patterns were never triggered in this artifact exclusion filter:
o  '*:*:pom:*'

[INFO] Copying files to <https://builds.apache.org/job/oozie-trunk-precommit-build/ws/tools/target/oozie-tools-4.3.0-SNAPSHOT-tools>
[WARNING] Assembly file: <https://builds.apache.org/job/oozie-trunk-precommit-build/ws/tools/target/oozie-tools-4.3.0-SNAPSHOT-tools> is not a regular file (it may be a directory). It cannot be attached to the project build for installation or deployment.
[INFO]                                                                         
[INFO] ------------------------------------------------------------------------
[INFO] Building Apache Oozie MiniOozie 4.3.0-SNAPSHOT
[INFO] ------------------------------------------------------------------------
[INFO] 
[INFO] --- maven-remote-resources-plugin:1.5:process (default) @ oozie-mini ---
[INFO] 
[INFO] --- maven-resources-plugin:2.5:resources (default-resources) @ oozie-mini ---
[debug] execute contextualize
[INFO] Using 'UTF-8' encoding to copy filtered resources.
[INFO] skip non existing resourceDirectory <https://builds.apache.org/job/oozie-trunk-precommit-build/ws/minitest/src/main/resources>
[INFO] Copying 3 resources
[INFO] 
[INFO] --- maven-compiler-plugin:2.3.2:compile (default-compile) @ oozie-mini ---
[INFO] No sources to compile
[INFO] 
[INFO] --- maven-resources-plugin:2.5:testResources (default-testResources) @ oozie-mini ---
[debug] execute contextualize
[INFO] Using 'UTF-8' encoding to copy filtered resources.
[INFO] Copying 3 resources
[INFO] Copying 3 resources
[INFO] 
[INFO] --- maven-compiler-plugin:2.3.2:testCompile (default-testCompile) @ oozie-mini ---
[INFO] Nothing to compile - all classes are up to date
[INFO] 
[INFO] --- maven-surefire-plugin:2.12.2:test (default-test) @ oozie-mini ---
[INFO] Tests are skipped.
[INFO] 
[INFO] --- maven-jar-plugin:2.3.1:jar (default-jar) @ oozie-mini ---
[INFO] Building jar: <https://builds.apache.org/job/oozie-trunk-precommit-build/ws/minitest/target/oozie-mini-4.3.0-SNAPSHOT.jar>
[INFO] 
[INFO] --- maven-site-plugin:2.0-beta-6:attach-descriptor (attach-descriptor) @ oozie-mini ---
[INFO] 
[INFO] --- maven-assembly-plugin:2.2.1:single (default-cli) @ oozie-mini ---
[INFO] Reading assembly descriptor: src/main/assemblies/empty.xml
[INFO]                                                                         
[INFO] ------------------------------------------------------------------------
[INFO] Building Apache Oozie Distro 4.3.0-SNAPSHOT
[INFO] ------------------------------------------------------------------------
[INFO] 
[INFO] --- maven-remote-resources-plugin:1.5:process (default) @ oozie-distro ---
[INFO] 
[INFO] --- maven-resources-plugin:2.5:resources (default-resources) @ oozie-distro ---
[debug] execute contextualize
[INFO] Using 'UTF-8' encoding to copy filtered resources.
[INFO] skip non existing resourceDirectory <https://builds.apache.org/job/oozie-trunk-precommit-build/ws/distro/src/main/resources>
[INFO] Copying 3 resources
[INFO] 
[INFO] --- maven-compiler-plugin:2.3.2:compile (default-compile) @ oozie-distro ---
[INFO] No sources to compile
[INFO] 
[INFO] --- maven-resources-plugin:2.5:testResources (default-testResources) @ oozie-distro ---
[debug] execute contextualize
[INFO] Using 'UTF-8' encoding to copy filtered resources.
[INFO] skip non existing resourceDirectory <https://builds.apache.org/job/oozie-trunk-precommit-build/ws/distro/src/test/resources>
[INFO] Copying 3 resources
[INFO] 
[INFO] --- maven-compiler-plugin:2.3.2:testCompile (default-testCompile) @ oozie-distro ---
[INFO] No sources to compile
[INFO] 
[INFO] --- maven-surefire-plugin:2.12.2:test (default-test) @ oozie-distro ---
[INFO] Tests are skipped.
[INFO] 
[INFO] --- maven-jar-plugin:2.3.1:jar (default-jar) @ oozie-distro ---
[INFO] Building jar: <https://builds.apache.org/job/oozie-trunk-precommit-build/ws/distro/target/oozie-distro-4.3.0-SNAPSHOT.jar>
[INFO] 
[INFO] --- maven-site-plugin:2.0-beta-6:attach-descriptor (attach-descriptor) @ oozie-distro ---
[INFO] 
[INFO] --- maven-antrun-plugin:1.6:run (default) @ oozie-distro ---
[INFO] Executing tasks

main:
      [get] Getting: http://archive.apache.org/dist/tomcat/tomcat-6/v6.0.44/bin/apache-tomcat-6.0.44.tar.gz
      [get] To: <https://builds.apache.org/job/oozie-trunk-precommit-build/ws/distro/downloads/tomcat-6.0.44.tar.gz>
......................................................................................................................................................................................................................................................................................................................................................................................................................................................................
    [mkdir] Created dir: <https://builds.apache.org/job/oozie-trunk-precommit-build/ws/distro/target/tomcat>
   [gunzip] Expanding <https://builds.apache.org/job/oozie-trunk-precommit-build/ws/distro/downloads/tomcat-6.0.44.tar.gz> to <https://builds.apache.org/job/oozie-trunk-precommit-build/ws/distro/target/tomcat/tomcat-6.0.44.tar>
    [untar] Expanding: <https://builds.apache.org/job/oozie-trunk-precommit-build/ws/distro/target/tomcat/tomcat-6.0.44.tar> into <https://builds.apache.org/job/oozie-trunk-precommit-build/ws/distro/target/tomcat>
   [delete] Deleting directory <https://builds.apache.org/job/oozie-trunk-precommit-build/ws/distro/target/tomcat/oozie-server/webapps>
    [mkdir] Created dir: <https://builds.apache.org/job/oozie-trunk-precommit-build/ws/distro/target/tomcat/oozie-server/webapps>
   [delete] Deleting: <https://builds.apache.org/job/oozie-trunk-precommit-build/ws/distro/target/tomcat/oozie-server/conf/server.xml>
     [copy] Copying 1 file to <https://builds.apache.org/job/oozie-trunk-precommit-build/ws/distro/target/tomcat/oozie-server/conf>
     [copy] Copying 1 file to <https://builds.apache.org/job/oozie-trunk-precommit-build/ws/distro/target/tomcat/oozie-server/conf>
    [mkdir] Created dir: <https://builds.apache.org/job/oozie-trunk-precommit-build/ws/distro/target/tomcat/oozie-server/conf/ssl>
     [copy] Copying 1 file to <https://builds.apache.org/job/oozie-trunk-precommit-build/ws/distro/target/tomcat/oozie-server/conf/ssl>
     [copy] Copying 1 file to <https://builds.apache.org/job/oozie-trunk-precommit-build/ws/distro/target/tomcat/oozie-server/conf/ssl>
     [copy] Copying 1 file to <https://builds.apache.org/job/oozie-trunk-precommit-build/ws/distro/target/tomcat/oozie-server/conf/ssl>
     [copy] Copying 3 files to <https://builds.apache.org/job/oozie-trunk-precommit-build/ws/distro/target/tomcat/oozie-server/webapps/ROOT>
[INFO] Executed tasks
[INFO] 
[INFO] --- maven-assembly-plugin:2.2.1:single (default-cli) @ oozie-distro ---
[INFO] Reading assembly descriptor: ../src/main/assemblies/distro.xml
[INFO] Copying files to <https://builds.apache.org/job/oozie-trunk-precommit-build/ws/distro/target/oozie-4.3.0-SNAPSHOT-distro>
[WARNING] Assembly file: <https://builds.apache.org/job/oozie-trunk-precommit-build/ws/distro/target/oozie-4.3.0-SNAPSHOT-distro> is not a regular file (it may be a directory). It cannot be attached to the project build for installation or deployment.
[INFO] Building tar : <https://builds.apache.org/job/oozie-trunk-precommit-build/ws/distro/target/oozie-4.3.0-SNAPSHOT-distro.tar.gz>
[INFO]                                                                         
[INFO] ------------------------------------------------------------------------
[INFO] Building Apache Oozie ZooKeeper Security Tests 4.3.0-SNAPSHOT
[INFO] ------------------------------------------------------------------------
[INFO] 
[INFO] --- maven-remote-resources-plugin:1.5:process (default) @ oozie-zookeeper-security-tests ---
[INFO] 
[INFO] --- maven-resources-plugin:2.5:resources (default-resources) @ oozie-zookeeper-security-tests ---
[debug] execute contextualize
[INFO] Using 'UTF-8' encoding to copy filtered resources.
[INFO] skip non existing resourceDirectory <https://builds.apache.org/job/oozie-trunk-precommit-build/ws/zookeeper-security-tests/src/main/resources>
[INFO] Copying 3 resources
[INFO] 
[INFO] --- maven-compiler-plugin:2.3.2:compile (default-compile) @ oozie-zookeeper-security-tests ---
[INFO] No sources to compile
[INFO] 
[INFO] --- maven-resources-plugin:2.5:testResources (default-testResources) @ oozie-zookeeper-security-tests ---
[debug] execute contextualize
[INFO] Using 'UTF-8' encoding to copy filtered resources.
[INFO] skip non existing resourceDirectory <https://builds.apache.org/job/oozie-trunk-precommit-build/ws/zookeeper-security-tests/src/test/resources>
[INFO] Copying 3 resources
[INFO] 
[INFO] --- maven-compiler-plugin:2.3.2:testCompile (default-testCompile) @ oozie-zookeeper-security-tests ---
[INFO] Nothing to compile - all classes are up to date
[INFO] 
[INFO] --- maven-surefire-plugin:2.12.2:test (default-test) @ oozie-zookeeper-security-tests ---
[INFO] Tests are skipped.
[INFO] 
[INFO] --- maven-jar-plugin:2.3.1:jar (default-jar) @ oozie-zookeeper-security-tests ---
[INFO] Building jar: <https://builds.apache.org/job/oozie-trunk-precommit-build/ws/zookeeper-security-tests/target/oozie-zookeeper-security-tests-4.3.0-SNAPSHOT.jar>
[INFO] 
[INFO] --- maven-site-plugin:2.0-beta-6:attach-descriptor (attach-descriptor) @ oozie-zookeeper-security-tests ---
[INFO] 
[INFO] --- maven-assembly-plugin:2.2.1:single (default-cli) @ oozie-zookeeper-security-tests ---
[INFO] Reading assembly descriptor: src/main/assemblies/empty.xml
[INFO] ------------------------------------------------------------------------
[INFO] Reactor Summary:
[INFO] 
[INFO] Apache Oozie Main .................................. SUCCESS [  2.047 s]
[INFO] Apache Oozie Hadoop Utils .......................... SUCCESS [  0.672 s]
[INFO] Apache Oozie Hadoop Distcp hadoop-1-4.3.0-SNAPSHOT . SUCCESS [  0.109 s]
[INFO] Apache Oozie Hadoop Auth hadoop-1-4.3.0-SNAPSHOT ... SUCCESS [  0.203 s]
[INFO] Apache Oozie Hadoop Libs ........................... SUCCESS [  0.021 s]
[INFO] Apache Oozie Client ................................ SUCCESS [ 28.165 s]
[INFO] Apache Oozie Share Lib Oozie ....................... SUCCESS [  1.030 s]
[INFO] Apache Oozie Share Lib HCatalog .................... SUCCESS [  2.064 s]
[INFO] Apache Oozie Share Lib Distcp ...................... SUCCESS [  0.243 s]
[INFO] Apache Oozie Core .................................. SUCCESS [ 42.817 s]
[INFO] Apache Oozie Share Lib Streaming ................... SUCCESS [  2.946 s]
[INFO] Apache Oozie Share Lib Pig ......................... SUCCESS [  1.153 s]
[INFO] Apache Oozie Share Lib Hive ........................ SUCCESS [  3.824 s]
[INFO] Apache Oozie Share Lib Hive 2 ...................... SUCCESS [  3.834 s]
[INFO] Apache Oozie Share Lib Sqoop ....................... SUCCESS [  0.497 s]
[INFO] Apache Oozie Examples .............................. SUCCESS [  2.208 s]
[INFO] Apache Oozie Share Lib Spark ....................... SUCCESS [  6.103 s]
[INFO] Apache Oozie Share Lib ............................. SUCCESS [ 19.712 s]
[INFO] Apache Oozie Docs .................................. SUCCESS [ 13.191 s]
[INFO] Apache Oozie WebApp ................................ SUCCESS [ 28.015 s]
[INFO] Apache Oozie Tools ................................. SUCCESS [  0.988 s]
[INFO] Apache Oozie MiniOozie ............................. SUCCESS [  0.420 s]
[INFO] Apache Oozie Distro ................................ SUCCESS [ 42.697 s]
[INFO] Apache Oozie ZooKeeper Security Tests .............. SUCCESS [  2.544 s]
[INFO] ------------------------------------------------------------------------
[INFO] BUILD SUCCESS
[INFO] ------------------------------------------------------------------------
[INFO] Total time: 03:27 min
[INFO] Finished at: 2016-08-17T12:56:11+00:00
[INFO] Final Memory: 80M/1074M
[INFO] ------------------------------------------------------------------------

Reports
  Running test-patch task CLEAN
  Running test-patch task RAW_PATCH_ANALYSIS
  Running test-patch task RAT
  Running test-patch task JAVADOC
  Running test-patch task COMPILE
  Running test-patch task BACKWARDS_COMPATIBILITY
  Running test-patch task TESTS
  Running test-patch task DISTRO


Testing JIRA OOZIE-2613

Cleaning local git workspace

----------------------------

+1 PATCH_APPLIES
+1 CLEAN
+1 RAW_PATCH_ANALYSIS
    +1 the patch does not introduce any @author tags
    +1 the patch does not introduce any tabs
    +1 the patch does not introduce any trailing spaces
    +1 the patch does not introduce any line longer than 132
    +1 the patch does adds/modifies 6 testcase(s)
+1 RAT
    +1 the patch does not seem to introduce new RAT warnings
+1 JAVADOC
    +1 the patch does not seem to introduce new Javadoc warnings
+1 COMPILE
    +1 HEAD compiles
    +1 patch compiles
    +1 the patch does not seem to introduce new javac warnings
+1 BACKWARDS_COMPATIBILITY
    +1 the patch does not change any JPA Entity/Colum/Basic/Lob/Transient annotations
    +1 the patch does not modify JPA files
-1 TESTS
    Tests run: 1793
    Tests failed: 1
    Tests errors: 1

    The patch failed the following testcases:

      testMain(org.apache.oozie.action.hadoop.TestHiveMain)

+1 DISTRO
    +1 distro tarball builds with the patch 

----------------------------
-1 Overall result, please check the reported -1(s)


The full output of the test-patch run is available at

   https://builds.apache.org/job/oozie-trunk-precommit-build/3230/

Adding comment to JIRA
Comment added.

test-patch exit code: 1

Build step 'Execute shell' marked build as failure
Archiving artifacts
Recording test results

Build failed in Jenkins: oozie-trunk-precommit-build #3229

Posted by Apache Jenkins Server <je...@builds.apache.org>.
See <https://builds.apache.org/job/oozie-trunk-precommit-build/3229/>

------------------------------------------
[...truncated 5235 lines...]
[INFO] --- maven-compiler-plugin:2.3.2:compile (default-compile) @ oozie-tools ---
[INFO] Nothing to compile - all classes are up to date
[INFO] 
[INFO] --- maven-resources-plugin:2.5:testResources (default-testResources) @ oozie-tools ---
[debug] execute contextualize
[INFO] Using 'UTF-8' encoding to copy filtered resources.
[INFO] Copying 2 resources
[INFO] Copying 3 resources
[INFO] 
[INFO] --- maven-compiler-plugin:2.3.2:testCompile (default-testCompile) @ oozie-tools ---
[INFO] Nothing to compile - all classes are up to date
[INFO] 
[INFO] --- maven-surefire-plugin:2.12.2:test (default-test) @ oozie-tools ---
[INFO] Tests are skipped.
[INFO] 
[INFO] --- maven-jar-plugin:2.3.1:jar (default-jar) @ oozie-tools ---
[INFO] Building jar: <https://builds.apache.org/job/oozie-trunk-precommit-build/ws/tools/target/oozie-tools-4.3.0-SNAPSHOT.jar>
[INFO] 
[INFO] --- maven-site-plugin:2.0-beta-6:attach-descriptor (attach-descriptor) @ oozie-tools ---
[INFO] 
[INFO] --- maven-assembly-plugin:2.2.1:single (default-cli) @ oozie-tools ---
[INFO] Reading assembly descriptor: ../src/main/assemblies/tools.xml
[WARNING] The following patterns were never triggered in this artifact exclusion filter:
o  '*:*:pom:*'

[INFO] Copying files to <https://builds.apache.org/job/oozie-trunk-precommit-build/ws/tools/target/oozie-tools-4.3.0-SNAPSHOT-tools>
[WARNING] Assembly file: <https://builds.apache.org/job/oozie-trunk-precommit-build/ws/tools/target/oozie-tools-4.3.0-SNAPSHOT-tools> is not a regular file (it may be a directory). It cannot be attached to the project build for installation or deployment.
[INFO]                                                                         
[INFO] ------------------------------------------------------------------------
[INFO] Building Apache Oozie MiniOozie 4.3.0-SNAPSHOT
[INFO] ------------------------------------------------------------------------
[INFO] 
[INFO] --- maven-remote-resources-plugin:1.5:process (default) @ oozie-mini ---
[INFO] 
[INFO] --- maven-resources-plugin:2.5:resources (default-resources) @ oozie-mini ---
[debug] execute contextualize
[INFO] Using 'UTF-8' encoding to copy filtered resources.
[INFO] skip non existing resourceDirectory <https://builds.apache.org/job/oozie-trunk-precommit-build/ws/minitest/src/main/resources>
[INFO] Copying 3 resources
[INFO] 
[INFO] --- maven-compiler-plugin:2.3.2:compile (default-compile) @ oozie-mini ---
[INFO] No sources to compile
[INFO] 
[INFO] --- maven-resources-plugin:2.5:testResources (default-testResources) @ oozie-mini ---
[debug] execute contextualize
[INFO] Using 'UTF-8' encoding to copy filtered resources.
[INFO] Copying 3 resources
[INFO] Copying 3 resources
[INFO] 
[INFO] --- maven-compiler-plugin:2.3.2:testCompile (default-testCompile) @ oozie-mini ---
[INFO] Nothing to compile - all classes are up to date
[INFO] 
[INFO] --- maven-surefire-plugin:2.12.2:test (default-test) @ oozie-mini ---
[INFO] Tests are skipped.
[INFO] 
[INFO] --- maven-jar-plugin:2.3.1:jar (default-jar) @ oozie-mini ---
[INFO] Building jar: <https://builds.apache.org/job/oozie-trunk-precommit-build/ws/minitest/target/oozie-mini-4.3.0-SNAPSHOT.jar>
[INFO] 
[INFO] --- maven-site-plugin:2.0-beta-6:attach-descriptor (attach-descriptor) @ oozie-mini ---
[INFO] 
[INFO] --- maven-assembly-plugin:2.2.1:single (default-cli) @ oozie-mini ---
[INFO] Reading assembly descriptor: src/main/assemblies/empty.xml
[INFO]                                                                         
[INFO] ------------------------------------------------------------------------
[INFO] Building Apache Oozie Distro 4.3.0-SNAPSHOT
[INFO] ------------------------------------------------------------------------
[INFO] 
[INFO] --- maven-remote-resources-plugin:1.5:process (default) @ oozie-distro ---
[INFO] 
[INFO] --- maven-resources-plugin:2.5:resources (default-resources) @ oozie-distro ---
[debug] execute contextualize
[INFO] Using 'UTF-8' encoding to copy filtered resources.
[INFO] skip non existing resourceDirectory <https://builds.apache.org/job/oozie-trunk-precommit-build/ws/distro/src/main/resources>
[INFO] Copying 3 resources
[INFO] 
[INFO] --- maven-compiler-plugin:2.3.2:compile (default-compile) @ oozie-distro ---
[INFO] No sources to compile
[INFO] 
[INFO] --- maven-resources-plugin:2.5:testResources (default-testResources) @ oozie-distro ---
[debug] execute contextualize
[INFO] Using 'UTF-8' encoding to copy filtered resources.
[INFO] skip non existing resourceDirectory <https://builds.apache.org/job/oozie-trunk-precommit-build/ws/distro/src/test/resources>
[INFO] Copying 3 resources
[INFO] 
[INFO] --- maven-compiler-plugin:2.3.2:testCompile (default-testCompile) @ oozie-distro ---
[INFO] No sources to compile
[INFO] 
[INFO] --- maven-surefire-plugin:2.12.2:test (default-test) @ oozie-distro ---
[INFO] Tests are skipped.
[INFO] 
[INFO] --- maven-jar-plugin:2.3.1:jar (default-jar) @ oozie-distro ---
[INFO] Building jar: <https://builds.apache.org/job/oozie-trunk-precommit-build/ws/distro/target/oozie-distro-4.3.0-SNAPSHOT.jar>
[INFO] 
[INFO] --- maven-site-plugin:2.0-beta-6:attach-descriptor (attach-descriptor) @ oozie-distro ---
[INFO] 
[INFO] --- maven-antrun-plugin:1.6:run (default) @ oozie-distro ---
[INFO] Executing tasks

main:
      [get] Getting: http://archive.apache.org/dist/tomcat/tomcat-6/v6.0.44/bin/apache-tomcat-6.0.44.tar.gz
      [get] To: <https://builds.apache.org/job/oozie-trunk-precommit-build/ws/distro/downloads/tomcat-6.0.44.tar.gz>
..........................................................................................................................................................................................................................................................................................................................................................................
    [mkdir] Created dir: <https://builds.apache.org/job/oozie-trunk-precommit-build/ws/distro/target/tomcat>
   [gunzip] Expanding <https://builds.apache.org/job/oozie-trunk-precommit-build/ws/distro/downloads/tomcat-6.0.44.tar.gz> to <https://builds.apache.org/job/oozie-trunk-precommit-build/ws/distro/target/tomcat/tomcat-6.0.44.tar>
    [untar] Expanding: <https://builds.apache.org/job/oozie-trunk-precommit-build/ws/distro/target/tomcat/tomcat-6.0.44.tar> into <https://builds.apache.org/job/oozie-trunk-precommit-build/ws/distro/target/tomcat>
   [delete] Deleting directory <https://builds.apache.org/job/oozie-trunk-precommit-build/ws/distro/target/tomcat/oozie-server/webapps>
    [mkdir] Created dir: <https://builds.apache.org/job/oozie-trunk-precommit-build/ws/distro/target/tomcat/oozie-server/webapps>
   [delete] Deleting: <https://builds.apache.org/job/oozie-trunk-precommit-build/ws/distro/target/tomcat/oozie-server/conf/server.xml>
     [copy] Copying 1 file to <https://builds.apache.org/job/oozie-trunk-precommit-build/ws/distro/target/tomcat/oozie-server/conf>
     [copy] Copying 1 file to <https://builds.apache.org/job/oozie-trunk-precommit-build/ws/distro/target/tomcat/oozie-server/conf>
    [mkdir] Created dir: <https://builds.apache.org/job/oozie-trunk-precommit-build/ws/distro/target/tomcat/oozie-server/conf/ssl>
     [copy] Copying 1 file to <https://builds.apache.org/job/oozie-trunk-precommit-build/ws/distro/target/tomcat/oozie-server/conf/ssl>
     [copy] Copying 1 file to <https://builds.apache.org/job/oozie-trunk-precommit-build/ws/distro/target/tomcat/oozie-server/conf/ssl>
     [copy] Copying 1 file to <https://builds.apache.org/job/oozie-trunk-precommit-build/ws/distro/target/tomcat/oozie-server/conf/ssl>
     [copy] Copying 3 files to <https://builds.apache.org/job/oozie-trunk-precommit-build/ws/distro/target/tomcat/oozie-server/webapps/ROOT>
[INFO] Executed tasks
[INFO] 
[INFO] --- maven-assembly-plugin:2.2.1:single (default-cli) @ oozie-distro ---
[INFO] Reading assembly descriptor: ../src/main/assemblies/distro.xml
[INFO] Copying files to <https://builds.apache.org/job/oozie-trunk-precommit-build/ws/distro/target/oozie-4.3.0-SNAPSHOT-distro>
[WARNING] Assembly file: <https://builds.apache.org/job/oozie-trunk-precommit-build/ws/distro/target/oozie-4.3.0-SNAPSHOT-distro> is not a regular file (it may be a directory). It cannot be attached to the project build for installation or deployment.
[INFO] Building tar : <https://builds.apache.org/job/oozie-trunk-precommit-build/ws/distro/target/oozie-4.3.0-SNAPSHOT-distro.tar.gz>
[INFO]                                                                         
[INFO] ------------------------------------------------------------------------
[INFO] Building Apache Oozie ZooKeeper Security Tests 4.3.0-SNAPSHOT
[INFO] ------------------------------------------------------------------------
[INFO] 
[INFO] --- maven-remote-resources-plugin:1.5:process (default) @ oozie-zookeeper-security-tests ---
[INFO] 
[INFO] --- maven-resources-plugin:2.5:resources (default-resources) @ oozie-zookeeper-security-tests ---
[debug] execute contextualize
[INFO] Using 'UTF-8' encoding to copy filtered resources.
[INFO] skip non existing resourceDirectory <https://builds.apache.org/job/oozie-trunk-precommit-build/ws/zookeeper-security-tests/src/main/resources>
[INFO] Copying 3 resources
[INFO] 
[INFO] --- maven-compiler-plugin:2.3.2:compile (default-compile) @ oozie-zookeeper-security-tests ---
[INFO] No sources to compile
[INFO] 
[INFO] --- maven-resources-plugin:2.5:testResources (default-testResources) @ oozie-zookeeper-security-tests ---
[debug] execute contextualize
[INFO] Using 'UTF-8' encoding to copy filtered resources.
[INFO] skip non existing resourceDirectory <https://builds.apache.org/job/oozie-trunk-precommit-build/ws/zookeeper-security-tests/src/test/resources>
[INFO] Copying 3 resources
[INFO] 
[INFO] --- maven-compiler-plugin:2.3.2:testCompile (default-testCompile) @ oozie-zookeeper-security-tests ---
[INFO] Nothing to compile - all classes are up to date
[INFO] 
[INFO] --- maven-surefire-plugin:2.12.2:test (default-test) @ oozie-zookeeper-security-tests ---
[INFO] Tests are skipped.
[INFO] 
[INFO] --- maven-jar-plugin:2.3.1:jar (default-jar) @ oozie-zookeeper-security-tests ---
[INFO] Building jar: <https://builds.apache.org/job/oozie-trunk-precommit-build/ws/zookeeper-security-tests/target/oozie-zookeeper-security-tests-4.3.0-SNAPSHOT.jar>
[INFO] 
[INFO] --- maven-site-plugin:2.0-beta-6:attach-descriptor (attach-descriptor) @ oozie-zookeeper-security-tests ---
[INFO] 
[INFO] --- maven-assembly-plugin:2.2.1:single (default-cli) @ oozie-zookeeper-security-tests ---
[INFO] Reading assembly descriptor: src/main/assemblies/empty.xml
[INFO] ------------------------------------------------------------------------
[INFO] Reactor Summary:
[INFO] 
[INFO] Apache Oozie Main .................................. SUCCESS [  1.570 s]
[INFO] Apache Oozie Hadoop Utils .......................... SUCCESS [  0.721 s]
[INFO] Apache Oozie Hadoop Distcp hadoop-1-4.3.0-SNAPSHOT . SUCCESS [  0.110 s]
[INFO] Apache Oozie Hadoop Auth hadoop-1-4.3.0-SNAPSHOT ... SUCCESS [  0.220 s]
[INFO] Apache Oozie Hadoop Libs ........................... SUCCESS [  0.024 s]
[INFO] Apache Oozie Client ................................ SUCCESS [ 16.604 s]
[INFO] Apache Oozie Share Lib Oozie ....................... SUCCESS [  1.041 s]
[INFO] Apache Oozie Share Lib HCatalog .................... SUCCESS [  1.452 s]
[INFO] Apache Oozie Share Lib Distcp ...................... SUCCESS [  0.245 s]
[INFO] Apache Oozie Core .................................. SUCCESS [ 33.683 s]
[INFO] Apache Oozie Share Lib Streaming ................... SUCCESS [  1.994 s]
[INFO] Apache Oozie Share Lib Pig ......................... SUCCESS [  1.103 s]
[INFO] Apache Oozie Share Lib Hive ........................ SUCCESS [  3.180 s]
[INFO] Apache Oozie Share Lib Hive 2 ...................... SUCCESS [  2.572 s]
[INFO] Apache Oozie Share Lib Sqoop ....................... SUCCESS [  0.516 s]
[INFO] Apache Oozie Examples .............................. SUCCESS [  2.261 s]
[INFO] Apache Oozie Share Lib Spark ....................... SUCCESS [  6.197 s]
[INFO] Apache Oozie Share Lib ............................. SUCCESS [ 18.107 s]
[INFO] Apache Oozie Docs .................................. SUCCESS [ 10.840 s]
[INFO] Apache Oozie WebApp ................................ SUCCESS [ 27.620 s]
[INFO] Apache Oozie Tools ................................. SUCCESS [  0.714 s]
[INFO] Apache Oozie MiniOozie ............................. SUCCESS [  0.312 s]
[INFO] Apache Oozie Distro ................................ SUCCESS [ 29.019 s]
[INFO] Apache Oozie ZooKeeper Security Tests .............. SUCCESS [  2.502 s]
[INFO] ------------------------------------------------------------------------
[INFO] BUILD SUCCESS
[INFO] ------------------------------------------------------------------------
[INFO] Total time: 02:44 min
[INFO] Finished at: 2016-08-17T12:11:19+00:00
[INFO] Final Memory: 75M/1102M
[INFO] ------------------------------------------------------------------------

Reports
  Running test-patch task CLEAN
  Running test-patch task RAW_PATCH_ANALYSIS
  Running test-patch task RAT
  Running test-patch task JAVADOC
  Running test-patch task COMPILE
  Running test-patch task BACKWARDS_COMPATIBILITY
  Running test-patch task TESTS
  Running test-patch task DISTRO


Testing JIRA OOZIE-2231

Cleaning local git workspace

----------------------------

+1 PATCH_APPLIES
+1 CLEAN
-1 RAW_PATCH_ANALYSIS
    +1 the patch does not introduce any @author tags
    +1 the patch does not introduce any tabs
    +1 the patch does not introduce any trailing spaces
    +1 the patch does not introduce any line longer than 132
    -1 the patch does not add/modify any testcase
+1 RAT
    +1 the patch does not seem to introduce new RAT warnings
+1 JAVADOC
    +1 the patch does not seem to introduce new Javadoc warnings
+1 COMPILE
    +1 HEAD compiles
    +1 patch compiles
    +1 the patch does not seem to introduce new javac warnings
+1 BACKWARDS_COMPATIBILITY
    +1 the patch does not change any JPA Entity/Colum/Basic/Lob/Transient annotations
    +1 the patch does not modify JPA files
-1 TESTS - patch does not compile, cannot run testcases
+1 DISTRO
    +1 distro tarball builds with the patch 

----------------------------
-1 Overall result, please check the reported -1(s)


The full output of the test-patch run is available at

   https://builds.apache.org/job/oozie-trunk-precommit-build/3229/

Adding comment to JIRA
Comment added.

test-patch exit code: 1

Build step 'Execute shell' marked build as failure
Archiving artifacts
Compressed 490.49 KB of artifacts by 39.1% relative to #3212
Recording test results

Build failed in Jenkins: oozie-trunk-precommit-build #3228

Posted by Apache Jenkins Server <je...@builds.apache.org>.
See <https://builds.apache.org/job/oozie-trunk-precommit-build/3228/changes>

Changes:

[rkanter] OOZIE-2081 WorkflowJob notification to include coordinator action id

------------------------------------------
[...truncated 5457 lines...]
[INFO] --- maven-compiler-plugin:2.3.2:compile (default-compile) @ oozie-tools ---
[INFO] Nothing to compile - all classes are up to date
[INFO] 
[INFO] --- maven-resources-plugin:2.5:testResources (default-testResources) @ oozie-tools ---
[debug] execute contextualize
[INFO] Using 'UTF-8' encoding to copy filtered resources.
[INFO] Copying 2 resources
[INFO] Copying 3 resources
[INFO] 
[INFO] --- maven-compiler-plugin:2.3.2:testCompile (default-testCompile) @ oozie-tools ---
[INFO] Nothing to compile - all classes are up to date
[INFO] 
[INFO] --- maven-surefire-plugin:2.12.2:test (default-test) @ oozie-tools ---
[INFO] Tests are skipped.
[INFO] 
[INFO] --- maven-jar-plugin:2.3.1:jar (default-jar) @ oozie-tools ---
[INFO] Building jar: <https://builds.apache.org/job/oozie-trunk-precommit-build/ws/tools/target/oozie-tools-4.3.0-SNAPSHOT.jar>
[INFO] 
[INFO] --- maven-site-plugin:2.0-beta-6:attach-descriptor (attach-descriptor) @ oozie-tools ---
[INFO] 
[INFO] --- maven-assembly-plugin:2.2.1:single (default-cli) @ oozie-tools ---
[INFO] Reading assembly descriptor: ../src/main/assemblies/tools.xml
[WARNING] The following patterns were never triggered in this artifact exclusion filter:
o  '*:*:pom:*'

[INFO] Copying files to <https://builds.apache.org/job/oozie-trunk-precommit-build/ws/tools/target/oozie-tools-4.3.0-SNAPSHOT-tools>
[WARNING] Assembly file: <https://builds.apache.org/job/oozie-trunk-precommit-build/ws/tools/target/oozie-tools-4.3.0-SNAPSHOT-tools> is not a regular file (it may be a directory). It cannot be attached to the project build for installation or deployment.
[INFO]                                                                         
[INFO] ------------------------------------------------------------------------
[INFO] Building Apache Oozie MiniOozie 4.3.0-SNAPSHOT
[INFO] ------------------------------------------------------------------------
[INFO] 
[INFO] --- maven-remote-resources-plugin:1.5:process (default) @ oozie-mini ---
[INFO] 
[INFO] --- maven-resources-plugin:2.5:resources (default-resources) @ oozie-mini ---
[debug] execute contextualize
[INFO] Using 'UTF-8' encoding to copy filtered resources.
[INFO] skip non existing resourceDirectory <https://builds.apache.org/job/oozie-trunk-precommit-build/ws/minitest/src/main/resources>
[INFO] Copying 3 resources
[INFO] 
[INFO] --- maven-compiler-plugin:2.3.2:compile (default-compile) @ oozie-mini ---
[INFO] No sources to compile
[INFO] 
[INFO] --- maven-resources-plugin:2.5:testResources (default-testResources) @ oozie-mini ---
[debug] execute contextualize
[INFO] Using 'UTF-8' encoding to copy filtered resources.
[INFO] Copying 3 resources
[INFO] Copying 3 resources
[INFO] 
[INFO] --- maven-compiler-plugin:2.3.2:testCompile (default-testCompile) @ oozie-mini ---
[INFO] Nothing to compile - all classes are up to date
[INFO] 
[INFO] --- maven-surefire-plugin:2.12.2:test (default-test) @ oozie-mini ---
[INFO] Tests are skipped.
[INFO] 
[INFO] --- maven-jar-plugin:2.3.1:jar (default-jar) @ oozie-mini ---
[INFO] Building jar: <https://builds.apache.org/job/oozie-trunk-precommit-build/ws/minitest/target/oozie-mini-4.3.0-SNAPSHOT.jar>
[INFO] 
[INFO] --- maven-site-plugin:2.0-beta-6:attach-descriptor (attach-descriptor) @ oozie-mini ---
[INFO] 
[INFO] --- maven-assembly-plugin:2.2.1:single (default-cli) @ oozie-mini ---
[INFO] Reading assembly descriptor: src/main/assemblies/empty.xml
[INFO]                                                                         
[INFO] ------------------------------------------------------------------------
[INFO] Building Apache Oozie Distro 4.3.0-SNAPSHOT
[INFO] ------------------------------------------------------------------------
[INFO] 
[INFO] --- maven-remote-resources-plugin:1.5:process (default) @ oozie-distro ---
[INFO] 
[INFO] --- maven-resources-plugin:2.5:resources (default-resources) @ oozie-distro ---
[debug] execute contextualize
[INFO] Using 'UTF-8' encoding to copy filtered resources.
[INFO] skip non existing resourceDirectory <https://builds.apache.org/job/oozie-trunk-precommit-build/ws/distro/src/main/resources>
[INFO] Copying 3 resources
[INFO] 
[INFO] --- maven-compiler-plugin:2.3.2:compile (default-compile) @ oozie-distro ---
[INFO] No sources to compile
[INFO] 
[INFO] --- maven-resources-plugin:2.5:testResources (default-testResources) @ oozie-distro ---
[debug] execute contextualize
[INFO] Using 'UTF-8' encoding to copy filtered resources.
[INFO] skip non existing resourceDirectory <https://builds.apache.org/job/oozie-trunk-precommit-build/ws/distro/src/test/resources>
[INFO] Copying 3 resources
[INFO] 
[INFO] --- maven-compiler-plugin:2.3.2:testCompile (default-testCompile) @ oozie-distro ---
[INFO] No sources to compile
[INFO] 
[INFO] --- maven-surefire-plugin:2.12.2:test (default-test) @ oozie-distro ---
[INFO] Tests are skipped.
[INFO] 
[INFO] --- maven-jar-plugin:2.3.1:jar (default-jar) @ oozie-distro ---
[INFO] Building jar: <https://builds.apache.org/job/oozie-trunk-precommit-build/ws/distro/target/oozie-distro-4.3.0-SNAPSHOT.jar>
[INFO] 
[INFO] --- maven-site-plugin:2.0-beta-6:attach-descriptor (attach-descriptor) @ oozie-distro ---
[INFO] 
[INFO] --- maven-antrun-plugin:1.6:run (default) @ oozie-distro ---
[INFO] Executing tasks

main:
      [get] Getting: http://archive.apache.org/dist/tomcat/tomcat-6/v6.0.44/bin/apache-tomcat-6.0.44.tar.gz
      [get] To: <https://builds.apache.org/job/oozie-trunk-precommit-build/ws/distro/downloads/tomcat-6.0.44.tar.gz>
.......................................................................................................................................................................................................................................................................................................................................................................................................................................................
    [mkdir] Created dir: <https://builds.apache.org/job/oozie-trunk-precommit-build/ws/distro/target/tomcat>
   [gunzip] Expanding <https://builds.apache.org/job/oozie-trunk-precommit-build/ws/distro/downloads/tomcat-6.0.44.tar.gz> to <https://builds.apache.org/job/oozie-trunk-precommit-build/ws/distro/target/tomcat/tomcat-6.0.44.tar>
    [untar] Expanding: <https://builds.apache.org/job/oozie-trunk-precommit-build/ws/distro/target/tomcat/tomcat-6.0.44.tar> into <https://builds.apache.org/job/oozie-trunk-precommit-build/ws/distro/target/tomcat>
   [delete] Deleting directory <https://builds.apache.org/job/oozie-trunk-precommit-build/ws/distro/target/tomcat/oozie-server/webapps>
    [mkdir] Created dir: <https://builds.apache.org/job/oozie-trunk-precommit-build/ws/distro/target/tomcat/oozie-server/webapps>
   [delete] Deleting: <https://builds.apache.org/job/oozie-trunk-precommit-build/ws/distro/target/tomcat/oozie-server/conf/server.xml>
     [copy] Copying 1 file to <https://builds.apache.org/job/oozie-trunk-precommit-build/ws/distro/target/tomcat/oozie-server/conf>
     [copy] Copying 1 file to <https://builds.apache.org/job/oozie-trunk-precommit-build/ws/distro/target/tomcat/oozie-server/conf>
    [mkdir] Created dir: <https://builds.apache.org/job/oozie-trunk-precommit-build/ws/distro/target/tomcat/oozie-server/conf/ssl>
     [copy] Copying 1 file to <https://builds.apache.org/job/oozie-trunk-precommit-build/ws/distro/target/tomcat/oozie-server/conf/ssl>
     [copy] Copying 1 file to <https://builds.apache.org/job/oozie-trunk-precommit-build/ws/distro/target/tomcat/oozie-server/conf/ssl>
     [copy] Copying 1 file to <https://builds.apache.org/job/oozie-trunk-precommit-build/ws/distro/target/tomcat/oozie-server/conf/ssl>
     [copy] Copying 3 files to <https://builds.apache.org/job/oozie-trunk-precommit-build/ws/distro/target/tomcat/oozie-server/webapps/ROOT>
[INFO] Executed tasks
[INFO] 
[INFO] --- maven-assembly-plugin:2.2.1:single (default-cli) @ oozie-distro ---
[INFO] Reading assembly descriptor: ../src/main/assemblies/distro.xml
[INFO] Copying files to <https://builds.apache.org/job/oozie-trunk-precommit-build/ws/distro/target/oozie-4.3.0-SNAPSHOT-distro>
[WARNING] Assembly file: <https://builds.apache.org/job/oozie-trunk-precommit-build/ws/distro/target/oozie-4.3.0-SNAPSHOT-distro> is not a regular file (it may be a directory). It cannot be attached to the project build for installation or deployment.
[INFO] Building tar : <https://builds.apache.org/job/oozie-trunk-precommit-build/ws/distro/target/oozie-4.3.0-SNAPSHOT-distro.tar.gz>
[INFO]                                                                         
[INFO] ------------------------------------------------------------------------
[INFO] Building Apache Oozie ZooKeeper Security Tests 4.3.0-SNAPSHOT
[INFO] ------------------------------------------------------------------------
[INFO] 
[INFO] --- maven-remote-resources-plugin:1.5:process (default) @ oozie-zookeeper-security-tests ---
[INFO] 
[INFO] --- maven-resources-plugin:2.5:resources (default-resources) @ oozie-zookeeper-security-tests ---
[debug] execute contextualize
[INFO] Using 'UTF-8' encoding to copy filtered resources.
[INFO] skip non existing resourceDirectory <https://builds.apache.org/job/oozie-trunk-precommit-build/ws/zookeeper-security-tests/src/main/resources>
[INFO] Copying 3 resources
[INFO] 
[INFO] --- maven-compiler-plugin:2.3.2:compile (default-compile) @ oozie-zookeeper-security-tests ---
[INFO] No sources to compile
[INFO] 
[INFO] --- maven-resources-plugin:2.5:testResources (default-testResources) @ oozie-zookeeper-security-tests ---
[debug] execute contextualize
[INFO] Using 'UTF-8' encoding to copy filtered resources.
[INFO] skip non existing resourceDirectory <https://builds.apache.org/job/oozie-trunk-precommit-build/ws/zookeeper-security-tests/src/test/resources>
[INFO] Copying 3 resources
[INFO] 
[INFO] --- maven-compiler-plugin:2.3.2:testCompile (default-testCompile) @ oozie-zookeeper-security-tests ---
[INFO] Nothing to compile - all classes are up to date
[INFO] 
[INFO] --- maven-surefire-plugin:2.12.2:test (default-test) @ oozie-zookeeper-security-tests ---
[INFO] Tests are skipped.
[INFO] 
[INFO] --- maven-jar-plugin:2.3.1:jar (default-jar) @ oozie-zookeeper-security-tests ---
[INFO] Building jar: <https://builds.apache.org/job/oozie-trunk-precommit-build/ws/zookeeper-security-tests/target/oozie-zookeeper-security-tests-4.3.0-SNAPSHOT.jar>
[INFO] 
[INFO] --- maven-site-plugin:2.0-beta-6:attach-descriptor (attach-descriptor) @ oozie-zookeeper-security-tests ---
[INFO] 
[INFO] --- maven-assembly-plugin:2.2.1:single (default-cli) @ oozie-zookeeper-security-tests ---
[INFO] Reading assembly descriptor: src/main/assemblies/empty.xml
[INFO] ------------------------------------------------------------------------
[INFO] Reactor Summary:
[INFO] 
[INFO] Apache Oozie Main .................................. SUCCESS [  1.853 s]
[INFO] Apache Oozie Hadoop Utils .......................... SUCCESS [  0.749 s]
[INFO] Apache Oozie Hadoop Distcp hadoop-1-4.3.0-SNAPSHOT . SUCCESS [  0.107 s]
[INFO] Apache Oozie Hadoop Auth hadoop-1-4.3.0-SNAPSHOT ... SUCCESS [  0.208 s]
[INFO] Apache Oozie Hadoop Libs ........................... SUCCESS [  0.026 s]
[INFO] Apache Oozie Client ................................ SUCCESS [ 16.794 s]
[INFO] Apache Oozie Share Lib Oozie ....................... SUCCESS [  1.050 s]
[INFO] Apache Oozie Share Lib HCatalog .................... SUCCESS [  1.492 s]
[INFO] Apache Oozie Share Lib Distcp ...................... SUCCESS [  0.256 s]
[INFO] Apache Oozie Core .................................. SUCCESS [ 43.683 s]
[INFO] Apache Oozie Share Lib Streaming ................... SUCCESS [  2.084 s]
[INFO] Apache Oozie Share Lib Pig ......................... SUCCESS [  1.387 s]
[INFO] Apache Oozie Share Lib Hive ........................ SUCCESS [  3.475 s]
[INFO] Apache Oozie Share Lib Hive 2 ...................... SUCCESS [  2.577 s]
[INFO] Apache Oozie Share Lib Sqoop ....................... SUCCESS [  0.510 s]
[INFO] Apache Oozie Examples .............................. SUCCESS [  2.249 s]
[INFO] Apache Oozie Share Lib Spark ....................... SUCCESS [  8.350 s]
[INFO] Apache Oozie Share Lib ............................. SUCCESS [ 18.161 s]
[INFO] Apache Oozie Docs .................................. SUCCESS [ 11.727 s]
[INFO] Apache Oozie WebApp ................................ SUCCESS [ 29.740 s]
[INFO] Apache Oozie Tools ................................. SUCCESS [  0.765 s]
[INFO] Apache Oozie MiniOozie ............................. SUCCESS [  0.332 s]
[INFO] Apache Oozie Distro ................................ SUCCESS [ 29.437 s]
[INFO] Apache Oozie ZooKeeper Security Tests .............. SUCCESS [  2.444 s]
[INFO] ------------------------------------------------------------------------
[INFO] BUILD SUCCESS
[INFO] ------------------------------------------------------------------------
[INFO] Total time: 03:01 min
[INFO] Finished at: 2016-08-17T08:52:09+00:00
[INFO] Final Memory: 76M/1026M
[INFO] ------------------------------------------------------------------------

Reports
  Running test-patch task CLEAN
  Running test-patch task RAW_PATCH_ANALYSIS
  Running test-patch task RAT
  Running test-patch task JAVADOC
  Running test-patch task COMPILE
  Running test-patch task BACKWARDS_COMPATIBILITY
  Running test-patch task TESTS
  Running test-patch task DISTRO


Testing JIRA OOZIE-2231

Cleaning local git workspace

----------------------------

+1 PATCH_APPLIES
+1 CLEAN
-1 RAW_PATCH_ANALYSIS
    +1 the patch does not introduce any @author tags
    +1 the patch does not introduce any tabs
    +1 the patch does not introduce any trailing spaces
    +1 the patch does not introduce any line longer than 132
    -1 the patch does not add/modify any testcase
+1 RAT
    +1 the patch does not seem to introduce new RAT warnings
+1 JAVADOC
    +1 the patch does not seem to introduce new Javadoc warnings
+1 COMPILE
    +1 HEAD compiles
    +1 patch compiles
    +1 the patch does not seem to introduce new javac warnings
+1 BACKWARDS_COMPATIBILITY
    +1 the patch does not change any JPA Entity/Colum/Basic/Lob/Transient annotations
    +1 the patch does not modify JPA files
-1 TESTS - patch does not compile, cannot run testcases
+1 DISTRO
    +1 distro tarball builds with the patch 

----------------------------
-1 Overall result, please check the reported -1(s)


The full output of the test-patch run is available at

   https://builds.apache.org/job/oozie-trunk-precommit-build/3228/

Adding comment to JIRA
Comment added.

test-patch exit code: 1

Build step 'Execute shell' marked build as failure
Archiving artifacts
Compressed 503.21 KB of artifacts by 38.2% relative to #3212
Recording test results

Build failed in Jenkins: oozie-trunk-precommit-build #3227

Posted by Apache Jenkins Server <je...@builds.apache.org>.
See <https://builds.apache.org/job/oozie-trunk-precommit-build/3227/>

------------------------------------------
[...truncated 6239 lines...]
[INFO] 
[INFO] --- maven-compiler-plugin:2.3.2:testCompile (default-testCompile) @ oozie-tools ---
[INFO] Nothing to compile - all classes are up to date
[INFO] 
[INFO] --- maven-surefire-plugin:2.12.2:test (default-test) @ oozie-tools ---
[INFO] Tests are skipped.
[INFO] 
[INFO] --- maven-jar-plugin:2.3.1:jar (default-jar) @ oozie-tools ---
[INFO] Building jar: <https://builds.apache.org/job/oozie-trunk-precommit-build/ws/tools/target/oozie-tools-4.3.0-SNAPSHOT.jar>
[INFO] 
[INFO] --- maven-site-plugin:2.0-beta-6:attach-descriptor (attach-descriptor) @ oozie-tools ---
[INFO] 
[INFO] --- maven-assembly-plugin:2.2.1:single (default-cli) @ oozie-tools ---
[INFO] Reading assembly descriptor: ../src/main/assemblies/tools.xml
[WARNING] The following patterns were never triggered in this artifact exclusion filter:
o  '*:*:pom:*'

[INFO] Copying files to <https://builds.apache.org/job/oozie-trunk-precommit-build/ws/tools/target/oozie-tools-4.3.0-SNAPSHOT-tools>
[WARNING] Assembly file: <https://builds.apache.org/job/oozie-trunk-precommit-build/ws/tools/target/oozie-tools-4.3.0-SNAPSHOT-tools> is not a regular file (it may be a directory). It cannot be attached to the project build for installation or deployment.
[INFO]                                                                         
[INFO] ------------------------------------------------------------------------
[INFO] Building Apache Oozie MiniOozie 4.3.0-SNAPSHOT
[INFO] ------------------------------------------------------------------------
[INFO] 
[INFO] --- maven-remote-resources-plugin:1.5:process (default) @ oozie-mini ---
[INFO] 
[INFO] --- maven-resources-plugin:2.5:resources (default-resources) @ oozie-mini ---
[debug] execute contextualize
[INFO] Using 'UTF-8' encoding to copy filtered resources.
[INFO] skip non existing resourceDirectory <https://builds.apache.org/job/oozie-trunk-precommit-build/ws/minitest/src/main/resources>
[INFO] Copying 3 resources
[INFO] 
[INFO] --- maven-compiler-plugin:2.3.2:compile (default-compile) @ oozie-mini ---
[INFO] No sources to compile
[INFO] 
[INFO] --- maven-resources-plugin:2.5:testResources (default-testResources) @ oozie-mini ---
[debug] execute contextualize
[INFO] Using 'UTF-8' encoding to copy filtered resources.
[INFO] Copying 3 resources
[INFO] Copying 3 resources
[INFO] 
[INFO] --- maven-compiler-plugin:2.3.2:testCompile (default-testCompile) @ oozie-mini ---
[INFO] Nothing to compile - all classes are up to date
[INFO] 
[INFO] --- maven-surefire-plugin:2.12.2:test (default-test) @ oozie-mini ---
[INFO] Tests are skipped.
[INFO] 
[INFO] --- maven-jar-plugin:2.3.1:jar (default-jar) @ oozie-mini ---
[INFO] Building jar: <https://builds.apache.org/job/oozie-trunk-precommit-build/ws/minitest/target/oozie-mini-4.3.0-SNAPSHOT.jar>
[INFO] 
[INFO] --- maven-site-plugin:2.0-beta-6:attach-descriptor (attach-descriptor) @ oozie-mini ---
[INFO] 
[INFO] --- maven-assembly-plugin:2.2.1:single (default-cli) @ oozie-mini ---
[INFO] Reading assembly descriptor: src/main/assemblies/empty.xml
[INFO]                                                                         
[INFO] ------------------------------------------------------------------------
[INFO] Building Apache Oozie Distro 4.3.0-SNAPSHOT
[INFO] ------------------------------------------------------------------------
[INFO] 
[INFO] --- maven-remote-resources-plugin:1.5:process (default) @ oozie-distro ---
[INFO] 
[INFO] --- maven-resources-plugin:2.5:resources (default-resources) @ oozie-distro ---
[debug] execute contextualize
[INFO] Using 'UTF-8' encoding to copy filtered resources.
[INFO] skip non existing resourceDirectory <https://builds.apache.org/job/oozie-trunk-precommit-build/ws/distro/src/main/resources>
[INFO] Copying 3 resources
[INFO] 
[INFO] --- maven-compiler-plugin:2.3.2:compile (default-compile) @ oozie-distro ---
[INFO] No sources to compile
[INFO] 
[INFO] --- maven-resources-plugin:2.5:testResources (default-testResources) @ oozie-distro ---
[debug] execute contextualize
[INFO] Using 'UTF-8' encoding to copy filtered resources.
[INFO] skip non existing resourceDirectory <https://builds.apache.org/job/oozie-trunk-precommit-build/ws/distro/src/test/resources>
[INFO] Copying 3 resources
[INFO] 
[INFO] --- maven-compiler-plugin:2.3.2:testCompile (default-testCompile) @ oozie-distro ---
[INFO] No sources to compile
[INFO] 
[INFO] --- maven-surefire-plugin:2.12.2:test (default-test) @ oozie-distro ---
[INFO] Tests are skipped.
[INFO] 
[INFO] --- maven-jar-plugin:2.3.1:jar (default-jar) @ oozie-distro ---
[INFO] Building jar: <https://builds.apache.org/job/oozie-trunk-precommit-build/ws/distro/target/oozie-distro-4.3.0-SNAPSHOT.jar>
[INFO] 
[INFO] --- maven-site-plugin:2.0-beta-6:attach-descriptor (attach-descriptor) @ oozie-distro ---
[INFO] 
[INFO] --- maven-antrun-plugin:1.6:run (default) @ oozie-distro ---
[INFO] Executing tasks

main:
      [get] Getting: http://archive.apache.org/dist/tomcat/tomcat-6/v6.0.44/bin/apache-tomcat-6.0.44.tar.gz
      [get] To: <https://builds.apache.org/job/oozie-trunk-precommit-build/ws/distro/downloads/tomcat-6.0.44.tar.gz>
......................................................................................................................................................................................................................................................................................................................................................
    [mkdir] Created dir: <https://builds.apache.org/job/oozie-trunk-precommit-build/ws/distro/target/tomcat>
   [gunzip] Expanding <https://builds.apache.org/job/oozie-trunk-precommit-build/ws/distro/downloads/tomcat-6.0.44.tar.gz> to <https://builds.apache.org/job/oozie-trunk-precommit-build/ws/distro/target/tomcat/tomcat-6.0.44.tar>
    [untar] Expanding: <https://builds.apache.org/job/oozie-trunk-precommit-build/ws/distro/target/tomcat/tomcat-6.0.44.tar> into <https://builds.apache.org/job/oozie-trunk-precommit-build/ws/distro/target/tomcat>
   [delete] Deleting directory <https://builds.apache.org/job/oozie-trunk-precommit-build/ws/distro/target/tomcat/oozie-server/webapps>
    [mkdir] Created dir: <https://builds.apache.org/job/oozie-trunk-precommit-build/ws/distro/target/tomcat/oozie-server/webapps>
   [delete] Deleting: <https://builds.apache.org/job/oozie-trunk-precommit-build/ws/distro/target/tomcat/oozie-server/conf/server.xml>
     [copy] Copying 1 file to <https://builds.apache.org/job/oozie-trunk-precommit-build/ws/distro/target/tomcat/oozie-server/conf>
     [copy] Copying 1 file to <https://builds.apache.org/job/oozie-trunk-precommit-build/ws/distro/target/tomcat/oozie-server/conf>
    [mkdir] Created dir: <https://builds.apache.org/job/oozie-trunk-precommit-build/ws/distro/target/tomcat/oozie-server/conf/ssl>
     [copy] Copying 1 file to <https://builds.apache.org/job/oozie-trunk-precommit-build/ws/distro/target/tomcat/oozie-server/conf/ssl>
     [copy] Copying 1 file to <https://builds.apache.org/job/oozie-trunk-precommit-build/ws/distro/target/tomcat/oozie-server/conf/ssl>
     [copy] Copying 1 file to <https://builds.apache.org/job/oozie-trunk-precommit-build/ws/distro/target/tomcat/oozie-server/conf/ssl>
     [copy] Copying 3 files to <https://builds.apache.org/job/oozie-trunk-precommit-build/ws/distro/target/tomcat/oozie-server/webapps/ROOT>
[INFO] Executed tasks
[INFO] 
[INFO] --- maven-assembly-plugin:2.2.1:single (default-cli) @ oozie-distro ---
[INFO] Reading assembly descriptor: ../src/main/assemblies/distro.xml
[INFO] Copying files to <https://builds.apache.org/job/oozie-trunk-precommit-build/ws/distro/target/oozie-4.3.0-SNAPSHOT-distro>
[WARNING] Assembly file: <https://builds.apache.org/job/oozie-trunk-precommit-build/ws/distro/target/oozie-4.3.0-SNAPSHOT-distro> is not a regular file (it may be a directory). It cannot be attached to the project build for installation or deployment.
[INFO] Building tar : <https://builds.apache.org/job/oozie-trunk-precommit-build/ws/distro/target/oozie-4.3.0-SNAPSHOT-distro.tar.gz>
[INFO]                                                                         
[INFO] ------------------------------------------------------------------------
[INFO] Building Apache Oozie ZooKeeper Security Tests 4.3.0-SNAPSHOT
[INFO] ------------------------------------------------------------------------
[INFO] 
[INFO] --- maven-remote-resources-plugin:1.5:process (default) @ oozie-zookeeper-security-tests ---
[INFO] 
[INFO] --- maven-resources-plugin:2.5:resources (default-resources) @ oozie-zookeeper-security-tests ---
[debug] execute contextualize
[INFO] Using 'UTF-8' encoding to copy filtered resources.
[INFO] skip non existing resourceDirectory <https://builds.apache.org/job/oozie-trunk-precommit-build/ws/zookeeper-security-tests/src/main/resources>
[INFO] Copying 3 resources
[INFO] 
[INFO] --- maven-compiler-plugin:2.3.2:compile (default-compile) @ oozie-zookeeper-security-tests ---
[INFO] No sources to compile
[INFO] 
[INFO] --- maven-resources-plugin:2.5:testResources (default-testResources) @ oozie-zookeeper-security-tests ---
[debug] execute contextualize
[INFO] Using 'UTF-8' encoding to copy filtered resources.
[INFO] skip non existing resourceDirectory <https://builds.apache.org/job/oozie-trunk-precommit-build/ws/zookeeper-security-tests/src/test/resources>
[INFO] Copying 3 resources
[INFO] 
[INFO] --- maven-compiler-plugin:2.3.2:testCompile (default-testCompile) @ oozie-zookeeper-security-tests ---
[INFO] Nothing to compile - all classes are up to date
[INFO] 
[INFO] --- maven-surefire-plugin:2.12.2:test (default-test) @ oozie-zookeeper-security-tests ---
[INFO] Tests are skipped.
[INFO] 
[INFO] --- maven-jar-plugin:2.3.1:jar (default-jar) @ oozie-zookeeper-security-tests ---
[INFO] Building jar: <https://builds.apache.org/job/oozie-trunk-precommit-build/ws/zookeeper-security-tests/target/oozie-zookeeper-security-tests-4.3.0-SNAPSHOT.jar>
[INFO] 
[INFO] --- maven-site-plugin:2.0-beta-6:attach-descriptor (attach-descriptor) @ oozie-zookeeper-security-tests ---
[INFO] 
[INFO] --- maven-assembly-plugin:2.2.1:single (default-cli) @ oozie-zookeeper-security-tests ---
[INFO] Reading assembly descriptor: src/main/assemblies/empty.xml
[INFO] ------------------------------------------------------------------------
[INFO] Reactor Summary:
[INFO] 
[INFO] Apache Oozie Main .................................. SUCCESS [  1.658 s]
[INFO] Apache Oozie Hadoop Utils .......................... SUCCESS [  0.700 s]
[INFO] Apache Oozie Hadoop Distcp hadoop-1-4.3.0-SNAPSHOT . SUCCESS [  0.108 s]
[INFO] Apache Oozie Hadoop Auth hadoop-1-4.3.0-SNAPSHOT ... SUCCESS [  0.197 s]
[INFO] Apache Oozie Hadoop Libs ........................... SUCCESS [  0.021 s]
[INFO] Apache Oozie Client ................................ SUCCESS [ 27.540 s]
[INFO] Apache Oozie Share Lib Oozie ....................... SUCCESS [  1.028 s]
[INFO] Apache Oozie Share Lib HCatalog .................... SUCCESS [  1.531 s]
[INFO] Apache Oozie Share Lib Distcp ...................... SUCCESS [  0.263 s]
[INFO] Apache Oozie Core .................................. SUCCESS [ 39.714 s]
[INFO] Apache Oozie Share Lib Streaming ................... SUCCESS [  1.874 s]
[INFO] Apache Oozie Share Lib Pig ......................... SUCCESS [  1.047 s]
[INFO] Apache Oozie Share Lib Hive ........................ SUCCESS [  3.249 s]
[INFO] Apache Oozie Share Lib Hive 2 ...................... SUCCESS [  2.517 s]
[INFO] Apache Oozie Share Lib Sqoop ....................... SUCCESS [  0.511 s]
[INFO] Apache Oozie Examples .............................. SUCCESS [  2.249 s]
[INFO] Apache Oozie Share Lib Spark ....................... SUCCESS [  5.998 s]
[INFO] Apache Oozie Share Lib ............................. SUCCESS [ 17.805 s]
[INFO] Apache Oozie Docs .................................. SUCCESS [ 11.611 s]
[INFO] Apache Oozie WebApp ................................ SUCCESS [ 28.785 s]
[INFO] Apache Oozie Tools ................................. SUCCESS [  0.729 s]
[INFO] Apache Oozie MiniOozie ............................. SUCCESS [  0.321 s]
[INFO] Apache Oozie Distro ................................ SUCCESS [ 39.514 s]
[INFO] Apache Oozie ZooKeeper Security Tests .............. SUCCESS [  2.459 s]
[INFO] ------------------------------------------------------------------------
[INFO] BUILD SUCCESS
[INFO] ------------------------------------------------------------------------
[INFO] Total time: 03:13 min
[INFO] Finished at: 2016-08-15T20:55:21+00:00
[INFO] Final Memory: 76M/1034M
[INFO] ------------------------------------------------------------------------

Reports
  Running test-patch task CLEAN
  Running test-patch task RAW_PATCH_ANALYSIS
  Running test-patch task RAT
  Running test-patch task JAVADOC
  Running test-patch task COMPILE
  Running test-patch task BACKWARDS_COMPATIBILITY
  Running test-patch task TESTS
  Running test-patch task DISTRO


Testing JIRA OOZIE-2635

Cleaning local git workspace

----------------------------

+1 PATCH_APPLIES
+1 CLEAN
-1 RAW_PATCH_ANALYSIS
    +1 the patch does not introduce any @author tags
    +1 the patch does not introduce any tabs
    +1 the patch does not introduce any trailing spaces
    +1 the patch does not introduce any line longer than 132
    -1 the patch does not add/modify any testcase
+1 RAT
    +1 the patch does not seem to introduce new RAT warnings
+1 JAVADOC
    +1 the patch does not seem to introduce new Javadoc warnings
+1 COMPILE
    +1 HEAD compiles
    +1 patch compiles
    +1 the patch does not seem to introduce new javac warnings
+1 BACKWARDS_COMPATIBILITY
    +1 the patch does not change any JPA Entity/Colum/Basic/Lob/Transient annotations
    +1 the patch does not modify JPA files
-1 TESTS
    Tests run: 1792
    Tests failed: 1
    Tests errors: 0

    The patch failed the following testcases:

      testCoordStatus_Failed(org.apache.oozie.command.coord.TestCoordChangeXCommand)

+1 DISTRO
    +1 distro tarball builds with the patch 

----------------------------
-1 Overall result, please check the reported -1(s)


The full output of the test-patch run is available at

   https://builds.apache.org/job/oozie-trunk-precommit-build/3227/

Adding comment to JIRA
Comment added.

test-patch exit code: 1

Build step 'Execute shell' marked build as failure
Archiving artifacts
Compressed 491.24 KB of artifacts by 39.1% relative to #3212
Recording test results

Build failed in Jenkins: oozie-trunk-precommit-build #3226

Posted by Apache Jenkins Server <je...@builds.apache.org>.
See <https://builds.apache.org/job/oozie-trunk-precommit-build/3226/>

------------------------------------------
[...truncated 6267 lines...]
[INFO] 
[INFO] --- maven-compiler-plugin:2.3.2:testCompile (default-testCompile) @ oozie-tools ---
[INFO] Nothing to compile - all classes are up to date
[INFO] 
[INFO] --- maven-surefire-plugin:2.12.2:test (default-test) @ oozie-tools ---
[INFO] Tests are skipped.
[INFO] 
[INFO] --- maven-jar-plugin:2.3.1:jar (default-jar) @ oozie-tools ---
[INFO] Building jar: <https://builds.apache.org/job/oozie-trunk-precommit-build/ws/tools/target/oozie-tools-4.3.0-SNAPSHOT.jar>
[INFO] 
[INFO] --- maven-site-plugin:2.0-beta-6:attach-descriptor (attach-descriptor) @ oozie-tools ---
[INFO] 
[INFO] --- maven-assembly-plugin:2.2.1:single (default-cli) @ oozie-tools ---
[INFO] Reading assembly descriptor: ../src/main/assemblies/tools.xml
[WARNING] The following patterns were never triggered in this artifact exclusion filter:
o  '*:*:pom:*'

[INFO] Copying files to <https://builds.apache.org/job/oozie-trunk-precommit-build/ws/tools/target/oozie-tools-4.3.0-SNAPSHOT-tools>
[WARNING] Assembly file: <https://builds.apache.org/job/oozie-trunk-precommit-build/ws/tools/target/oozie-tools-4.3.0-SNAPSHOT-tools> is not a regular file (it may be a directory). It cannot be attached to the project build for installation or deployment.
[INFO]                                                                         
[INFO] ------------------------------------------------------------------------
[INFO] Building Apache Oozie MiniOozie 4.3.0-SNAPSHOT
[INFO] ------------------------------------------------------------------------
[INFO] 
[INFO] --- maven-remote-resources-plugin:1.5:process (default) @ oozie-mini ---
[INFO] 
[INFO] --- maven-resources-plugin:2.5:resources (default-resources) @ oozie-mini ---
[debug] execute contextualize
[INFO] Using 'UTF-8' encoding to copy filtered resources.
[INFO] skip non existing resourceDirectory <https://builds.apache.org/job/oozie-trunk-precommit-build/ws/minitest/src/main/resources>
[INFO] Copying 3 resources
[INFO] 
[INFO] --- maven-compiler-plugin:2.3.2:compile (default-compile) @ oozie-mini ---
[INFO] No sources to compile
[INFO] 
[INFO] --- maven-resources-plugin:2.5:testResources (default-testResources) @ oozie-mini ---
[debug] execute contextualize
[INFO] Using 'UTF-8' encoding to copy filtered resources.
[INFO] Copying 3 resources
[INFO] Copying 3 resources
[INFO] 
[INFO] --- maven-compiler-plugin:2.3.2:testCompile (default-testCompile) @ oozie-mini ---
[INFO] Nothing to compile - all classes are up to date
[INFO] 
[INFO] --- maven-surefire-plugin:2.12.2:test (default-test) @ oozie-mini ---
[INFO] Tests are skipped.
[INFO] 
[INFO] --- maven-jar-plugin:2.3.1:jar (default-jar) @ oozie-mini ---
[INFO] Building jar: <https://builds.apache.org/job/oozie-trunk-precommit-build/ws/minitest/target/oozie-mini-4.3.0-SNAPSHOT.jar>
[INFO] 
[INFO] --- maven-site-plugin:2.0-beta-6:attach-descriptor (attach-descriptor) @ oozie-mini ---
[INFO] 
[INFO] --- maven-assembly-plugin:2.2.1:single (default-cli) @ oozie-mini ---
[INFO] Reading assembly descriptor: src/main/assemblies/empty.xml
[INFO]                                                                         
[INFO] ------------------------------------------------------------------------
[INFO] Building Apache Oozie Distro 4.3.0-SNAPSHOT
[INFO] ------------------------------------------------------------------------
[INFO] 
[INFO] --- maven-remote-resources-plugin:1.5:process (default) @ oozie-distro ---
[INFO] 
[INFO] --- maven-resources-plugin:2.5:resources (default-resources) @ oozie-distro ---
[debug] execute contextualize
[INFO] Using 'UTF-8' encoding to copy filtered resources.
[INFO] skip non existing resourceDirectory <https://builds.apache.org/job/oozie-trunk-precommit-build/ws/distro/src/main/resources>
[INFO] Copying 3 resources
[INFO] 
[INFO] --- maven-compiler-plugin:2.3.2:compile (default-compile) @ oozie-distro ---
[INFO] No sources to compile
[INFO] 
[INFO] --- maven-resources-plugin:2.5:testResources (default-testResources) @ oozie-distro ---
[debug] execute contextualize
[INFO] Using 'UTF-8' encoding to copy filtered resources.
[INFO] skip non existing resourceDirectory <https://builds.apache.org/job/oozie-trunk-precommit-build/ws/distro/src/test/resources>
[INFO] Copying 3 resources
[INFO] 
[INFO] --- maven-compiler-plugin:2.3.2:testCompile (default-testCompile) @ oozie-distro ---
[INFO] No sources to compile
[INFO] 
[INFO] --- maven-surefire-plugin:2.12.2:test (default-test) @ oozie-distro ---
[INFO] Tests are skipped.
[INFO] 
[INFO] --- maven-jar-plugin:2.3.1:jar (default-jar) @ oozie-distro ---
[INFO] Building jar: <https://builds.apache.org/job/oozie-trunk-precommit-build/ws/distro/target/oozie-distro-4.3.0-SNAPSHOT.jar>
[INFO] 
[INFO] --- maven-site-plugin:2.0-beta-6:attach-descriptor (attach-descriptor) @ oozie-distro ---
[INFO] 
[INFO] --- maven-antrun-plugin:1.6:run (default) @ oozie-distro ---
[INFO] Executing tasks

main:
      [get] Getting: http://archive.apache.org/dist/tomcat/tomcat-6/v6.0.44/bin/apache-tomcat-6.0.44.tar.gz
      [get] To: <https://builds.apache.org/job/oozie-trunk-precommit-build/ws/distro/downloads/tomcat-6.0.44.tar.gz>
.........................................................................................................................................................................................................................................................................................................................................
    [mkdir] Created dir: <https://builds.apache.org/job/oozie-trunk-precommit-build/ws/distro/target/tomcat>
   [gunzip] Expanding <https://builds.apache.org/job/oozie-trunk-precommit-build/ws/distro/downloads/tomcat-6.0.44.tar.gz> to <https://builds.apache.org/job/oozie-trunk-precommit-build/ws/distro/target/tomcat/tomcat-6.0.44.tar>
    [untar] Expanding: <https://builds.apache.org/job/oozie-trunk-precommit-build/ws/distro/target/tomcat/tomcat-6.0.44.tar> into <https://builds.apache.org/job/oozie-trunk-precommit-build/ws/distro/target/tomcat>
   [delete] Deleting directory <https://builds.apache.org/job/oozie-trunk-precommit-build/ws/distro/target/tomcat/oozie-server/webapps>
    [mkdir] Created dir: <https://builds.apache.org/job/oozie-trunk-precommit-build/ws/distro/target/tomcat/oozie-server/webapps>
   [delete] Deleting: <https://builds.apache.org/job/oozie-trunk-precommit-build/ws/distro/target/tomcat/oozie-server/conf/server.xml>
     [copy] Copying 1 file to <https://builds.apache.org/job/oozie-trunk-precommit-build/ws/distro/target/tomcat/oozie-server/conf>
     [copy] Copying 1 file to <https://builds.apache.org/job/oozie-trunk-precommit-build/ws/distro/target/tomcat/oozie-server/conf>
    [mkdir] Created dir: <https://builds.apache.org/job/oozie-trunk-precommit-build/ws/distro/target/tomcat/oozie-server/conf/ssl>
     [copy] Copying 1 file to <https://builds.apache.org/job/oozie-trunk-precommit-build/ws/distro/target/tomcat/oozie-server/conf/ssl>
     [copy] Copying 1 file to <https://builds.apache.org/job/oozie-trunk-precommit-build/ws/distro/target/tomcat/oozie-server/conf/ssl>
     [copy] Copying 1 file to <https://builds.apache.org/job/oozie-trunk-precommit-build/ws/distro/target/tomcat/oozie-server/conf/ssl>
     [copy] Copying 3 files to <https://builds.apache.org/job/oozie-trunk-precommit-build/ws/distro/target/tomcat/oozie-server/webapps/ROOT>
[INFO] Executed tasks
[INFO] 
[INFO] --- maven-assembly-plugin:2.2.1:single (default-cli) @ oozie-distro ---
[INFO] Reading assembly descriptor: ../src/main/assemblies/distro.xml
[INFO] Copying files to <https://builds.apache.org/job/oozie-trunk-precommit-build/ws/distro/target/oozie-4.3.0-SNAPSHOT-distro>
[WARNING] Assembly file: <https://builds.apache.org/job/oozie-trunk-precommit-build/ws/distro/target/oozie-4.3.0-SNAPSHOT-distro> is not a regular file (it may be a directory). It cannot be attached to the project build for installation or deployment.
[INFO] Building tar : <https://builds.apache.org/job/oozie-trunk-precommit-build/ws/distro/target/oozie-4.3.0-SNAPSHOT-distro.tar.gz>
[INFO]                                                                         
[INFO] ------------------------------------------------------------------------
[INFO] Building Apache Oozie ZooKeeper Security Tests 4.3.0-SNAPSHOT
[INFO] ------------------------------------------------------------------------
[INFO] 
[INFO] --- maven-remote-resources-plugin:1.5:process (default) @ oozie-zookeeper-security-tests ---
[INFO] 
[INFO] --- maven-resources-plugin:2.5:resources (default-resources) @ oozie-zookeeper-security-tests ---
[debug] execute contextualize
[INFO] Using 'UTF-8' encoding to copy filtered resources.
[INFO] skip non existing resourceDirectory <https://builds.apache.org/job/oozie-trunk-precommit-build/ws/zookeeper-security-tests/src/main/resources>
[INFO] Copying 3 resources
[INFO] 
[INFO] --- maven-compiler-plugin:2.3.2:compile (default-compile) @ oozie-zookeeper-security-tests ---
[INFO] No sources to compile
[INFO] 
[INFO] --- maven-resources-plugin:2.5:testResources (default-testResources) @ oozie-zookeeper-security-tests ---
[debug] execute contextualize
[INFO] Using 'UTF-8' encoding to copy filtered resources.
[INFO] skip non existing resourceDirectory <https://builds.apache.org/job/oozie-trunk-precommit-build/ws/zookeeper-security-tests/src/test/resources>
[INFO] Copying 3 resources
[INFO] 
[INFO] --- maven-compiler-plugin:2.3.2:testCompile (default-testCompile) @ oozie-zookeeper-security-tests ---
[INFO] Nothing to compile - all classes are up to date
[INFO] 
[INFO] --- maven-surefire-plugin:2.12.2:test (default-test) @ oozie-zookeeper-security-tests ---
[INFO] Tests are skipped.
[INFO] 
[INFO] --- maven-jar-plugin:2.3.1:jar (default-jar) @ oozie-zookeeper-security-tests ---
[INFO] Building jar: <https://builds.apache.org/job/oozie-trunk-precommit-build/ws/zookeeper-security-tests/target/oozie-zookeeper-security-tests-4.3.0-SNAPSHOT.jar>
[INFO] 
[INFO] --- maven-site-plugin:2.0-beta-6:attach-descriptor (attach-descriptor) @ oozie-zookeeper-security-tests ---
[INFO] 
[INFO] --- maven-assembly-plugin:2.2.1:single (default-cli) @ oozie-zookeeper-security-tests ---
[INFO] Reading assembly descriptor: src/main/assemblies/empty.xml
[INFO] ------------------------------------------------------------------------
[INFO] Reactor Summary:
[INFO] 
[INFO] Apache Oozie Main .................................. SUCCESS [  1.556 s]
[INFO] Apache Oozie Hadoop Utils .......................... SUCCESS [  0.720 s]
[INFO] Apache Oozie Hadoop Distcp hadoop-1-4.3.0-SNAPSHOT . SUCCESS [  0.127 s]
[INFO] Apache Oozie Hadoop Auth hadoop-1-4.3.0-SNAPSHOT ... SUCCESS [  0.206 s]
[INFO] Apache Oozie Hadoop Libs ........................... SUCCESS [  0.020 s]
[INFO] Apache Oozie Client ................................ SUCCESS [ 28.879 s]
[INFO] Apache Oozie Share Lib Oozie ....................... SUCCESS [  1.027 s]
[INFO] Apache Oozie Share Lib HCatalog .................... SUCCESS [  2.061 s]
[INFO] Apache Oozie Share Lib Distcp ...................... SUCCESS [  0.240 s]
[INFO] Apache Oozie Core .................................. SUCCESS [ 35.509 s]
[INFO] Apache Oozie Share Lib Streaming ................... SUCCESS [  2.771 s]
[INFO] Apache Oozie Share Lib Pig ......................... SUCCESS [  1.078 s]
[INFO] Apache Oozie Share Lib Hive ........................ SUCCESS [  3.793 s]
[INFO] Apache Oozie Share Lib Hive 2 ...................... SUCCESS [  3.818 s]
[INFO] Apache Oozie Share Lib Sqoop ....................... SUCCESS [  0.510 s]
[INFO] Apache Oozie Examples .............................. SUCCESS [  2.225 s]
[INFO] Apache Oozie Share Lib Spark ....................... SUCCESS [  6.191 s]
[INFO] Apache Oozie Share Lib ............................. SUCCESS [ 20.015 s]
[INFO] Apache Oozie Docs .................................. SUCCESS [ 11.896 s]
[INFO] Apache Oozie WebApp ................................ SUCCESS [ 24.521 s]
[INFO] Apache Oozie Tools ................................. SUCCESS [  0.993 s]
[INFO] Apache Oozie MiniOozie ............................. SUCCESS [  0.382 s]
[INFO] Apache Oozie Distro ................................ SUCCESS [ 40.773 s]
[INFO] Apache Oozie ZooKeeper Security Tests .............. SUCCESS [  2.549 s]
[INFO] ------------------------------------------------------------------------
[INFO] BUILD SUCCESS
[INFO] ------------------------------------------------------------------------
[INFO] Total time: 03:13 min
[INFO] Finished at: 2016-08-12T15:55:22+00:00
[INFO] Final Memory: 80M/975M
[INFO] ------------------------------------------------------------------------

Reports
  Running test-patch task CLEAN
  Running test-patch task RAW_PATCH_ANALYSIS
  Running test-patch task RAT
  Running test-patch task JAVADOC
  Running test-patch task COMPILE
  Running test-patch task BACKWARDS_COMPATIBILITY
  Running test-patch task TESTS
  Running test-patch task DISTRO


Testing JIRA OOZIE-2613

Cleaning local git workspace

----------------------------

+1 PATCH_APPLIES
+1 CLEAN
+1 RAW_PATCH_ANALYSIS
    +1 the patch does not introduce any @author tags
    +1 the patch does not introduce any tabs
    +1 the patch does not introduce any trailing spaces
    +1 the patch does not introduce any line longer than 132
    +1 the patch does adds/modifies 2 testcase(s)
+1 RAT
    +1 the patch does not seem to introduce new RAT warnings
+1 JAVADOC
    +1 the patch does not seem to introduce new Javadoc warnings
+1 COMPILE
    +1 HEAD compiles
    +1 patch compiles
    +1 the patch does not seem to introduce new javac warnings
+1 BACKWARDS_COMPATIBILITY
    +1 the patch does not change any JPA Entity/Colum/Basic/Lob/Transient annotations
    +1 the patch does not modify JPA files
-1 TESTS
    Tests run: 1792
    Tests failed: 1
    Tests errors: 3

    The patch failed the following testcases:

      testMain(org.apache.oozie.action.hadoop.TestHiveMain)

+1 DISTRO
    +1 distro tarball builds with the patch 

----------------------------
-1 Overall result, please check the reported -1(s)


The full output of the test-patch run is available at

   https://builds.apache.org/job/oozie-trunk-precommit-build/3226/

Adding comment to JIRA
Comment added.

test-patch exit code: 1

Build step 'Execute shell' marked build as failure
Archiving artifacts
Compressed 491.17 KB of artifacts by 39.1% relative to #3212
Recording test results

Build failed in Jenkins: oozie-trunk-precommit-build #3225

Posted by Apache Jenkins Server <je...@builds.apache.org>.
See <https://builds.apache.org/job/oozie-trunk-precommit-build/3225/>

------------------------------------------
[...truncated 5903 lines...]
[INFO] 
[INFO] --- maven-compiler-plugin:2.3.2:testCompile (default-testCompile) @ oozie-tools ---
[INFO] Nothing to compile - all classes are up to date
[INFO] 
[INFO] --- maven-surefire-plugin:2.12.2:test (default-test) @ oozie-tools ---
[INFO] Tests are skipped.
[INFO] 
[INFO] --- maven-jar-plugin:2.3.1:jar (default-jar) @ oozie-tools ---
[INFO] Building jar: <https://builds.apache.org/job/oozie-trunk-precommit-build/ws/tools/target/oozie-tools-4.3.0-SNAPSHOT.jar>
[INFO] 
[INFO] --- maven-site-plugin:2.0-beta-6:attach-descriptor (attach-descriptor) @ oozie-tools ---
[INFO] 
[INFO] --- maven-assembly-plugin:2.2.1:single (default-cli) @ oozie-tools ---
[INFO] Reading assembly descriptor: ../src/main/assemblies/tools.xml
[WARNING] The following patterns were never triggered in this artifact exclusion filter:
o  '*:*:pom:*'

[INFO] Copying files to <https://builds.apache.org/job/oozie-trunk-precommit-build/ws/tools/target/oozie-tools-4.3.0-SNAPSHOT-tools>
[WARNING] Assembly file: <https://builds.apache.org/job/oozie-trunk-precommit-build/ws/tools/target/oozie-tools-4.3.0-SNAPSHOT-tools> is not a regular file (it may be a directory). It cannot be attached to the project build for installation or deployment.
[INFO]                                                                         
[INFO] ------------------------------------------------------------------------
[INFO] Building Apache Oozie MiniOozie 4.3.0-SNAPSHOT
[INFO] ------------------------------------------------------------------------
[INFO] 
[INFO] --- maven-remote-resources-plugin:1.5:process (default) @ oozie-mini ---
[INFO] 
[INFO] --- maven-resources-plugin:2.5:resources (default-resources) @ oozie-mini ---
[debug] execute contextualize
[INFO] Using 'UTF-8' encoding to copy filtered resources.
[INFO] skip non existing resourceDirectory <https://builds.apache.org/job/oozie-trunk-precommit-build/ws/minitest/src/main/resources>
[INFO] Copying 3 resources
[INFO] 
[INFO] --- maven-compiler-plugin:2.3.2:compile (default-compile) @ oozie-mini ---
[INFO] No sources to compile
[INFO] 
[INFO] --- maven-resources-plugin:2.5:testResources (default-testResources) @ oozie-mini ---
[debug] execute contextualize
[INFO] Using 'UTF-8' encoding to copy filtered resources.
[INFO] Copying 3 resources
[INFO] Copying 3 resources
[INFO] 
[INFO] --- maven-compiler-plugin:2.3.2:testCompile (default-testCompile) @ oozie-mini ---
[INFO] Nothing to compile - all classes are up to date
[INFO] 
[INFO] --- maven-surefire-plugin:2.12.2:test (default-test) @ oozie-mini ---
[INFO] Tests are skipped.
[INFO] 
[INFO] --- maven-jar-plugin:2.3.1:jar (default-jar) @ oozie-mini ---
[INFO] Building jar: <https://builds.apache.org/job/oozie-trunk-precommit-build/ws/minitest/target/oozie-mini-4.3.0-SNAPSHOT.jar>
[INFO] 
[INFO] --- maven-site-plugin:2.0-beta-6:attach-descriptor (attach-descriptor) @ oozie-mini ---
[INFO] 
[INFO] --- maven-assembly-plugin:2.2.1:single (default-cli) @ oozie-mini ---
[INFO] Reading assembly descriptor: src/main/assemblies/empty.xml
[INFO]                                                                         
[INFO] ------------------------------------------------------------------------
[INFO] Building Apache Oozie Distro 4.3.0-SNAPSHOT
[INFO] ------------------------------------------------------------------------
[INFO] 
[INFO] --- maven-remote-resources-plugin:1.5:process (default) @ oozie-distro ---
[INFO] 
[INFO] --- maven-resources-plugin:2.5:resources (default-resources) @ oozie-distro ---
[debug] execute contextualize
[INFO] Using 'UTF-8' encoding to copy filtered resources.
[INFO] skip non existing resourceDirectory <https://builds.apache.org/job/oozie-trunk-precommit-build/ws/distro/src/main/resources>
[INFO] Copying 3 resources
[INFO] 
[INFO] --- maven-compiler-plugin:2.3.2:compile (default-compile) @ oozie-distro ---
[INFO] No sources to compile
[INFO] 
[INFO] --- maven-resources-plugin:2.5:testResources (default-testResources) @ oozie-distro ---
[debug] execute contextualize
[INFO] Using 'UTF-8' encoding to copy filtered resources.
[INFO] skip non existing resourceDirectory <https://builds.apache.org/job/oozie-trunk-precommit-build/ws/distro/src/test/resources>
[INFO] Copying 3 resources
[INFO] 
[INFO] --- maven-compiler-plugin:2.3.2:testCompile (default-testCompile) @ oozie-distro ---
[INFO] No sources to compile
[INFO] 
[INFO] --- maven-surefire-plugin:2.12.2:test (default-test) @ oozie-distro ---
[INFO] Tests are skipped.
[INFO] 
[INFO] --- maven-jar-plugin:2.3.1:jar (default-jar) @ oozie-distro ---
[INFO] Building jar: <https://builds.apache.org/job/oozie-trunk-precommit-build/ws/distro/target/oozie-distro-4.3.0-SNAPSHOT.jar>
[INFO] 
[INFO] --- maven-site-plugin:2.0-beta-6:attach-descriptor (attach-descriptor) @ oozie-distro ---
[INFO] 
[INFO] --- maven-antrun-plugin:1.6:run (default) @ oozie-distro ---
[INFO] Executing tasks

main:
      [get] Getting: http://archive.apache.org/dist/tomcat/tomcat-6/v6.0.44/bin/apache-tomcat-6.0.44.tar.gz
      [get] To: <https://builds.apache.org/job/oozie-trunk-precommit-build/ws/distro/downloads/tomcat-6.0.44.tar.gz>
.............................................................................................................................................................................................................................................................................................................................................
    [mkdir] Created dir: <https://builds.apache.org/job/oozie-trunk-precommit-build/ws/distro/target/tomcat>
   [gunzip] Expanding <https://builds.apache.org/job/oozie-trunk-precommit-build/ws/distro/downloads/tomcat-6.0.44.tar.gz> to <https://builds.apache.org/job/oozie-trunk-precommit-build/ws/distro/target/tomcat/tomcat-6.0.44.tar>
    [untar] Expanding: <https://builds.apache.org/job/oozie-trunk-precommit-build/ws/distro/target/tomcat/tomcat-6.0.44.tar> into <https://builds.apache.org/job/oozie-trunk-precommit-build/ws/distro/target/tomcat>
   [delete] Deleting directory <https://builds.apache.org/job/oozie-trunk-precommit-build/ws/distro/target/tomcat/oozie-server/webapps>
    [mkdir] Created dir: <https://builds.apache.org/job/oozie-trunk-precommit-build/ws/distro/target/tomcat/oozie-server/webapps>
   [delete] Deleting: <https://builds.apache.org/job/oozie-trunk-precommit-build/ws/distro/target/tomcat/oozie-server/conf/server.xml>
     [copy] Copying 1 file to <https://builds.apache.org/job/oozie-trunk-precommit-build/ws/distro/target/tomcat/oozie-server/conf>
     [copy] Copying 1 file to <https://builds.apache.org/job/oozie-trunk-precommit-build/ws/distro/target/tomcat/oozie-server/conf>
    [mkdir] Created dir: <https://builds.apache.org/job/oozie-trunk-precommit-build/ws/distro/target/tomcat/oozie-server/conf/ssl>
     [copy] Copying 1 file to <https://builds.apache.org/job/oozie-trunk-precommit-build/ws/distro/target/tomcat/oozie-server/conf/ssl>
     [copy] Copying 1 file to <https://builds.apache.org/job/oozie-trunk-precommit-build/ws/distro/target/tomcat/oozie-server/conf/ssl>
     [copy] Copying 1 file to <https://builds.apache.org/job/oozie-trunk-precommit-build/ws/distro/target/tomcat/oozie-server/conf/ssl>
     [copy] Copying 3 files to <https://builds.apache.org/job/oozie-trunk-precommit-build/ws/distro/target/tomcat/oozie-server/webapps/ROOT>
[INFO] Executed tasks
[INFO] 
[INFO] --- maven-assembly-plugin:2.2.1:single (default-cli) @ oozie-distro ---
[INFO] Reading assembly descriptor: ../src/main/assemblies/distro.xml
[INFO] Copying files to <https://builds.apache.org/job/oozie-trunk-precommit-build/ws/distro/target/oozie-4.3.0-SNAPSHOT-distro>
[WARNING] Assembly file: <https://builds.apache.org/job/oozie-trunk-precommit-build/ws/distro/target/oozie-4.3.0-SNAPSHOT-distro> is not a regular file (it may be a directory). It cannot be attached to the project build for installation or deployment.
[INFO] Building tar : <https://builds.apache.org/job/oozie-trunk-precommit-build/ws/distro/target/oozie-4.3.0-SNAPSHOT-distro.tar.gz>
[INFO]                                                                         
[INFO] ------------------------------------------------------------------------
[INFO] Building Apache Oozie ZooKeeper Security Tests 4.3.0-SNAPSHOT
[INFO] ------------------------------------------------------------------------
[INFO] 
[INFO] --- maven-remote-resources-plugin:1.5:process (default) @ oozie-zookeeper-security-tests ---
[INFO] 
[INFO] --- maven-resources-plugin:2.5:resources (default-resources) @ oozie-zookeeper-security-tests ---
[debug] execute contextualize
[INFO] Using 'UTF-8' encoding to copy filtered resources.
[INFO] skip non existing resourceDirectory <https://builds.apache.org/job/oozie-trunk-precommit-build/ws/zookeeper-security-tests/src/main/resources>
[INFO] Copying 3 resources
[INFO] 
[INFO] --- maven-compiler-plugin:2.3.2:compile (default-compile) @ oozie-zookeeper-security-tests ---
[INFO] No sources to compile
[INFO] 
[INFO] --- maven-resources-plugin:2.5:testResources (default-testResources) @ oozie-zookeeper-security-tests ---
[debug] execute contextualize
[INFO] Using 'UTF-8' encoding to copy filtered resources.
[INFO] skip non existing resourceDirectory <https://builds.apache.org/job/oozie-trunk-precommit-build/ws/zookeeper-security-tests/src/test/resources>
[INFO] Copying 3 resources
[INFO] 
[INFO] --- maven-compiler-plugin:2.3.2:testCompile (default-testCompile) @ oozie-zookeeper-security-tests ---
[INFO] Nothing to compile - all classes are up to date
[INFO] 
[INFO] --- maven-surefire-plugin:2.12.2:test (default-test) @ oozie-zookeeper-security-tests ---
[INFO] Tests are skipped.
[INFO] 
[INFO] --- maven-jar-plugin:2.3.1:jar (default-jar) @ oozie-zookeeper-security-tests ---
[INFO] Building jar: <https://builds.apache.org/job/oozie-trunk-precommit-build/ws/zookeeper-security-tests/target/oozie-zookeeper-security-tests-4.3.0-SNAPSHOT.jar>
[INFO] 
[INFO] --- maven-site-plugin:2.0-beta-6:attach-descriptor (attach-descriptor) @ oozie-zookeeper-security-tests ---
[INFO] 
[INFO] --- maven-assembly-plugin:2.2.1:single (default-cli) @ oozie-zookeeper-security-tests ---
[INFO] Reading assembly descriptor: src/main/assemblies/empty.xml
[INFO] ------------------------------------------------------------------------
[INFO] Reactor Summary:
[INFO] 
[INFO] Apache Oozie Main .................................. SUCCESS [  1.544 s]
[INFO] Apache Oozie Hadoop Utils .......................... SUCCESS [  0.762 s]
[INFO] Apache Oozie Hadoop Distcp hadoop-1-4.3.0-SNAPSHOT . SUCCESS [  0.118 s]
[INFO] Apache Oozie Hadoop Auth hadoop-1-4.3.0-SNAPSHOT ... SUCCESS [  0.216 s]
[INFO] Apache Oozie Hadoop Libs ........................... SUCCESS [  0.021 s]
[INFO] Apache Oozie Client ................................ SUCCESS [ 26.887 s]
[INFO] Apache Oozie Share Lib Oozie ....................... SUCCESS [  1.020 s]
[INFO] Apache Oozie Share Lib HCatalog .................... SUCCESS [  1.465 s]
[INFO] Apache Oozie Share Lib Distcp ...................... SUCCESS [  0.256 s]
[INFO] Apache Oozie Core .................................. SUCCESS [ 34.341 s]
[INFO] Apache Oozie Share Lib Streaming ................... SUCCESS [  2.020 s]
[INFO] Apache Oozie Share Lib Pig ......................... SUCCESS [  1.010 s]
[INFO] Apache Oozie Share Lib Hive ........................ SUCCESS [  3.182 s]
[INFO] Apache Oozie Share Lib Hive 2 ...................... SUCCESS [  2.599 s]
[INFO] Apache Oozie Share Lib Sqoop ....................... SUCCESS [  0.520 s]
[INFO] Apache Oozie Examples .............................. SUCCESS [  2.265 s]
[INFO] Apache Oozie Share Lib Spark ....................... SUCCESS [  6.237 s]
[INFO] Apache Oozie Share Lib ............................. SUCCESS [ 18.156 s]
[INFO] Apache Oozie Docs .................................. SUCCESS [ 11.802 s]
[INFO] Apache Oozie WebApp ................................ SUCCESS [ 27.092 s]
[INFO] Apache Oozie Tools ................................. SUCCESS [  0.779 s]
[INFO] Apache Oozie MiniOozie ............................. SUCCESS [  0.318 s]
[INFO] Apache Oozie Distro ................................ SUCCESS [ 39.755 s]
[INFO] Apache Oozie ZooKeeper Security Tests .............. SUCCESS [  2.477 s]
[INFO] ------------------------------------------------------------------------
[INFO] BUILD SUCCESS
[INFO] ------------------------------------------------------------------------
[INFO] Total time: 03:06 min
[INFO] Finished at: 2016-08-12T13:32:01+00:00
[INFO] Final Memory: 76M/1037M
[INFO] ------------------------------------------------------------------------

Reports
  Running test-patch task CLEAN
  Running test-patch task RAW_PATCH_ANALYSIS
  Running test-patch task RAT
  Running test-patch task JAVADOC
  Running test-patch task COMPILE
  Running test-patch task BACKWARDS_COMPATIBILITY
  Running test-patch task TESTS
  Running test-patch task DISTRO


Testing JIRA OOZIE-2632

Cleaning local git workspace

----------------------------

+1 PATCH_APPLIES
+1 CLEAN
-1 RAW_PATCH_ANALYSIS
    +1 the patch does not introduce any @author tags
    +1 the patch does not introduce any tabs
    +1 the patch does not introduce any trailing spaces
    -1 the patch contains 12 line(s) longer than 132 characters
    +1 the patch does adds/modifies 5 testcase(s)
-1 RAT
    -1 the patch seems to introduce 8 new RAT warning(s)
+1 JAVADOC
    +1 the patch does not seem to introduce new Javadoc warnings
+1 COMPILE
    +1 HEAD compiles
    +1 patch compiles
    +1 the patch does not seem to introduce new javac warnings
+1 BACKWARDS_COMPATIBILITY
    +1 the patch does not change any JPA Entity/Colum/Basic/Lob/Transient annotations
    +1 the patch does not modify JPA files
-1 TESTS
    Tests run: 1793
    Tests failed: 0
    Tests errors: 1

    The patch failed the following testcases:

      

+1 DISTRO
    +1 distro tarball builds with the patch 

----------------------------
-1 Overall result, please check the reported -1(s)


The full output of the test-patch run is available at

   https://builds.apache.org/job/oozie-trunk-precommit-build/3225/

Adding comment to JIRA
Comment added.

test-patch exit code: 1

Build step 'Execute shell' marked build as failure
Archiving artifacts
Compressed 556.24 KB of artifacts by 28.8% relative to #3212
Recording test results

Build failed in Jenkins: oozie-trunk-precommit-build #3224

Posted by Apache Jenkins Server <je...@builds.apache.org>.
See <https://builds.apache.org/job/oozie-trunk-precommit-build/3224/>

------------------------------------------
[...truncated 6129 lines...]
[INFO] --- maven-compiler-plugin:2.3.2:compile (default-compile) @ oozie-tools ---
[INFO] Nothing to compile - all classes are up to date
[INFO] 
[INFO] --- maven-resources-plugin:2.5:testResources (default-testResources) @ oozie-tools ---
[debug] execute contextualize
[INFO] Using 'UTF-8' encoding to copy filtered resources.
[INFO] Copying 2 resources
[INFO] Copying 3 resources
[INFO] 
[INFO] --- maven-compiler-plugin:2.3.2:testCompile (default-testCompile) @ oozie-tools ---
[INFO] Nothing to compile - all classes are up to date
[INFO] 
[INFO] --- maven-surefire-plugin:2.12.2:test (default-test) @ oozie-tools ---
[INFO] Tests are skipped.
[INFO] 
[INFO] --- maven-jar-plugin:2.3.1:jar (default-jar) @ oozie-tools ---
[INFO] Building jar: <https://builds.apache.org/job/oozie-trunk-precommit-build/ws/tools/target/oozie-tools-4.3.0-SNAPSHOT.jar>
[INFO] 
[INFO] --- maven-site-plugin:2.0-beta-6:attach-descriptor (attach-descriptor) @ oozie-tools ---
[INFO] 
[INFO] --- maven-assembly-plugin:2.2.1:single (default-cli) @ oozie-tools ---
[INFO] Reading assembly descriptor: ../src/main/assemblies/tools.xml
[WARNING] The following patterns were never triggered in this artifact exclusion filter:
o  '*:*:pom:*'

[INFO] Copying files to <https://builds.apache.org/job/oozie-trunk-precommit-build/ws/tools/target/oozie-tools-4.3.0-SNAPSHOT-tools>
[WARNING] Assembly file: <https://builds.apache.org/job/oozie-trunk-precommit-build/ws/tools/target/oozie-tools-4.3.0-SNAPSHOT-tools> is not a regular file (it may be a directory). It cannot be attached to the project build for installation or deployment.
[INFO]                                                                         
[INFO] ------------------------------------------------------------------------
[INFO] Building Apache Oozie MiniOozie 4.3.0-SNAPSHOT
[INFO] ------------------------------------------------------------------------
[INFO] 
[INFO] --- maven-remote-resources-plugin:1.5:process (default) @ oozie-mini ---
[INFO] 
[INFO] --- maven-resources-plugin:2.5:resources (default-resources) @ oozie-mini ---
[debug] execute contextualize
[INFO] Using 'UTF-8' encoding to copy filtered resources.
[INFO] skip non existing resourceDirectory <https://builds.apache.org/job/oozie-trunk-precommit-build/ws/minitest/src/main/resources>
[INFO] Copying 3 resources
[INFO] 
[INFO] --- maven-compiler-plugin:2.3.2:compile (default-compile) @ oozie-mini ---
[INFO] No sources to compile
[INFO] 
[INFO] --- maven-resources-plugin:2.5:testResources (default-testResources) @ oozie-mini ---
[debug] execute contextualize
[INFO] Using 'UTF-8' encoding to copy filtered resources.
[INFO] Copying 3 resources
[INFO] Copying 3 resources
[INFO] 
[INFO] --- maven-compiler-plugin:2.3.2:testCompile (default-testCompile) @ oozie-mini ---
[INFO] Nothing to compile - all classes are up to date
[INFO] 
[INFO] --- maven-surefire-plugin:2.12.2:test (default-test) @ oozie-mini ---
[INFO] Tests are skipped.
[INFO] 
[INFO] --- maven-jar-plugin:2.3.1:jar (default-jar) @ oozie-mini ---
[INFO] Building jar: <https://builds.apache.org/job/oozie-trunk-precommit-build/ws/minitest/target/oozie-mini-4.3.0-SNAPSHOT.jar>
[INFO] 
[INFO] --- maven-site-plugin:2.0-beta-6:attach-descriptor (attach-descriptor) @ oozie-mini ---
[INFO] 
[INFO] --- maven-assembly-plugin:2.2.1:single (default-cli) @ oozie-mini ---
[INFO] Reading assembly descriptor: src/main/assemblies/empty.xml
[INFO]                                                                         
[INFO] ------------------------------------------------------------------------
[INFO] Building Apache Oozie Distro 4.3.0-SNAPSHOT
[INFO] ------------------------------------------------------------------------
[INFO] 
[INFO] --- maven-remote-resources-plugin:1.5:process (default) @ oozie-distro ---
[INFO] 
[INFO] --- maven-resources-plugin:2.5:resources (default-resources) @ oozie-distro ---
[debug] execute contextualize
[INFO] Using 'UTF-8' encoding to copy filtered resources.
[INFO] skip non existing resourceDirectory <https://builds.apache.org/job/oozie-trunk-precommit-build/ws/distro/src/main/resources>
[INFO] Copying 3 resources
[INFO] 
[INFO] --- maven-compiler-plugin:2.3.2:compile (default-compile) @ oozie-distro ---
[INFO] No sources to compile
[INFO] 
[INFO] --- maven-resources-plugin:2.5:testResources (default-testResources) @ oozie-distro ---
[debug] execute contextualize
[INFO] Using 'UTF-8' encoding to copy filtered resources.
[INFO] skip non existing resourceDirectory <https://builds.apache.org/job/oozie-trunk-precommit-build/ws/distro/src/test/resources>
[INFO] Copying 3 resources
[INFO] 
[INFO] --- maven-compiler-plugin:2.3.2:testCompile (default-testCompile) @ oozie-distro ---
[INFO] No sources to compile
[INFO] 
[INFO] --- maven-surefire-plugin:2.12.2:test (default-test) @ oozie-distro ---
[INFO] Tests are skipped.
[INFO] 
[INFO] --- maven-jar-plugin:2.3.1:jar (default-jar) @ oozie-distro ---
[INFO] Building jar: <https://builds.apache.org/job/oozie-trunk-precommit-build/ws/distro/target/oozie-distro-4.3.0-SNAPSHOT.jar>
[INFO] 
[INFO] --- maven-site-plugin:2.0-beta-6:attach-descriptor (attach-descriptor) @ oozie-distro ---
[INFO] 
[INFO] --- maven-antrun-plugin:1.6:run (default) @ oozie-distro ---
[INFO] Executing tasks

main:
      [get] Getting: http://archive.apache.org/dist/tomcat/tomcat-6/v6.0.44/bin/apache-tomcat-6.0.44.tar.gz
      [get] To: <https://builds.apache.org/job/oozie-trunk-precommit-build/ws/distro/downloads/tomcat-6.0.44.tar.gz>
...................................................................................................................................................................................................................................................................................................................................................................................
    [mkdir] Created dir: <https://builds.apache.org/job/oozie-trunk-precommit-build/ws/distro/target/tomcat>
   [gunzip] Expanding <https://builds.apache.org/job/oozie-trunk-precommit-build/ws/distro/downloads/tomcat-6.0.44.tar.gz> to <https://builds.apache.org/job/oozie-trunk-precommit-build/ws/distro/target/tomcat/tomcat-6.0.44.tar>
    [untar] Expanding: <https://builds.apache.org/job/oozie-trunk-precommit-build/ws/distro/target/tomcat/tomcat-6.0.44.tar> into <https://builds.apache.org/job/oozie-trunk-precommit-build/ws/distro/target/tomcat>
   [delete] Deleting directory <https://builds.apache.org/job/oozie-trunk-precommit-build/ws/distro/target/tomcat/oozie-server/webapps>
    [mkdir] Created dir: <https://builds.apache.org/job/oozie-trunk-precommit-build/ws/distro/target/tomcat/oozie-server/webapps>
   [delete] Deleting: <https://builds.apache.org/job/oozie-trunk-precommit-build/ws/distro/target/tomcat/oozie-server/conf/server.xml>
     [copy] Copying 1 file to <https://builds.apache.org/job/oozie-trunk-precommit-build/ws/distro/target/tomcat/oozie-server/conf>
     [copy] Copying 1 file to <https://builds.apache.org/job/oozie-trunk-precommit-build/ws/distro/target/tomcat/oozie-server/conf>
    [mkdir] Created dir: <https://builds.apache.org/job/oozie-trunk-precommit-build/ws/distro/target/tomcat/oozie-server/conf/ssl>
     [copy] Copying 1 file to <https://builds.apache.org/job/oozie-trunk-precommit-build/ws/distro/target/tomcat/oozie-server/conf/ssl>
     [copy] Copying 1 file to <https://builds.apache.org/job/oozie-trunk-precommit-build/ws/distro/target/tomcat/oozie-server/conf/ssl>
     [copy] Copying 1 file to <https://builds.apache.org/job/oozie-trunk-precommit-build/ws/distro/target/tomcat/oozie-server/conf/ssl>
     [copy] Copying 3 files to <https://builds.apache.org/job/oozie-trunk-precommit-build/ws/distro/target/tomcat/oozie-server/webapps/ROOT>
[INFO] Executed tasks
[INFO] 
[INFO] --- maven-assembly-plugin:2.2.1:single (default-cli) @ oozie-distro ---
[INFO] Reading assembly descriptor: ../src/main/assemblies/distro.xml
[INFO] Copying files to <https://builds.apache.org/job/oozie-trunk-precommit-build/ws/distro/target/oozie-4.3.0-SNAPSHOT-distro>
[WARNING] Assembly file: <https://builds.apache.org/job/oozie-trunk-precommit-build/ws/distro/target/oozie-4.3.0-SNAPSHOT-distro> is not a regular file (it may be a directory). It cannot be attached to the project build for installation or deployment.
[INFO] Building tar : <https://builds.apache.org/job/oozie-trunk-precommit-build/ws/distro/target/oozie-4.3.0-SNAPSHOT-distro.tar.gz>
[INFO]                                                                         
[INFO] ------------------------------------------------------------------------
[INFO] Building Apache Oozie ZooKeeper Security Tests 4.3.0-SNAPSHOT
[INFO] ------------------------------------------------------------------------
[INFO] 
[INFO] --- maven-remote-resources-plugin:1.5:process (default) @ oozie-zookeeper-security-tests ---
[INFO] 
[INFO] --- maven-resources-plugin:2.5:resources (default-resources) @ oozie-zookeeper-security-tests ---
[debug] execute contextualize
[INFO] Using 'UTF-8' encoding to copy filtered resources.
[INFO] skip non existing resourceDirectory <https://builds.apache.org/job/oozie-trunk-precommit-build/ws/zookeeper-security-tests/src/main/resources>
[INFO] Copying 3 resources
[INFO] 
[INFO] --- maven-compiler-plugin:2.3.2:compile (default-compile) @ oozie-zookeeper-security-tests ---
[INFO] No sources to compile
[INFO] 
[INFO] --- maven-resources-plugin:2.5:testResources (default-testResources) @ oozie-zookeeper-security-tests ---
[debug] execute contextualize
[INFO] Using 'UTF-8' encoding to copy filtered resources.
[INFO] skip non existing resourceDirectory <https://builds.apache.org/job/oozie-trunk-precommit-build/ws/zookeeper-security-tests/src/test/resources>
[INFO] Copying 3 resources
[INFO] 
[INFO] --- maven-compiler-plugin:2.3.2:testCompile (default-testCompile) @ oozie-zookeeper-security-tests ---
[INFO] Nothing to compile - all classes are up to date
[INFO] 
[INFO] --- maven-surefire-plugin:2.12.2:test (default-test) @ oozie-zookeeper-security-tests ---
[INFO] Tests are skipped.
[INFO] 
[INFO] --- maven-jar-plugin:2.3.1:jar (default-jar) @ oozie-zookeeper-security-tests ---
[INFO] Building jar: <https://builds.apache.org/job/oozie-trunk-precommit-build/ws/zookeeper-security-tests/target/oozie-zookeeper-security-tests-4.3.0-SNAPSHOT.jar>
[INFO] 
[INFO] --- maven-site-plugin:2.0-beta-6:attach-descriptor (attach-descriptor) @ oozie-zookeeper-security-tests ---
[INFO] 
[INFO] --- maven-assembly-plugin:2.2.1:single (default-cli) @ oozie-zookeeper-security-tests ---
[INFO] Reading assembly descriptor: src/main/assemblies/empty.xml
[INFO] ------------------------------------------------------------------------
[INFO] Reactor Summary:
[INFO] 
[INFO] Apache Oozie Main .................................. SUCCESS [  1.556 s]
[INFO] Apache Oozie Hadoop Utils .......................... SUCCESS [  0.638 s]
[INFO] Apache Oozie Hadoop Distcp hadoop-1-4.3.0-SNAPSHOT . SUCCESS [  0.165 s]
[INFO] Apache Oozie Hadoop Auth hadoop-1-4.3.0-SNAPSHOT ... SUCCESS [  0.205 s]
[INFO] Apache Oozie Hadoop Libs ........................... SUCCESS [  0.031 s]
[INFO] Apache Oozie Client ................................ SUCCESS [ 26.757 s]
[INFO] Apache Oozie Share Lib Oozie ....................... SUCCESS [  1.030 s]
[INFO] Apache Oozie Share Lib HCatalog .................... SUCCESS [  1.477 s]
[INFO] Apache Oozie Share Lib Distcp ...................... SUCCESS [  0.256 s]
[INFO] Apache Oozie Core .................................. SUCCESS [ 39.785 s]
[INFO] Apache Oozie Share Lib Streaming ................... SUCCESS [  1.977 s]
[INFO] Apache Oozie Share Lib Pig ......................... SUCCESS [  1.102 s]
[INFO] Apache Oozie Share Lib Hive ........................ SUCCESS [  3.338 s]
[INFO] Apache Oozie Share Lib Hive 2 ...................... SUCCESS [  2.611 s]
[INFO] Apache Oozie Share Lib Sqoop ....................... SUCCESS [  0.527 s]
[INFO] Apache Oozie Examples .............................. SUCCESS [  2.253 s]
[INFO] Apache Oozie Share Lib Spark ....................... SUCCESS [  6.333 s]
[INFO] Apache Oozie Share Lib ............................. SUCCESS [ 18.350 s]
[INFO] Apache Oozie Docs .................................. SUCCESS [ 11.668 s]
[INFO] Apache Oozie WebApp ................................ SUCCESS [ 27.076 s]
[INFO] Apache Oozie Tools ................................. SUCCESS [  0.778 s]
[INFO] Apache Oozie MiniOozie ............................. SUCCESS [  0.317 s]
[INFO] Apache Oozie Distro ................................ SUCCESS [ 39.955 s]
[INFO] Apache Oozie ZooKeeper Security Tests .............. SUCCESS [  2.493 s]
[INFO] ------------------------------------------------------------------------
[INFO] BUILD SUCCESS
[INFO] ------------------------------------------------------------------------
[INFO] Total time: 03:12 min
[INFO] Finished at: 2016-08-12T13:18:22+00:00
[INFO] Final Memory: 76M/1056M
[INFO] ------------------------------------------------------------------------

Reports
  Running test-patch task CLEAN
  Running test-patch task RAW_PATCH_ANALYSIS
  Running test-patch task RAT
  Running test-patch task JAVADOC
  Running test-patch task COMPILE
  Running test-patch task BACKWARDS_COMPATIBILITY
  Running test-patch task TESTS
  Running test-patch task DISTRO


Testing JIRA OOZIE-1793

Cleaning local git workspace

----------------------------

+1 PATCH_APPLIES
+1 CLEAN
-1 RAW_PATCH_ANALYSIS
    +1 the patch does not introduce any @author tags
    +1 the patch does not introduce any tabs
    +1 the patch does not introduce any trailing spaces
    +1 the patch does not introduce any line longer than 132
    -1 the patch does not add/modify any testcase
+1 RAT
    +1 the patch does not seem to introduce new RAT warnings
+1 JAVADOC
    +1 the patch does not seem to introduce new Javadoc warnings
+1 COMPILE
    +1 HEAD compiles
    +1 patch compiles
    +1 the patch does not seem to introduce new javac warnings
+1 BACKWARDS_COMPATIBILITY
    +1 the patch does not change any JPA Entity/Colum/Basic/Lob/Transient annotations
    +1 the patch does not modify JPA files
+1 TESTS
    Tests run: 1792
+1 DISTRO
    +1 distro tarball builds with the patch 

----------------------------
-1 Overall result, please check the reported -1(s)


The full output of the test-patch run is available at

   https://builds.apache.org/job/oozie-trunk-precommit-build/3224/

Adding comment to JIRA
Comment added.

test-patch exit code: 1

Build step 'Execute shell' marked build as failure
Archiving artifacts
Recording test results

Build failed in Jenkins: oozie-trunk-precommit-build #3223

Posted by Apache Jenkins Server <je...@builds.apache.org>.
See <https://builds.apache.org/job/oozie-trunk-precommit-build/3223/>

------------------------------------------
[...truncated 6257 lines...]
[INFO] --- maven-surefire-plugin:2.12.2:test (default-test) @ oozie-tools ---
[INFO] Tests are skipped.
[INFO] 
[INFO] --- maven-jar-plugin:2.3.1:jar (default-jar) @ oozie-tools ---
[INFO] Building jar: <https://builds.apache.org/job/oozie-trunk-precommit-build/ws/tools/target/oozie-tools-4.3.0-SNAPSHOT.jar>
[INFO] 
[INFO] --- maven-site-plugin:2.0-beta-6:attach-descriptor (attach-descriptor) @ oozie-tools ---
[INFO] 
[INFO] --- maven-assembly-plugin:2.2.1:single (default-cli) @ oozie-tools ---
[INFO] Reading assembly descriptor: ../src/main/assemblies/tools.xml
[WARNING] The following patterns were never triggered in this artifact exclusion filter:
o  '*:*:pom:*'

[INFO] Copying files to <https://builds.apache.org/job/oozie-trunk-precommit-build/ws/tools/target/oozie-tools-4.3.0-SNAPSHOT-tools>
[WARNING] Assembly file: <https://builds.apache.org/job/oozie-trunk-precommit-build/ws/tools/target/oozie-tools-4.3.0-SNAPSHOT-tools> is not a regular file (it may be a directory). It cannot be attached to the project build for installation or deployment.
[INFO]                                                                         
[INFO] ------------------------------------------------------------------------
[INFO] Building Apache Oozie MiniOozie 4.3.0-SNAPSHOT
[INFO] ------------------------------------------------------------------------
[INFO] 
[INFO] --- maven-remote-resources-plugin:1.5:process (default) @ oozie-mini ---
[INFO] 
[INFO] --- maven-resources-plugin:2.5:resources (default-resources) @ oozie-mini ---
[debug] execute contextualize
[INFO] Using 'UTF-8' encoding to copy filtered resources.
[INFO] skip non existing resourceDirectory <https://builds.apache.org/job/oozie-trunk-precommit-build/ws/minitest/src/main/resources>
[INFO] Copying 3 resources
[INFO] 
[INFO] --- maven-compiler-plugin:2.3.2:compile (default-compile) @ oozie-mini ---
[INFO] No sources to compile
[INFO] 
[INFO] --- maven-resources-plugin:2.5:testResources (default-testResources) @ oozie-mini ---
[debug] execute contextualize
[INFO] Using 'UTF-8' encoding to copy filtered resources.
[INFO] Copying 3 resources
[INFO] Copying 3 resources
[INFO] 
[INFO] --- maven-compiler-plugin:2.3.2:testCompile (default-testCompile) @ oozie-mini ---
[INFO] Nothing to compile - all classes are up to date
[INFO] 
[INFO] --- maven-surefire-plugin:2.12.2:test (default-test) @ oozie-mini ---
[INFO] Tests are skipped.
[INFO] 
[INFO] --- maven-jar-plugin:2.3.1:jar (default-jar) @ oozie-mini ---
[INFO] Building jar: <https://builds.apache.org/job/oozie-trunk-precommit-build/ws/minitest/target/oozie-mini-4.3.0-SNAPSHOT.jar>
[INFO] 
[INFO] --- maven-site-plugin:2.0-beta-6:attach-descriptor (attach-descriptor) @ oozie-mini ---
[INFO] 
[INFO] --- maven-assembly-plugin:2.2.1:single (default-cli) @ oozie-mini ---
[INFO] Reading assembly descriptor: src/main/assemblies/empty.xml
[INFO]                                                                         
[INFO] ------------------------------------------------------------------------
[INFO] Building Apache Oozie Distro 4.3.0-SNAPSHOT
[INFO] ------------------------------------------------------------------------
[INFO] 
[INFO] --- maven-remote-resources-plugin:1.5:process (default) @ oozie-distro ---
[INFO] 
[INFO] --- maven-resources-plugin:2.5:resources (default-resources) @ oozie-distro ---
[debug] execute contextualize
[INFO] Using 'UTF-8' encoding to copy filtered resources.
[INFO] skip non existing resourceDirectory <https://builds.apache.org/job/oozie-trunk-precommit-build/ws/distro/src/main/resources>
[INFO] Copying 3 resources
[INFO] 
[INFO] --- maven-compiler-plugin:2.3.2:compile (default-compile) @ oozie-distro ---
[INFO] No sources to compile
[INFO] 
[INFO] --- maven-resources-plugin:2.5:testResources (default-testResources) @ oozie-distro ---
[debug] execute contextualize
[INFO] Using 'UTF-8' encoding to copy filtered resources.
[INFO] skip non existing resourceDirectory <https://builds.apache.org/job/oozie-trunk-precommit-build/ws/distro/src/test/resources>
[INFO] Copying 3 resources
[INFO] 
[INFO] --- maven-compiler-plugin:2.3.2:testCompile (default-testCompile) @ oozie-distro ---
[INFO] No sources to compile
[INFO] 
[INFO] --- maven-surefire-plugin:2.12.2:test (default-test) @ oozie-distro ---
[INFO] Tests are skipped.
[INFO] 
[INFO] --- maven-jar-plugin:2.3.1:jar (default-jar) @ oozie-distro ---
[INFO] Building jar: <https://builds.apache.org/job/oozie-trunk-precommit-build/ws/distro/target/oozie-distro-4.3.0-SNAPSHOT.jar>
[INFO] 
[INFO] --- maven-site-plugin:2.0-beta-6:attach-descriptor (attach-descriptor) @ oozie-distro ---
[INFO] 
[INFO] --- maven-antrun-plugin:1.6:run (default) @ oozie-distro ---
[INFO] Executing tasks

main:
      [get] Getting: http://archive.apache.org/dist/tomcat/tomcat-6/v6.0.44/bin/apache-tomcat-6.0.44.tar.gz
      [get] To: <https://builds.apache.org/job/oozie-trunk-precommit-build/ws/distro/downloads/tomcat-6.0.44.tar.gz>
..................................................................................................................................................................................................................................................................................................................................................................
    [mkdir] Created dir: <https://builds.apache.org/job/oozie-trunk-precommit-build/ws/distro/target/tomcat>
   [gunzip] Expanding <https://builds.apache.org/job/oozie-trunk-precommit-build/ws/distro/downloads/tomcat-6.0.44.tar.gz> to <https://builds.apache.org/job/oozie-trunk-precommit-build/ws/distro/target/tomcat/tomcat-6.0.44.tar>
    [untar] Expanding: <https://builds.apache.org/job/oozie-trunk-precommit-build/ws/distro/target/tomcat/tomcat-6.0.44.tar> into <https://builds.apache.org/job/oozie-trunk-precommit-build/ws/distro/target/tomcat>
   [delete] Deleting directory <https://builds.apache.org/job/oozie-trunk-precommit-build/ws/distro/target/tomcat/oozie-server/webapps>
    [mkdir] Created dir: <https://builds.apache.org/job/oozie-trunk-precommit-build/ws/distro/target/tomcat/oozie-server/webapps>
   [delete] Deleting: <https://builds.apache.org/job/oozie-trunk-precommit-build/ws/distro/target/tomcat/oozie-server/conf/server.xml>
     [copy] Copying 1 file to <https://builds.apache.org/job/oozie-trunk-precommit-build/ws/distro/target/tomcat/oozie-server/conf>
     [copy] Copying 1 file to <https://builds.apache.org/job/oozie-trunk-precommit-build/ws/distro/target/tomcat/oozie-server/conf>
    [mkdir] Created dir: <https://builds.apache.org/job/oozie-trunk-precommit-build/ws/distro/target/tomcat/oozie-server/conf/ssl>
     [copy] Copying 1 file to <https://builds.apache.org/job/oozie-trunk-precommit-build/ws/distro/target/tomcat/oozie-server/conf/ssl>
     [copy] Copying 1 file to <https://builds.apache.org/job/oozie-trunk-precommit-build/ws/distro/target/tomcat/oozie-server/conf/ssl>
     [copy] Copying 1 file to <https://builds.apache.org/job/oozie-trunk-precommit-build/ws/distro/target/tomcat/oozie-server/conf/ssl>
     [copy] Copying 3 files to <https://builds.apache.org/job/oozie-trunk-precommit-build/ws/distro/target/tomcat/oozie-server/webapps/ROOT>
[INFO] Executed tasks
[INFO] 
[INFO] --- maven-assembly-plugin:2.2.1:single (default-cli) @ oozie-distro ---
[INFO] Reading assembly descriptor: ../src/main/assemblies/distro.xml
[INFO] Copying files to <https://builds.apache.org/job/oozie-trunk-precommit-build/ws/distro/target/oozie-4.3.0-SNAPSHOT-distro>
[WARNING] Assembly file: <https://builds.apache.org/job/oozie-trunk-precommit-build/ws/distro/target/oozie-4.3.0-SNAPSHOT-distro> is not a regular file (it may be a directory). It cannot be attached to the project build for installation or deployment.
[INFO] Building tar : <https://builds.apache.org/job/oozie-trunk-precommit-build/ws/distro/target/oozie-4.3.0-SNAPSHOT-distro.tar.gz>
[INFO]                                                                         
[INFO] ------------------------------------------------------------------------
[INFO] Building Apache Oozie ZooKeeper Security Tests 4.3.0-SNAPSHOT
[INFO] ------------------------------------------------------------------------
[INFO] 
[INFO] --- maven-remote-resources-plugin:1.5:process (default) @ oozie-zookeeper-security-tests ---
[INFO] 
[INFO] --- maven-resources-plugin:2.5:resources (default-resources) @ oozie-zookeeper-security-tests ---
[debug] execute contextualize
[INFO] Using 'UTF-8' encoding to copy filtered resources.
[INFO] skip non existing resourceDirectory <https://builds.apache.org/job/oozie-trunk-precommit-build/ws/zookeeper-security-tests/src/main/resources>
[INFO] Copying 3 resources
[INFO] 
[INFO] --- maven-compiler-plugin:2.3.2:compile (default-compile) @ oozie-zookeeper-security-tests ---
[INFO] No sources to compile
[INFO] 
[INFO] --- maven-resources-plugin:2.5:testResources (default-testResources) @ oozie-zookeeper-security-tests ---
[debug] execute contextualize
[INFO] Using 'UTF-8' encoding to copy filtered resources.
[INFO] skip non existing resourceDirectory <https://builds.apache.org/job/oozie-trunk-precommit-build/ws/zookeeper-security-tests/src/test/resources>
[INFO] Copying 3 resources
[INFO] 
[INFO] --- maven-compiler-plugin:2.3.2:testCompile (default-testCompile) @ oozie-zookeeper-security-tests ---
[INFO] Nothing to compile - all classes are up to date
[INFO] 
[INFO] --- maven-surefire-plugin:2.12.2:test (default-test) @ oozie-zookeeper-security-tests ---
[INFO] Tests are skipped.
[INFO] 
[INFO] --- maven-jar-plugin:2.3.1:jar (default-jar) @ oozie-zookeeper-security-tests ---
[INFO] Building jar: <https://builds.apache.org/job/oozie-trunk-precommit-build/ws/zookeeper-security-tests/target/oozie-zookeeper-security-tests-4.3.0-SNAPSHOT.jar>
[INFO] 
[INFO] --- maven-site-plugin:2.0-beta-6:attach-descriptor (attach-descriptor) @ oozie-zookeeper-security-tests ---
[INFO] 
[INFO] --- maven-assembly-plugin:2.2.1:single (default-cli) @ oozie-zookeeper-security-tests ---
[INFO] Reading assembly descriptor: src/main/assemblies/empty.xml
[INFO] ------------------------------------------------------------------------
[INFO] Reactor Summary:
[INFO] 
[INFO] Apache Oozie Main .................................. SUCCESS [  1.539 s]
[INFO] Apache Oozie Hadoop Utils .......................... SUCCESS [  0.669 s]
[INFO] Apache Oozie Hadoop Distcp hadoop-1-4.3.0-SNAPSHOT . SUCCESS [  0.105 s]
[INFO] Apache Oozie Hadoop Auth hadoop-1-4.3.0-SNAPSHOT ... SUCCESS [  0.199 s]
[INFO] Apache Oozie Hadoop Libs ........................... SUCCESS [  0.020 s]
[INFO] Apache Oozie Client ................................ SUCCESS [ 24.281 s]
[INFO] Apache Oozie Share Lib Oozie ....................... SUCCESS [  1.023 s]
[INFO] Apache Oozie Share Lib HCatalog .................... SUCCESS [  1.402 s]
[INFO] Apache Oozie Share Lib Distcp ...................... SUCCESS [  0.255 s]
[INFO] Apache Oozie Core .................................. SUCCESS [ 34.625 s]
[INFO] Apache Oozie Share Lib Streaming ................... SUCCESS [  1.962 s]
[INFO] Apache Oozie Share Lib Pig ......................... SUCCESS [  1.056 s]
[INFO] Apache Oozie Share Lib Hive ........................ SUCCESS [  3.166 s]
[INFO] Apache Oozie Share Lib Hive 2 ...................... SUCCESS [  2.637 s]
[INFO] Apache Oozie Share Lib Sqoop ....................... SUCCESS [  0.515 s]
[INFO] Apache Oozie Examples .............................. SUCCESS [  2.251 s]
[INFO] Apache Oozie Share Lib Spark ....................... SUCCESS [  6.208 s]
[INFO] Apache Oozie Share Lib ............................. SUCCESS [ 18.639 s]
[INFO] Apache Oozie Docs .................................. SUCCESS [ 11.582 s]
[INFO] Apache Oozie WebApp ................................ SUCCESS [ 26.959 s]
[INFO] Apache Oozie Tools ................................. SUCCESS [  0.805 s]
[INFO] Apache Oozie MiniOozie ............................. SUCCESS [  0.669 s]
[INFO] Apache Oozie Distro ................................ SUCCESS [ 39.079 s]
[INFO] Apache Oozie ZooKeeper Security Tests .............. SUCCESS [  2.491 s]
[INFO] ------------------------------------------------------------------------
[INFO] BUILD SUCCESS
[INFO] ------------------------------------------------------------------------
[INFO] Total time: 03:04 min
[INFO] Finished at: 2016-08-12T11:50:33+00:00
[INFO] Final Memory: 76M/1055M
[INFO] ------------------------------------------------------------------------

Reports
  Running test-patch task CLEAN
  Running test-patch task RAW_PATCH_ANALYSIS
  Running test-patch task RAT
  Running test-patch task JAVADOC
  Running test-patch task COMPILE
  Running test-patch task BACKWARDS_COMPATIBILITY
  Running test-patch task TESTS
  Running test-patch task DISTRO


Testing JIRA OOZIE-2037

Cleaning local git workspace

----------------------------

+1 PATCH_APPLIES
+1 CLEAN
-1 RAW_PATCH_ANALYSIS
    +1 the patch does not introduce any @author tags
    +1 the patch does not introduce any tabs
    +1 the patch does not introduce any trailing spaces
    +1 the patch does not introduce any line longer than 132
    -1 the patch does not add/modify any testcase
+1 RAT
    +1 the patch does not seem to introduce new RAT warnings
+1 JAVADOC
    +1 the patch does not seem to introduce new Javadoc warnings
+1 COMPILE
    +1 HEAD compiles
    +1 patch compiles
    +1 the patch does not seem to introduce new javac warnings
+1 BACKWARDS_COMPATIBILITY
    +1 the patch does not change any JPA Entity/Colum/Basic/Lob/Transient annotations
    +1 the patch does not modify JPA files
-1 TESTS
    Tests run: 1792
    Tests failed: 5
    Tests errors: 3

    The patch failed the following testcases:

      testMain(org.apache.oozie.action.hadoop.TestHiveMain)
      testPigScript(org.apache.oozie.action.hadoop.TestPigMain)
      testPig_withNullExternalID(org.apache.oozie.action.hadoop.TestPigMain)
      testEmbeddedPigWithinPython(org.apache.oozie.action.hadoop.TestPigMain)
      testPigScript(org.apache.oozie.action.hadoop.TestPigMainWithOldAPI)

+1 DISTRO
    +1 distro tarball builds with the patch 

----------------------------
-1 Overall result, please check the reported -1(s)


The full output of the test-patch run is available at

   https://builds.apache.org/job/oozie-trunk-precommit-build/3223/

Adding comment to JIRA
Comment added.

test-patch exit code: 1

Build step 'Execute shell' marked build as failure
Archiving artifacts
Compressed 492.75 KB of artifacts by 39.0% relative to #3212
Recording test results