See <https://builds.apache.org/job/beam_Release_NightlySnapshot/278/display/redirect?page=changes>
Changes:
[ehudm] Reimplement GCS copies with rewrites.
[klk] Add toplevel :sqlPostCommit gradle command
[klk] Add Jenkins job to run :sqlPostCommit
[iemejia] [BEAM-6212] Add MongoDbIO ordered option
[github] Update Slack invitation on #general vs #beam channel
[melissapa] [BEAM-6295] Fix versions in 2.8.0 Java dependencies table
[github] [BEAM-6283] Convert PortableStateExecutionTest and PortableExecutionTest
[melissapa] [BEAM-6295] Fix versions in 2.7.0 Java dependencies table
------------------------------------------
[...truncated 52.36 MB...]
Installing listen 3.1.5
Fetching jekyll-watch 1.5.1
Installing jekyll-watch 1.5.1
Fetching kramdown 1.16.2
Installing kramdown 1.16.2
Fetching liquid 3.0.6
Installing liquid 3.0.6
Fetching pathutil 0.16.1
Installing pathutil 0.16.1
Fetching rouge 1.11.1
Installing rouge 1.11.1
Fetching safe_yaml 1.0.4
Installing safe_yaml 1.0.4
Fetching jekyll 3.2.0
Installing jekyll 3.2.0
Fetching jekyll-redirect-from 0.11.0
Installing jekyll-redirect-from 0.11.0
Fetching jekyll_github_sample 0.3.1
Installing jekyll_github_sample 0.3.1
Bundle complete! 7 Gemfile dependencies, 38 gems now installed.
Bundled gems are installed into `/usr/local/bundle`
---> e465cb7cf00e
Removing intermediate container fbca088be7cb
Step 6/7 : ENV LC_ALL C.UTF-8
---> Running in 20e82aa3a0e8
---> ab0daf0bdb66
Removing intermediate container 20e82aa3a0e8
Step 7/7 : CMD sleep 3600
---> Running in a93cbed58471
---> 82ddfffb318c
Removing intermediate container a93cbed58471
Successfully built 82ddfffb318c
Successfully tagged beam-website:latest
:beam-website:buildDockerImage (Thread[Task worker for ':' Thread 9,5,main]) completed. Took 1 mins 13.342 secs.
:beam-website:createDockerContainer (Thread[Task worker for ':' Thread 9,5,main]) started.
> Task :beam-website:createDockerContainer
Caching disabled for task ':beam-website:createDockerContainer': Caching has not been enabled for the task
Task ':beam-website:createDockerContainer' is not up-to-date because:
Task has not declared any outputs despite executing actions.
Starting process 'command '/bin/bash''. Working directory: <https://builds.apache.org/job/beam_Release_NightlySnapshot/ws/src/website> Command: /bin/bash -c docker create -v <https://builds.apache.org/job/beam_Release_NightlySnapshot/ws/src>:/repo -u $(id -u):$(id -g) beam-website
Successfully started process 'command '/bin/bash''
:beam-website:createDockerContainer (Thread[Task worker for ':' Thread 9,5,main]) completed. Took 0.105 secs.
:beam-website:startDockerContainer (Thread[Task worker for ':' Thread 9,5,main]) started.
> Task :beam-website:startDockerContainer
Caching disabled for task ':beam-website:startDockerContainer': Caching has not been enabled for the task
Task ':beam-website:startDockerContainer' is not up-to-date because:
Task has not declared any outputs despite executing actions.
Starting process 'command 'docker''. Working directory: <https://builds.apache.org/job/beam_Release_NightlySnapshot/ws/src/website> Command: docker start 3fbd635d4e7ec533f74e633d3d60ae2e572ad5157f914c4ef862b4267c08404f
Successfully started process 'command 'docker''
3fbd635d4e7ec533f74e633d3d60ae2e572ad5157f914c4ef862b4267c08404f
:beam-website:startDockerContainer (Thread[Task worker for ':' Thread 9,5,main]) completed. Took 0.294 secs.
:beam-website:buildLocalWebsite (Thread[Task worker for ':' Thread 9,5,main]) started.
> Task :beam-website:buildLocalWebsite
Build cache key for task ':beam-website:buildLocalWebsite' is 976d78a926ff45f30bd018d42b41ec7a
Caching disabled for task ':beam-website:buildLocalWebsite': Caching has not been enabled for the task
Task ':beam-website:buildLocalWebsite' is not up-to-date because:
No history is available.
Starting process 'command 'docker''. Working directory: <https://builds.apache.org/job/beam_Release_NightlySnapshot/ws/src/website> Command: docker exec 3fbd635d4e7ec533f74e633d3d60ae2e572ad5157f914c4ef862b4267c08404f /bin/bash -c cd /repo/build/website && bundle exec jekyll build --destination generated-local-content --config /repo/website/_config.yml,/repo/website/_config_test.yml --incremental --source /repo/website/src
Successfully started process 'command 'docker''
`/` is not writable.
Bundler will use `/tmp/bundler/home/unknown' as your home directory temporarily.
Configuration file: /repo/website/_config.yml
Configuration file: /repo/website/_config_test.yml
Source: /repo/website/src
Destination: generated-local-content
Incremental build: enabled
Generating...
done in 11.287 seconds.
Auto-regeneration: disabled. Use --watch to enable.
:beam-website:buildLocalWebsite (Thread[Task worker for ':' Thread 9,5,main]) completed. Took 12.503 secs.
:beam-website:testWebsite (Thread[Task worker for ':' Thread 9,5,main]) started.
> Task :beam-website:testWebsite
Caching disabled for task ':beam-website:testWebsite': Caching has not been enabled for the task
Task ':beam-website:testWebsite' is not up-to-date because:
Task has not declared any outputs despite executing actions.
Starting process 'command 'docker''. Working directory: <https://builds.apache.org/job/beam_Release_NightlySnapshot/ws/src/website> Command: docker exec 3fbd635d4e7ec533f74e633d3d60ae2e572ad5157f914c4ef862b4267c08404f /bin/bash -c cd /repo/build/website && bundle exec rake test
Successfully started process 'command 'docker''
`/` is not writable.
Bundler will use `/tmp/bundler/home/unknown' as your home directory temporarily.
Running ["HtmlCheck", "LinkCheck", "ImageCheck", "ScriptCheck"] on ["./generated-local-content"] on *.html...
Checking 737 external links...
Ran on 181 files!
HTML-Proofer finished successfully.
:beam-website:testWebsite (Thread[Task worker for ':' Thread 9,5,main]) completed. Took 40.587 secs.
:beam-website:stopAndRemoveDockerContainer (Thread[Task worker for ':' Thread 9,5,main]) started.
> Task :beam-website:stopAndRemoveDockerContainer
Caching disabled for task ':beam-website:stopAndRemoveDockerContainer': Caching has not been enabled for the task
Task ':beam-website:stopAndRemoveDockerContainer' is not up-to-date because:
Task has not declared any outputs despite executing actions.
Starting process 'command 'docker''. Working directory: <https://builds.apache.org/job/beam_Release_NightlySnapshot/ws/src/website> Command: docker rm -f 3fbd635d4e7ec533f74e633d3d60ae2e572ad5157f914c4ef862b4267c08404f
Successfully started process 'command 'docker''
3fbd635d4e7ec533f74e633d3d60ae2e572ad5157f914c4ef862b4267c08404f
:beam-website:stopAndRemoveDockerContainer (Thread[Task worker for ':' Thread 9,5,main]) completed. Took 0.407 secs.
:beam-website:buildWebsite (Thread[Task worker for ':' Thread 9,5,main]) started.
> Task :beam-website:buildWebsite
Skipping task ':beam-website:buildWebsite' as it has no actions.
:beam-website:buildWebsite (Thread[Task worker for ':' Thread 9,5,main]) completed. Took 0.0 secs.
:beam-website:check (Thread[Task worker for ':' Thread 9,5,main]) started.
> Task :beam-website:check
Skipping task ':beam-website:check' as it has no actions.
:beam-website:check (Thread[Task worker for ':' Thread 9,5,main]) completed. Took 0.0 secs.
:beam-website:build (Thread[Task worker for ':' Thread 9,5,main]) started.
> Task :beam-website:build
Skipping task ':beam-website:build' as it has no actions.
:beam-website:build (Thread[Task worker for ':' Thread 9,5,main]) completed. Took 0.0 secs.
:release:compileJava (Thread[Task worker for ':' Thread 9,5,main]) started.
> Task :release:compileJava NO-SOURCE
file or directory '<https://builds.apache.org/job/beam_Release_NightlySnapshot/ws/src/release/src/main/java',> not found
Skipping task ':release:compileJava' as it has no source files and no previous output files.
:release:compileJava (Thread[Task worker for ':' Thread 9,5,main]) completed. Took 0.001 secs.
:release:compileGroovy (Thread[Task worker for ':' Thread 9,5,main]) started.
> Task :release:compileGroovy FROM-CACHE
Build cache key for task ':release:compileGroovy' is 963c3c0cb4a5245ed10f6e321c75ed98
Task ':release:compileGroovy' is not up-to-date because:
No history is available.
Origin for task ':release:compileGroovy': {executionTime=2334, hostName=apache-beam-jenkins-slave-group-jgm6, operatingSystem=Linux, buildInvocationId=st3kxejg5nalrbm6iymbsv3q6u, creationTime=1544862885897, type=org.gradle.api.tasks.compile.GroovyCompile_Decorated, userName=jenkins, gradleVersion=4.10.2, rootPath=<https://builds.apache.org/job/beam_Release_NightlySnapshot/ws/src,> path=:release:compileGroovy}
Unpacked output for task ':release:compileGroovy' from cache.
:release:compileGroovy (Thread[Task worker for ':' Thread 9,5,main]) completed. Took 0.013 secs.
:release:processResources (Thread[Task worker for ':' Thread 9,5,main]) started.
> Task :release:processResources NO-SOURCE
file or directory '<https://builds.apache.org/job/beam_Release_NightlySnapshot/ws/src/release/src/main/resources',> not found
Skipping task ':release:processResources' as it has no source files and no previous output files.
:release:processResources (Thread[Task worker for ':' Thread 9,5,main]) completed. Took 0.0 secs.
:release:classes (Thread[Task worker for ':' Thread 9,5,main]) started.
> Task :release:classes UP-TO-DATE
Skipping task ':release:classes' as it has no actions.
:release:classes (Thread[Task worker for ':' Thread 9,5,main]) completed. Took 0.0 secs.
:release:jar (Thread[Task worker for ':' Thread 9,5,main]) started.
> Task :release:jar
Build cache key for task ':release:jar' is 1a942f3268d9202c85aa89fb3487ff7e
Caching disabled for task ':release:jar': Caching has not been enabled for the task
Task ':release:jar' is not up-to-date because:
No history is available.
:release:jar (Thread[Task worker for ':' Thread 9,5,main]) completed. Took 0.008 secs.
:release:assemble (Thread[Task worker for ':' Thread 9,5,main]) started.
> Task :release:assemble
Skipping task ':release:assemble' as it has no actions.
:release:assemble (Thread[Task worker for ':' Thread 9,5,main]) completed. Took 0.0 secs.
:release:compileTestJava (Thread[Task worker for ':' Thread 9,5,main]) started.
> Task :release:compileTestJava NO-SOURCE
file or directory '<https://builds.apache.org/job/beam_Release_NightlySnapshot/ws/src/release/src/test/java',> not found
Skipping task ':release:compileTestJava' as it has no source files and no previous output files.
:release:compileTestJava (Thread[Task worker for ':' Thread 9,5,main]) completed. Took 0.0 secs.
:release:compileTestGroovy (Thread[Task worker for ':' Thread 9,5,main]) started.
> Task :release:compileTestGroovy NO-SOURCE
file or directory '<https://builds.apache.org/job/beam_Release_NightlySnapshot/ws/src/release/src/test/groovy',> not found
Skipping task ':release:compileTestGroovy' as it has no source files and no previous output files.
:release:compileTestGroovy (Thread[Task worker for ':' Thread 9,5,main]) completed. Took 0.0 secs.
:release:processTestResources (Thread[Task worker for ':' Thread 9,5,main]) started.
> Task :release:processTestResources NO-SOURCE
file or directory '<https://builds.apache.org/job/beam_Release_NightlySnapshot/ws/src/release/src/test/resources',> not found
Skipping task ':release:processTestResources' as it has no source files and no previous output files.
:release:processTestResources (Thread[Task worker for ':' Thread 9,5,main]) completed. Took 0.0 secs.
:release:testClasses (Thread[Task worker for ':' Thread 9,5,main]) started.
> Task :release:testClasses UP-TO-DATE
Skipping task ':release:testClasses' as it has no actions.
:release:testClasses (Thread[Task worker for ':' Thread 9,5,main]) completed. Took 0.0 secs.
:release:test (Thread[Task worker for ':' Thread 9,5,main]) started.
> Task :release:test NO-SOURCE
Skipping task ':release:test' as it has no source files and no previous output files.
:release:test (Thread[Task worker for ':' Thread 9,5,main]) completed. Took 0.0 secs.
:release:check (Thread[Task worker for ':' Thread 9,5,main]) started.
> Task :release:check UP-TO-DATE
Skipping task ':release:check' as it has no actions.
:release:check (Thread[Task worker for ':' Thread 9,5,main]) completed. Took 0.0 secs.
:release:build (Thread[Task worker for ':' Thread 9,5,main]) started.
> Task :release:build
Skipping task ':release:build' as it has no actions.
:release:build (Thread[Task worker for ':' Thread 9,5,main]) completed. Took 0.0 secs.
FAILURE: Build failed with an exception.
* Where:
Build file '<https://builds.apache.org/job/beam_Release_NightlySnapshot/ws/src/sdks/python/build.gradle'> line: 60
* What went wrong:
Execution failed for task ':beam-sdks-python:testPython3'.
> Process 'command 'sh'' finished with non-zero exit value 1
* Try:
Run with --stacktrace option to get the stack trace. Run with --debug option to get more log output. Run with --scan to get full insights.
* Get more help at https://help.gradle.org
Deprecated Gradle features were used in this build, making it incompatible with Gradle 5.0.
Use '--warning-mode all' to show the individual deprecation warnings.
See https://docs.gradle.org/4.10.2/userguide/command_line_interface.html#sec:command_line_warnings
BUILD FAILED in 1h 20m 17s
958 actionable tasks: 945 executed, 11 from cache, 2 up-to-date
Publishing build scan...
https://gradle.com/s/74pokua2hz2x6
Closing Git repo: <https://builds.apache.org/job/beam_Release_NightlySnapshot/ws/src/.git>
Build cache (/home/jenkins/.gradle/caches/build-cache-1) removing files not accessed on or after Sat Dec 15 11:16:21 UTC 2018.
Cache entries evicted. In-memory cache of /home/jenkins/.gradle/caches/journal-1/file-access.bin: Size{4405} MaxSize{4500}, CacheStats{hitCount=157, missCount=2697, loadSuccessCount=2698, loadExceptionCount=0, totalLoadTime=133562189, evictionCount=1}
Performance may suffer from in-memory cache misses. Increase max heap size of Gradle build process to reduce cache misses.
Cache entries evicted. In-memory cache of /home/jenkins/.gradle/caches/journal-1/file-access.bin: Size{4500} MaxSize{4500}, CacheStats{hitCount=186, missCount=3242, loadSuccessCount=3243, loadExceptionCount=0, totalLoadTime=168866944, evictionCount=451}
Performance may suffer from in-memory cache misses. Increase max heap size of Gradle build process to reduce cache misses.
Cache entries evicted. In-memory cache of /home/jenkins/.gradle/caches/journal-1/file-access.bin: Size{4500} MaxSize{4500}, CacheStats{hitCount=206, missCount=3692, loadSuccessCount=3693, loadExceptionCount=0, totalLoadTime=191956131, evictionCount=901}
Performance may suffer from in-memory cache misses. Increase max heap size of Gradle build process to reduce cache misses.
Cache entries evicted. In-memory cache of /home/jenkins/.gradle/caches/journal-1/file-access.bin: Size{4500} MaxSize{4500}, CacheStats{hitCount=212, missCount=4142, loadSuccessCount=4143, loadExceptionCount=0, totalLoadTime=211025130, evictionCount=1351}
Performance may suffer from in-memory cache misses. Increase max heap size of Gradle build process to reduce cache misses.
Cache entries evicted. In-memory cache of /home/jenkins/.gradle/caches/journal-1/file-access.bin: Size{4500} MaxSize{4500}, CacheStats{hitCount=212, missCount=4592, loadSuccessCount=4593, loadExceptionCount=0, totalLoadTime=234914159, evictionCount=1801}
Performance may suffer from in-memory cache misses. Increase max heap size of Gradle build process to reduce cache misses.
Cache entries evicted. In-memory cache of /home/jenkins/.gradle/caches/journal-1/file-access.bin: Size{4500} MaxSize{4500}, CacheStats{hitCount=212, missCount=5042, loadSuccessCount=5043, loadExceptionCount=0, totalLoadTime=261891604, evictionCount=2251}
Performance may suffer from in-memory cache misses. Increase max heap size of Gradle build process to reduce cache misses.
Cache entries evicted. In-memory cache of /home/jenkins/.gradle/caches/journal-1/file-access.bin: Size{4500} MaxSize{4500}, CacheStats{hitCount=212, missCount=5492, loadSuccessCount=5493, loadExceptionCount=0, totalLoadTime=282086956, evictionCount=2701}
Performance may suffer from in-memory cache misses. Increase max heap size of Gradle build process to reduce cache misses.
Cache entries evicted. In-memory cache of /home/jenkins/.gradle/caches/journal-1/file-access.bin: Size{4500} MaxSize{4500}, CacheStats{hitCount=212, missCount=5942, loadSuccessCount=5943, loadExceptionCount=0, totalLoadTime=301970838, evictionCount=3151}
Performance may suffer from in-memory cache misses. Increase max heap size of Gradle build process to reduce cache misses.
Cache entries evicted. In-memory cache of /home/jenkins/.gradle/caches/journal-1/file-access.bin: Size{4500} MaxSize{4500}, CacheStats{hitCount=212, missCount=6392, loadSuccessCount=6393, loadExceptionCount=0, totalLoadTime=322401868, evictionCount=3601}
Performance may suffer from in-memory cache misses. Increase max heap size of Gradle build process to reduce cache misses.
Cache entries evicted. In-memory cache of /home/jenkins/.gradle/caches/journal-1/file-access.bin: Size{4500} MaxSize{4500}, CacheStats{hitCount=212, missCount=6842, loadSuccessCount=6843, loadExceptionCount=0, totalLoadTime=343633047, evictionCount=4051}
Performance may suffer from in-memory cache misses. Increase max heap size of Gradle build process to reduce cache misses.
Cache entries evicted. In-memory cache of /home/jenkins/.gradle/caches/journal-1/file-access.bin: Size{4500} MaxSize{4500}, CacheStats{hitCount=212, missCount=7292, loadSuccessCount=7293, loadExceptionCount=0, totalLoadTime=362537997, evictionCount=4501}
Performance may suffer from in-memory cache misses. Increase max heap size of Gradle build process to reduce cache misses.
Cache entries evicted. In-memory cache of /home/jenkins/.gradle/caches/journal-1/file-access.bin: Size{4500} MaxSize{4500}, CacheStats{hitCount=212, missCount=7742, loadSuccessCount=7743, loadExceptionCount=0, totalLoadTime=382617129, evictionCount=4951}
Performance may suffer from in-memory cache misses. Increase max heap size of Gradle build process to reduce cache misses.
Build cache (/home/jenkins/.gradle/caches/build-cache-1) cleaned up in 1.23 secs.
Build step 'Invoke Gradle script' changed build result to FAILURE
Build step 'Invoke Gradle script' marked build as failure
---------------------------------------------------------------------
To unsubscribe, e-mail: builds-unsubscribe@beam.apache.org
For additional commands, e-mail: builds-help@beam.apache.org
See <https://builds.apache.org/job/beam_Release_NightlySnapshot/283/display/redirect?page=changes> --------------------------------------------------------------------- To unsubscribe, e-mail: builds-unsubscribe@beam.apache.org For additional commands, e-mail: builds-help@beam.apache.org
See <https://builds.apache.org/job/beam_Release_NightlySnapshot/282/display/redirect?page=changes>
Changes:
[robbe.sneyders] Python 3 port io.filesystemio module
[robbe.sneyders] Add apache_beam.io.localfilesystem_test to python 3 test suite
[apilloud] Upgrade to Calcite 1.18
[github] Add time usage in seconds for staging files.
[heejong] [BEAM-6287] pyarrow is not supported on Windows Python 2
[moromorokosi+github] [BEAM-6244] Restore updateProducerProperties
[moromorokosi+github] [BEAM-6244] Restore validate
[iemejia] BEAM-6306 Upgrade Jackson to version 2.9.8
------------------------------------------
[...truncated 51.51 MB...]
Fetching forwardable-extended 2.6.0
Installing forwardable-extended 2.6.0
Fetching mercenary 0.3.6
Installing mercenary 0.3.6
Fetching mini_portile2 2.3.0
Installing mini_portile2 2.3.0
Fetching nokogiri 1.8.2
Installing nokogiri 1.8.2 with native extensions
Fetching parallel 1.12.1
Installing parallel 1.12.1
Fetching typhoeus 1.3.0
Installing typhoeus 1.3.0
Fetching yell 2.0.7
Installing yell 2.0.7
Fetching html-proofer 3.8.0
Installing html-proofer 3.8.0
Fetching rb-fsevent 0.10.2
Installing rb-fsevent 0.10.2
Fetching rb-inotify 0.9.10
Installing rb-inotify 0.9.10
Fetching sass-listen 4.0.0
Installing sass-listen 4.0.0
Fetching sass 3.5.5
Installing sass 3.5.5
Fetching jekyll-sass-converter 1.5.2
Installing jekyll-sass-converter 1.5.2
Fetching ruby_dep 1.5.0
Installing ruby_dep 1.5.0
Fetching listen 3.1.5
Installing listen 3.1.5
Fetching jekyll-watch 1.5.1
Installing jekyll-watch 1.5.1
Fetching kramdown 1.16.2
Installing kramdown 1.16.2
Fetching liquid 3.0.6
Installing liquid 3.0.6
Fetching pathutil 0.16.1
Installing pathutil 0.16.1
Fetching rouge 1.11.1
Installing rouge 1.11.1
Fetching safe_yaml 1.0.4
Installing safe_yaml 1.0.4
Fetching jekyll 3.2.0
Installing jekyll 3.2.0
Fetching jekyll-redirect-from 0.11.0
Installing jekyll-redirect-from 0.11.0
Fetching jekyll_github_sample 0.3.1
Installing jekyll_github_sample 0.3.1
Bundle complete! 7 Gemfile dependencies, 38 gems now installed.
Bundled gems are installed into `/usr/local/bundle`
---> 246659a0273b
Removing intermediate container 2ab447e6b60a
Step 6/7 : ENV LC_ALL C.UTF-8
---> Running in cd4ac9cd2789
---> ef5010f73f37
Removing intermediate container cd4ac9cd2789
Step 7/7 : CMD sleep 3600
---> Running in 3e282ea47af0
---> a6a60ec46a1e
Removing intermediate container 3e282ea47af0
Successfully built a6a60ec46a1e
Successfully tagged beam-website:latest
:beam-website:buildDockerImage (Thread[Task worker for ':' Thread 3,5,main]) completed. Took 1 mins 14.101 secs.
:beam-website:createDockerContainer (Thread[Task worker for ':' Thread 3,5,main]) started.
> Task :beam-website:createDockerContainer
Caching disabled for task ':beam-website:createDockerContainer': Caching has not been enabled for the task
Task ':beam-website:createDockerContainer' is not up-to-date because:
Task has not declared any outputs despite executing actions.
Starting process 'command '/bin/bash''. Working directory: <https://builds.apache.org/job/beam_Release_NightlySnapshot/ws/src/website> Command: /bin/bash -c docker create -v <https://builds.apache.org/job/beam_Release_NightlySnapshot/ws/src>:/repo -u $(id -u):$(id -g) beam-website
Successfully started process 'command '/bin/bash''
:beam-website:createDockerContainer (Thread[Task worker for ':' Thread 3,5,main]) completed. Took 0.106 secs.
:beam-website:startDockerContainer (Thread[Task worker for ':' Thread 3,5,main]) started.
> Task :beam-website:startDockerContainer
Caching disabled for task ':beam-website:startDockerContainer': Caching has not been enabled for the task
Task ':beam-website:startDockerContainer' is not up-to-date because:
Task has not declared any outputs despite executing actions.
Starting process 'command 'docker''. Working directory: <https://builds.apache.org/job/beam_Release_NightlySnapshot/ws/src/website> Command: docker start 375329fe0ea92f2d532d19eb6d47a41aad802b401bb3057c7b358bf08baa2030
Successfully started process 'command 'docker''
375329fe0ea92f2d532d19eb6d47a41aad802b401bb3057c7b358bf08baa2030
:beam-website:startDockerContainer (Thread[Task worker for ':' Thread 3,5,main]) completed. Took 0.298 secs.
:beam-website:buildLocalWebsite (Thread[Task worker for ':' Thread 3,5,main]) started.
> Task :beam-website:buildLocalWebsite
Build cache key for task ':beam-website:buildLocalWebsite' is d6db9502d100e3c75605371e26b43c36
Caching disabled for task ':beam-website:buildLocalWebsite': Caching has not been enabled for the task
Task ':beam-website:buildLocalWebsite' is not up-to-date because:
No history is available.
Starting process 'command 'docker''. Working directory: <https://builds.apache.org/job/beam_Release_NightlySnapshot/ws/src/website> Command: docker exec 375329fe0ea92f2d532d19eb6d47a41aad802b401bb3057c7b358bf08baa2030 /bin/bash -c cd /repo/build/website && bundle exec jekyll build --destination generated-local-content --config /repo/website/_config.yml,/repo/website/_config_test.yml --incremental --source /repo/website/src
Successfully started process 'command 'docker''
`/` is not writable.
Bundler will use `/tmp/bundler/home/unknown' as your home directory temporarily.
Configuration file: /repo/website/_config.yml
Configuration file: /repo/website/_config_test.yml
Source: /repo/website/src
Destination: generated-local-content
Incremental build: enabled
Generating...
done in 12.027 seconds.
Auto-regeneration: disabled. Use --watch to enable.
:beam-website:buildLocalWebsite (Thread[Task worker for ':' Thread 3,5,main]) completed. Took 13.312 secs.
:beam-website:testWebsite (Thread[Task worker for ':' Thread 3,5,main]) started.
> Task :beam-website:testWebsite
Caching disabled for task ':beam-website:testWebsite': Caching has not been enabled for the task
Task ':beam-website:testWebsite' is not up-to-date because:
Task has not declared any outputs despite executing actions.
Starting process 'command 'docker''. Working directory: <https://builds.apache.org/job/beam_Release_NightlySnapshot/ws/src/website> Command: docker exec 375329fe0ea92f2d532d19eb6d47a41aad802b401bb3057c7b358bf08baa2030 /bin/bash -c cd /repo/build/website && bundle exec rake test
Successfully started process 'command 'docker''
`/` is not writable.
Bundler will use `/tmp/bundler/home/unknown' as your home directory temporarily.
Running ["ImageCheck", "ScriptCheck", "HtmlCheck", "LinkCheck"] on ["./generated-local-content"] on *.html...
Checking 737 external links...
Ran on 181 files!
HTML-Proofer finished successfully.
:beam-website:testWebsite (Thread[Task worker for ':' Thread 3,5,main]) completed. Took 43.719 secs.
:beam-website:stopAndRemoveDockerContainer (Thread[Task worker for ':' Thread 3,5,main]) started.
> Task :beam-website:stopAndRemoveDockerContainer
Caching disabled for task ':beam-website:stopAndRemoveDockerContainer': Caching has not been enabled for the task
Task ':beam-website:stopAndRemoveDockerContainer' is not up-to-date because:
Task has not declared any outputs despite executing actions.
Starting process 'command 'docker''. Working directory: <https://builds.apache.org/job/beam_Release_NightlySnapshot/ws/src/website> Command: docker rm -f 375329fe0ea92f2d532d19eb6d47a41aad802b401bb3057c7b358bf08baa2030
Successfully started process 'command 'docker''
375329fe0ea92f2d532d19eb6d47a41aad802b401bb3057c7b358bf08baa2030
:beam-website:stopAndRemoveDockerContainer (Thread[Task worker for ':' Thread 3,5,main]) completed. Took 0.373 secs.
:beam-website:buildWebsite (Thread[Task worker for ':' Thread 3,5,main]) started.
> Task :beam-website:buildWebsite
Skipping task ':beam-website:buildWebsite' as it has no actions.
:beam-website:buildWebsite (Thread[Task worker for ':' Thread 3,5,main]) completed. Took 0.0 secs.
:beam-website:check (Thread[Task worker for ':' Thread 7,5,main]) started.
> Task :beam-website:check
Skipping task ':beam-website:check' as it has no actions.
:beam-website:check (Thread[Task worker for ':' Thread 7,5,main]) completed. Took 0.0 secs.
:beam-website:build (Thread[Task worker for ':' Thread 7,5,main]) started.
> Task :beam-website:build
Skipping task ':beam-website:build' as it has no actions.
:beam-website:build (Thread[Task worker for ':' Thread 7,5,main]) completed. Took 0.0 secs.
:release:compileJava (Thread[Task worker for ':' Thread 4,5,main]) started.
> Task :release:compileJava NO-SOURCE
file or directory '<https://builds.apache.org/job/beam_Release_NightlySnapshot/ws/src/release/src/main/java',> not found
Skipping task ':release:compileJava' as it has no source files and no previous output files.
:release:compileJava (Thread[Task worker for ':' Thread 4,5,main]) completed. Took 0.001 secs.
:release:compileGroovy (Thread[Task worker for ':' Thread 4,5,main]) started.
> Task :release:compileGroovy FROM-CACHE
Build cache key for task ':release:compileGroovy' is 963c3c0cb4a5245ed10f6e321c75ed98
Task ':release:compileGroovy' is not up-to-date because:
No history is available.
Origin for task ':release:compileGroovy': {executionTime=2334, hostName=apache-beam-jenkins-slave-group-jgm6, operatingSystem=Linux, buildInvocationId=st3kxejg5nalrbm6iymbsv3q6u, creationTime=1544862885897, type=org.gradle.api.tasks.compile.GroovyCompile_Decorated, userName=jenkins, gradleVersion=4.10.2, rootPath=<https://builds.apache.org/job/beam_Release_NightlySnapshot/ws/src,> path=:release:compileGroovy}
Unpacked output for task ':release:compileGroovy' from cache.
:release:compileGroovy (Thread[Task worker for ':' Thread 4,5,main]) completed. Took 0.013 secs.
:release:processResources (Thread[Task worker for ':' Thread 4,5,main]) started.
> Task :release:processResources NO-SOURCE
file or directory '<https://builds.apache.org/job/beam_Release_NightlySnapshot/ws/src/release/src/main/resources',> not found
Skipping task ':release:processResources' as it has no source files and no previous output files.
:release:processResources (Thread[Task worker for ':' Thread 4,5,main]) completed. Took 0.0 secs.
:release:classes (Thread[Task worker for ':' Thread 4,5,main]) started.
> Task :release:classes UP-TO-DATE
Skipping task ':release:classes' as it has no actions.
:release:classes (Thread[Task worker for ':' Thread 4,5,main]) completed. Took 0.0 secs.
:release:jar (Thread[Task worker for ':' Thread 2,5,main]) started.
> Task :release:jar
Build cache key for task ':release:jar' is 1a942f3268d9202c85aa89fb3487ff7e
Caching disabled for task ':release:jar': Caching has not been enabled for the task
Task ':release:jar' is not up-to-date because:
No history is available.
:release:jar (Thread[Task worker for ':' Thread 2,5,main]) completed. Took 0.01 secs.
:release:assemble (Thread[Task worker for ':' Thread 2,5,main]) started.
> Task :release:assemble
Skipping task ':release:assemble' as it has no actions.
:release:assemble (Thread[Task worker for ':' Thread 2,5,main]) completed. Took 0.0 secs.
:release:compileTestJava (Thread[Task worker for ':' Thread 4,5,main]) started.
> Task :release:compileTestJava NO-SOURCE
file or directory '<https://builds.apache.org/job/beam_Release_NightlySnapshot/ws/src/release/src/test/java',> not found
Skipping task ':release:compileTestJava' as it has no source files and no previous output files.
:release:compileTestJava (Thread[Task worker for ':' Thread 4,5,main]) completed. Took 0.0 secs.
:release:compileTestGroovy (Thread[Task worker for ':' Thread 4,5,main]) started.
> Task :release:compileTestGroovy NO-SOURCE
file or directory '<https://builds.apache.org/job/beam_Release_NightlySnapshot/ws/src/release/src/test/groovy',> not found
Skipping task ':release:compileTestGroovy' as it has no source files and no previous output files.
:release:compileTestGroovy (Thread[Task worker for ':' Thread 4,5,main]) completed. Took 0.0 secs.
:release:processTestResources (Thread[Task worker for ':' Thread 4,5,main]) started.
> Task :release:processTestResources NO-SOURCE
file or directory '<https://builds.apache.org/job/beam_Release_NightlySnapshot/ws/src/release/src/test/resources',> not found
Skipping task ':release:processTestResources' as it has no source files and no previous output files.
:release:processTestResources (Thread[Task worker for ':' Thread 4,5,main]) completed. Took 0.0 secs.
:release:testClasses (Thread[Task worker for ':' Thread 4,5,main]) started.
> Task :release:testClasses UP-TO-DATE
Skipping task ':release:testClasses' as it has no actions.
:release:testClasses (Thread[Task worker for ':' Thread 4,5,main]) completed. Took 0.0 secs.
:release:test (Thread[Task worker for ':' Thread 4,5,main]) started.
> Task :release:test NO-SOURCE
Skipping task ':release:test' as it has no source files and no previous output files.
:release:test (Thread[Task worker for ':' Thread 4,5,main]) completed. Took 0.0 secs.
:release:check (Thread[Task worker for ':' Thread 4,5,main]) started.
> Task :release:check UP-TO-DATE
Skipping task ':release:check' as it has no actions.
:release:check (Thread[Task worker for ':' Thread 4,5,main]) completed. Took 0.0 secs.
:release:build (Thread[Task worker for ':' Thread 4,5,main]) started.
> Task :release:build
Skipping task ':release:build' as it has no actions.
:release:build (Thread[Task worker for ':' Thread 4,5,main]) completed. Took 0.0 secs.
FAILURE: Build failed with an exception.
* What went wrong:
Execution failed for task ':beam-test-infra-metrics:test'.
> There were failing tests. See the report at: file://<https://builds.apache.org/job/beam_Release_NightlySnapshot/ws/src/.test-infra/metrics/build/reports/tests/test/index.html>
* Try:
Run with --stacktrace option to get the stack trace. Run with --debug option to get more log output. Run with --scan to get full insights.
* Get more help at https://help.gradle.org
Deprecated Gradle features were used in this build, making it incompatible with Gradle 5.0.
Use '--warning-mode all' to show the individual deprecation warnings.
See https://docs.gradle.org/4.10.2/userguide/command_line_interface.html#sec:command_line_warnings
BUILD FAILED in 1h 25m 53s
958 actionable tasks: 948 executed, 8 from cache, 2 up-to-date
Publishing build scan...
https://gradle.com/s/oalsr5slpzf2a
Closing Git repo: <https://builds.apache.org/job/beam_Release_NightlySnapshot/ws/src/.git>
Build step 'Invoke Gradle script' changed build result to FAILURE
Build step 'Invoke Gradle script' marked build as failure
---------------------------------------------------------------------
To unsubscribe, e-mail: builds-unsubscribe@beam.apache.org
For additional commands, e-mail: builds-help@beam.apache.org
See <https://builds.apache.org/job/beam_Release_NightlySnapshot/281/display/redirect>
------------------------------------------
[...truncated 52.16 MB...]
Fetching forwardable-extended 2.6.0
Installing forwardable-extended 2.6.0
Fetching mercenary 0.3.6
Installing mercenary 0.3.6
Fetching mini_portile2 2.3.0
Installing mini_portile2 2.3.0
Fetching nokogiri 1.8.2
Installing nokogiri 1.8.2 with native extensions
Fetching parallel 1.12.1
Installing parallel 1.12.1
Fetching typhoeus 1.3.0
Installing typhoeus 1.3.0
Fetching yell 2.0.7
Installing yell 2.0.7
Fetching html-proofer 3.8.0
Installing html-proofer 3.8.0
Fetching rb-fsevent 0.10.2
Installing rb-fsevent 0.10.2
Fetching rb-inotify 0.9.10
Installing rb-inotify 0.9.10
Fetching sass-listen 4.0.0
Installing sass-listen 4.0.0
Fetching sass 3.5.5
Installing sass 3.5.5
Fetching jekyll-sass-converter 1.5.2
Installing jekyll-sass-converter 1.5.2
Fetching ruby_dep 1.5.0
Installing ruby_dep 1.5.0
Fetching listen 3.1.5
Installing listen 3.1.5
Fetching jekyll-watch 1.5.1
Installing jekyll-watch 1.5.1
Fetching kramdown 1.16.2
Installing kramdown 1.16.2
Fetching liquid 3.0.6
Installing liquid 3.0.6
Fetching pathutil 0.16.1
Installing pathutil 0.16.1
Fetching rouge 1.11.1
Installing rouge 1.11.1
Fetching safe_yaml 1.0.4
Installing safe_yaml 1.0.4
Fetching jekyll 3.2.0
Installing jekyll 3.2.0
Fetching jekyll-redirect-from 0.11.0
Installing jekyll-redirect-from 0.11.0
Fetching jekyll_github_sample 0.3.1
Installing jekyll_github_sample 0.3.1
Bundle complete! 7 Gemfile dependencies, 38 gems now installed.
Bundled gems are installed into `/usr/local/bundle`
---> 7bf8b3d7b007
Removing intermediate container 47a6cfe26fef
Step 6/7 : ENV LC_ALL C.UTF-8
---> Running in 490f667837c2
---> 081d1f48e9db
Removing intermediate container 490f667837c2
Step 7/7 : CMD sleep 3600
---> Running in 5023b8cd9e84
---> 5092f836b53e
Removing intermediate container 5023b8cd9e84
Successfully built 5092f836b53e
Successfully tagged beam-website:latest
:beam-website:buildDockerImage (Thread[Task worker for ':' Thread 5,5,main]) completed. Took 1 mins 10.782 secs.
:beam-website:createDockerContainer (Thread[Task worker for ':' Thread 5,5,main]) started.
> Task :beam-website:createDockerContainer
Caching disabled for task ':beam-website:createDockerContainer': Caching has not been enabled for the task
Task ':beam-website:createDockerContainer' is not up-to-date because:
Task has not declared any outputs despite executing actions.
Starting process 'command '/bin/bash''. Working directory: <https://builds.apache.org/job/beam_Release_NightlySnapshot/ws/src/website> Command: /bin/bash -c docker create -v <https://builds.apache.org/job/beam_Release_NightlySnapshot/ws/src>:/repo -u $(id -u):$(id -g) beam-website
Successfully started process 'command '/bin/bash''
:beam-website:createDockerContainer (Thread[Task worker for ':' Thread 5,5,main]) completed. Took 0.103 secs.
:beam-website:startDockerContainer (Thread[Task worker for ':' Thread 5,5,main]) started.
> Task :beam-website:startDockerContainer
Caching disabled for task ':beam-website:startDockerContainer': Caching has not been enabled for the task
Task ':beam-website:startDockerContainer' is not up-to-date because:
Task has not declared any outputs despite executing actions.
Starting process 'command 'docker''. Working directory: <https://builds.apache.org/job/beam_Release_NightlySnapshot/ws/src/website> Command: docker start 85e4e8a05bcb8f1ccef7530e4cb94645ed0eb9f2a2dbc251fa95a999b1d1dc18
Successfully started process 'command 'docker''
85e4e8a05bcb8f1ccef7530e4cb94645ed0eb9f2a2dbc251fa95a999b1d1dc18
:beam-website:startDockerContainer (Thread[Task worker for ':' Thread 5,5,main]) completed. Took 0.28 secs.
:beam-website:buildLocalWebsite (Thread[Task worker for ':' Thread 5,5,main]) started.
> Task :beam-website:buildLocalWebsite
Build cache key for task ':beam-website:buildLocalWebsite' is ac0220b8ffe306b0c14ec34b8f860ccb
Caching disabled for task ':beam-website:buildLocalWebsite': Caching has not been enabled for the task
Task ':beam-website:buildLocalWebsite' is not up-to-date because:
No history is available.
Starting process 'command 'docker''. Working directory: <https://builds.apache.org/job/beam_Release_NightlySnapshot/ws/src/website> Command: docker exec 85e4e8a05bcb8f1ccef7530e4cb94645ed0eb9f2a2dbc251fa95a999b1d1dc18 /bin/bash -c cd /repo/build/website && bundle exec jekyll build --destination generated-local-content --config /repo/website/_config.yml,/repo/website/_config_test.yml --incremental --source /repo/website/src
Successfully started process 'command 'docker''
`/` is not writable.
Bundler will use `/tmp/bundler/home/unknown' as your home directory temporarily.
Configuration file: /repo/website/_config.yml
Configuration file: /repo/website/_config_test.yml
Source: /repo/website/src
Destination: generated-local-content
Incremental build: enabled
Generating...
done in 11.205 seconds.
Auto-regeneration: disabled. Use --watch to enable.
:beam-website:buildLocalWebsite (Thread[Task worker for ':' Thread 5,5,main]) completed. Took 12.435 secs.
:beam-website:testWebsite (Thread[Task worker for ':' Thread 5,5,main]) started.
> Task :beam-website:testWebsite
Caching disabled for task ':beam-website:testWebsite': Caching has not been enabled for the task
Task ':beam-website:testWebsite' is not up-to-date because:
Task has not declared any outputs despite executing actions.
Starting process 'command 'docker''. Working directory: <https://builds.apache.org/job/beam_Release_NightlySnapshot/ws/src/website> Command: docker exec 85e4e8a05bcb8f1ccef7530e4cb94645ed0eb9f2a2dbc251fa95a999b1d1dc18 /bin/bash -c cd /repo/build/website && bundle exec rake test
Successfully started process 'command 'docker''
`/` is not writable.
Bundler will use `/tmp/bundler/home/unknown' as your home directory temporarily.
Running ["HtmlCheck", "LinkCheck", "ImageCheck", "ScriptCheck"] on ["./generated-local-content"] on *.html...
Checking 737 external links...
Ran on 181 files!
HTML-Proofer finished successfully.
:beam-website:testWebsite (Thread[Task worker for ':' Thread 5,5,main]) completed. Took 40.74 secs.
:beam-website:stopAndRemoveDockerContainer (Thread[Task worker for ':' Thread 5,5,main]) started.
> Task :beam-website:stopAndRemoveDockerContainer
Caching disabled for task ':beam-website:stopAndRemoveDockerContainer': Caching has not been enabled for the task
Task ':beam-website:stopAndRemoveDockerContainer' is not up-to-date because:
Task has not declared any outputs despite executing actions.
Starting process 'command 'docker''. Working directory: <https://builds.apache.org/job/beam_Release_NightlySnapshot/ws/src/website> Command: docker rm -f 85e4e8a05bcb8f1ccef7530e4cb94645ed0eb9f2a2dbc251fa95a999b1d1dc18
Successfully started process 'command 'docker''
85e4e8a05bcb8f1ccef7530e4cb94645ed0eb9f2a2dbc251fa95a999b1d1dc18
:beam-website:stopAndRemoveDockerContainer (Thread[Task worker for ':' Thread 5,5,main]) completed. Took 0.405 secs.
:beam-website:buildWebsite (Thread[Task worker for ':' Thread 5,5,main]) started.
> Task :beam-website:buildWebsite
Skipping task ':beam-website:buildWebsite' as it has no actions.
:beam-website:buildWebsite (Thread[Task worker for ':' Thread 5,5,main]) completed. Took 0.0 secs.
:beam-website:check (Thread[Task worker for ':' Thread 5,5,main]) started.
> Task :beam-website:check
Skipping task ':beam-website:check' as it has no actions.
:beam-website:check (Thread[Task worker for ':' Thread 5,5,main]) completed. Took 0.0 secs.
:beam-website:build (Thread[Task worker for ':' Thread 5,5,main]) started.
> Task :beam-website:build
Skipping task ':beam-website:build' as it has no actions.
:beam-website:build (Thread[Task worker for ':' Thread 5,5,main]) completed. Took 0.0 secs.
:release:compileJava (Thread[Task worker for ':' Thread 5,5,main]) started.
> Task :release:compileJava NO-SOURCE
file or directory '<https://builds.apache.org/job/beam_Release_NightlySnapshot/ws/src/release/src/main/java',> not found
Skipping task ':release:compileJava' as it has no source files and no previous output files.
:release:compileJava (Thread[Task worker for ':' Thread 5,5,main]) completed. Took 0.001 secs.
:release:compileGroovy (Thread[Task worker for ':' Thread 5,5,main]) started.
> Task :release:compileGroovy FROM-CACHE
Build cache key for task ':release:compileGroovy' is 963c3c0cb4a5245ed10f6e321c75ed98
Task ':release:compileGroovy' is not up-to-date because:
No history is available.
Origin for task ':release:compileGroovy': {executionTime=2334, hostName=apache-beam-jenkins-slave-group-jgm6, operatingSystem=Linux, buildInvocationId=st3kxejg5nalrbm6iymbsv3q6u, creationTime=1544862885897, type=org.gradle.api.tasks.compile.GroovyCompile_Decorated, userName=jenkins, gradleVersion=4.10.2, rootPath=<https://builds.apache.org/job/beam_Release_NightlySnapshot/ws/src,> path=:release:compileGroovy}
Unpacked output for task ':release:compileGroovy' from cache.
:release:compileGroovy (Thread[Task worker for ':' Thread 5,5,main]) completed. Took 0.01 secs.
:release:processResources (Thread[Task worker for ':' Thread 5,5,main]) started.
> Task :release:processResources NO-SOURCE
file or directory '<https://builds.apache.org/job/beam_Release_NightlySnapshot/ws/src/release/src/main/resources',> not found
Skipping task ':release:processResources' as it has no source files and no previous output files.
:release:processResources (Thread[Task worker for ':' Thread 5,5,main]) completed. Took 0.0 secs.
:release:classes (Thread[Task worker for ':' Thread 5,5,main]) started.
> Task :release:classes UP-TO-DATE
Skipping task ':release:classes' as it has no actions.
:release:classes (Thread[Task worker for ':' Thread 5,5,main]) completed. Took 0.0 secs.
:release:jar (Thread[Task worker for ':' Thread 5,5,main]) started.
> Task :release:jar
Build cache key for task ':release:jar' is 1a942f3268d9202c85aa89fb3487ff7e
Caching disabled for task ':release:jar': Caching has not been enabled for the task
Task ':release:jar' is not up-to-date because:
No history is available.
:release:jar (Thread[Task worker for ':' Thread 5,5,main]) completed. Took 0.008 secs.
:release:assemble (Thread[Task worker for ':' Thread 5,5,main]) started.
> Task :release:assemble
Skipping task ':release:assemble' as it has no actions.
:release:assemble (Thread[Task worker for ':' Thread 5,5,main]) completed. Took 0.0 secs.
:release:compileTestJava (Thread[Task worker for ':' Thread 4,5,main]) started.
> Task :release:compileTestJava NO-SOURCE
file or directory '<https://builds.apache.org/job/beam_Release_NightlySnapshot/ws/src/release/src/test/java',> not found
Skipping task ':release:compileTestJava' as it has no source files and no previous output files.
:release:compileTestJava (Thread[Task worker for ':' Thread 4,5,main]) completed. Took 0.0 secs.
:release:compileTestGroovy (Thread[Task worker for ':' Thread 4,5,main]) started.
> Task :release:compileTestGroovy NO-SOURCE
file or directory '<https://builds.apache.org/job/beam_Release_NightlySnapshot/ws/src/release/src/test/groovy',> not found
Skipping task ':release:compileTestGroovy' as it has no source files and no previous output files.
:release:compileTestGroovy (Thread[Task worker for ':' Thread 4,5,main]) completed. Took 0.0 secs.
:release:processTestResources (Thread[Task worker for ':' Thread 4,5,main]) started.
> Task :release:processTestResources NO-SOURCE
file or directory '<https://builds.apache.org/job/beam_Release_NightlySnapshot/ws/src/release/src/test/resources',> not found
Skipping task ':release:processTestResources' as it has no source files and no previous output files.
:release:processTestResources (Thread[Task worker for ':' Thread 4,5,main]) completed. Took 0.0 secs.
:release:testClasses (Thread[Task worker for ':' Thread 4,5,main]) started.
> Task :release:testClasses UP-TO-DATE
Skipping task ':release:testClasses' as it has no actions.
:release:testClasses (Thread[Task worker for ':' Thread 4,5,main]) completed. Took 0.0 secs.
:release:test (Thread[Task worker for ':' Thread 4,5,main]) started.
> Task :release:test NO-SOURCE
Skipping task ':release:test' as it has no source files and no previous output files.
:release:test (Thread[Task worker for ':' Thread 4,5,main]) completed. Took 0.0 secs.
:release:check (Thread[Task worker for ':' Thread 4,5,main]) started.
> Task :release:check UP-TO-DATE
Skipping task ':release:check' as it has no actions.
:release:check (Thread[Task worker for ':' Thread 4,5,main]) completed. Took 0.0 secs.
:release:build (Thread[Task worker for ':' Thread 4,5,main]) started.
> Task :release:build
Skipping task ':release:build' as it has no actions.
:release:build (Thread[Task worker for ':' Thread 4,5,main]) completed. Took 0.0 secs.
FAILURE: Build failed with an exception.
* What went wrong:
Execution failed for task ':beam-test-infra-metrics:test'.
> There were failing tests. See the report at: file://<https://builds.apache.org/job/beam_Release_NightlySnapshot/ws/src/.test-infra/metrics/build/reports/tests/test/index.html>
* Try:
Run with --stacktrace option to get the stack trace. Run with --debug option to get more log output. Run with --scan to get full insights.
* Get more help at https://help.gradle.org
Deprecated Gradle features were used in this build, making it incompatible with Gradle 5.0.
Use '--warning-mode all' to show the individual deprecation warnings.
See https://docs.gradle.org/4.10.2/userguide/command_line_interface.html#sec:command_line_warnings
BUILD FAILED in 1h 19m 53s
958 actionable tasks: 946 executed, 10 from cache, 2 up-to-date
Publishing build scan...
https://gradle.com/s/belk53hvj6wme
Closing Git repo: <https://builds.apache.org/job/beam_Release_NightlySnapshot/ws/src/.git>
Build step 'Invoke Gradle script' changed build result to FAILURE
Build step 'Invoke Gradle script' marked build as failure
---------------------------------------------------------------------
To unsubscribe, e-mail: builds-unsubscribe@beam.apache.org
For additional commands, e-mail: builds-help@beam.apache.org
See <https://builds.apache.org/job/beam_Release_NightlySnapshot/280/display/redirect>
------------------------------------------
[...truncated 52.07 MB...]
Build cache key for task ':beam-vendor-sdks-java-extensions-protobuf:validateShadedJarDoesntLeakNonProjectClasses' is a0eee272a281745de86226d5b9ffb4d4
Caching disabled for task ':beam-vendor-sdks-java-extensions-protobuf:validateShadedJarDoesntLeakNonProjectClasses': Caching has not been enabled for the task
Task ':beam-vendor-sdks-java-extensions-protobuf:validateShadedJarDoesntLeakNonProjectClasses' is not up-to-date because:
No history is available.
:beam-vendor-sdks-java-extensions-protobuf:validateShadedJarDoesntLeakNonProjectClasses (Thread[Task worker for ':' Thread 10,5,main]) completed. Took 0.054 secs.
:beam-vendor-sdks-java-extensions-protobuf:check (Thread[Task worker for ':' Thread 10,5,main]) started.
> Task :beam-vendor-sdks-java-extensions-protobuf:check
Skipping task ':beam-vendor-sdks-java-extensions-protobuf:check' as it has no actions.
:beam-vendor-sdks-java-extensions-protobuf:check (Thread[Task worker for ':' Thread 10,5,main]) completed. Took 0.0 secs.
:beam-vendor-sdks-java-extensions-protobuf:build (Thread[Task worker for ':' Thread 10,5,main]) started.
> Task :beam-vendor-sdks-java-extensions-protobuf:build
Skipping task ':beam-vendor-sdks-java-extensions-protobuf:build' as it has no actions.
:beam-vendor-sdks-java-extensions-protobuf:build (Thread[Task worker for ':' Thread 10,5,main]) completed. Took 0.0 secs.
:beam-website:assemble (Thread[Task worker for ':' Thread 10,5,main]) started.
> Task :beam-website:assemble UP-TO-DATE
Skipping task ':beam-website:assemble' as it has no actions.
:beam-website:assemble (Thread[Task worker for ':' Thread 10,5,main]) completed. Took 0.0 secs.
:beam-website:setupBuildDir (Thread[Task worker for ':' Thread 10,5,main]) started.
> Task :beam-website:setupBuildDir
Build cache key for task ':beam-website:setupBuildDir' is fb2b365f958e0219d3a886db810dc756
Caching disabled for task ':beam-website:setupBuildDir': Caching has not been enabled for the task
Task ':beam-website:setupBuildDir' is not up-to-date because:
No history is available.
:beam-website:setupBuildDir (Thread[Task worker for ':' Thread 10,5,main]) completed. Took 0.003 secs.
:beam-website:buildDockerImage (Thread[Task worker for ':' Thread 10,5,main]) started.
> Task :beam-website:buildDockerImage
Caching disabled for task ':beam-website:buildDockerImage': Caching has not been enabled for the task
Task ':beam-website:buildDockerImage' is not up-to-date because:
Task has not declared any outputs despite executing actions.
Starting process 'command 'docker''. Working directory: <https://builds.apache.org/job/beam_Release_NightlySnapshot/ws/src/website> Command: docker build -t beam-website .
Successfully started process 'command 'docker''
Sending build context to Docker daemon 26.38MB
Step 1/7 : FROM ruby:2.5
2.5: Pulling from library/ruby
Digest: sha256:5cf80488830676b32c9533a4e3cbf06c8c940c999052412b8ed2a5b5d3200c87
Status: Downloaded newer image for ruby:2.5
---> 7834f5f61ba8
Step 2/7 : WORKDIR /ruby
---> Using cache
---> fa544db00324
Step 3/7 : RUN gem install bundler
---> Using cache
---> 3e0d9ed8a7e9
Step 4/7 : ADD Gemfile Gemfile.lock /ruby/
---> Using cache
---> d953c94860c3
Step 5/7 : RUN bundle install --deployment --path $GEM_HOME
---> Using cache
---> e465cb7cf00e
Step 6/7 : ENV LC_ALL C.UTF-8
---> Using cache
---> ab0daf0bdb66
Step 7/7 : CMD sleep 3600
---> Using cache
---> 82ddfffb318c
Successfully built 82ddfffb318c
Successfully tagged beam-website:latest
:beam-website:buildDockerImage (Thread[Task worker for ':' Thread 10,5,main]) completed. Took 1.071 secs.
:beam-website:createDockerContainer (Thread[Task worker for ':' Thread 10,5,main]) started.
> Task :beam-website:createDockerContainer
Caching disabled for task ':beam-website:createDockerContainer': Caching has not been enabled for the task
Task ':beam-website:createDockerContainer' is not up-to-date because:
Task has not declared any outputs despite executing actions.
Starting process 'command '/bin/bash''. Working directory: <https://builds.apache.org/job/beam_Release_NightlySnapshot/ws/src/website> Command: /bin/bash -c docker create -v <https://builds.apache.org/job/beam_Release_NightlySnapshot/ws/src>:/repo -u $(id -u):$(id -g) beam-website
Successfully started process 'command '/bin/bash''
:beam-website:createDockerContainer (Thread[Task worker for ':' Thread 10,5,main]) completed. Took 1.367 secs.
:beam-website:startDockerContainer (Thread[Task worker for ':' Thread 10,5,main]) started.
> Task :beam-website:startDockerContainer
Caching disabled for task ':beam-website:startDockerContainer': Caching has not been enabled for the task
Task ':beam-website:startDockerContainer' is not up-to-date because:
Task has not declared any outputs despite executing actions.
Starting process 'command 'docker''. Working directory: <https://builds.apache.org/job/beam_Release_NightlySnapshot/ws/src/website> Command: docker start 48470d5f938f852d28ffb10408e7d70930b0c8bf1f391c27e2fa8b855a23e524
Successfully started process 'command 'docker''
48470d5f938f852d28ffb10408e7d70930b0c8bf1f391c27e2fa8b855a23e524
:beam-website:startDockerContainer (Thread[Task worker for ':' Thread 10,5,main]) completed. Took 0.313 secs.
:beam-website:buildLocalWebsite (Thread[Task worker for ':' Thread 10,5,main]) started.
> Task :beam-website:buildLocalWebsite
Build cache key for task ':beam-website:buildLocalWebsite' is 73dd12a2ca4b1a56623f13c29e886068
Caching disabled for task ':beam-website:buildLocalWebsite': Caching has not been enabled for the task
Task ':beam-website:buildLocalWebsite' is not up-to-date because:
No history is available.
Starting process 'command 'docker''. Working directory: <https://builds.apache.org/job/beam_Release_NightlySnapshot/ws/src/website> Command: docker exec 48470d5f938f852d28ffb10408e7d70930b0c8bf1f391c27e2fa8b855a23e524 /bin/bash -c cd /repo/build/website && bundle exec jekyll build --destination generated-local-content --config /repo/website/_config.yml,/repo/website/_config_test.yml --incremental --source /repo/website/src
Successfully started process 'command 'docker''
`/` is not writable.
Bundler will use `/tmp/bundler/home/unknown' as your home directory temporarily.
Configuration file: /repo/website/_config.yml
Configuration file: /repo/website/_config_test.yml
Source: /repo/website/src
Destination: generated-local-content
Incremental build: enabled
Generating...
done in 11.843 seconds.
Auto-regeneration: disabled. Use --watch to enable.
:beam-website:buildLocalWebsite (Thread[Task worker for ':' Thread 10,5,main]) completed. Took 13.134 secs.
:beam-website:testWebsite (Thread[Task worker for ':' Thread 10,5,main]) started.
> Task :beam-website:testWebsite
Caching disabled for task ':beam-website:testWebsite': Caching has not been enabled for the task
Task ':beam-website:testWebsite' is not up-to-date because:
Task has not declared any outputs despite executing actions.
Starting process 'command 'docker''. Working directory: <https://builds.apache.org/job/beam_Release_NightlySnapshot/ws/src/website> Command: docker exec 48470d5f938f852d28ffb10408e7d70930b0c8bf1f391c27e2fa8b855a23e524 /bin/bash -c cd /repo/build/website && bundle exec rake test
Successfully started process 'command 'docker''
`/` is not writable.
Bundler will use `/tmp/bundler/home/unknown' as your home directory temporarily.
Running ["LinkCheck", "ScriptCheck", "ImageCheck", "HtmlCheck"] on ["./generated-local-content"] on *.html...
Checking 737 external links...
Ran on 181 files!
HTML-Proofer finished successfully.
:beam-website:testWebsite (Thread[Task worker for ':' Thread 10,5,main]) completed. Took 42.952 secs.
:beam-website:stopAndRemoveDockerContainer (Thread[Task worker for ':' Thread 10,5,main]) started.
> Task :beam-website:stopAndRemoveDockerContainer
Caching disabled for task ':beam-website:stopAndRemoveDockerContainer': Caching has not been enabled for the task
Task ':beam-website:stopAndRemoveDockerContainer' is not up-to-date because:
Task has not declared any outputs despite executing actions.
Starting process 'command 'docker''. Working directory: <https://builds.apache.org/job/beam_Release_NightlySnapshot/ws/src/website> Command: docker rm -f 48470d5f938f852d28ffb10408e7d70930b0c8bf1f391c27e2fa8b855a23e524
Successfully started process 'command 'docker''
48470d5f938f852d28ffb10408e7d70930b0c8bf1f391c27e2fa8b855a23e524
:beam-website:stopAndRemoveDockerContainer (Thread[Task worker for ':' Thread 10,5,main]) completed. Took 0.359 secs.
:beam-website:buildWebsite (Thread[Task worker for ':' Thread 10,5,main]) started.
> Task :beam-website:buildWebsite
Skipping task ':beam-website:buildWebsite' as it has no actions.
:beam-website:buildWebsite (Thread[Task worker for ':' Thread 10,5,main]) completed. Took 0.0 secs.
:beam-website:check (Thread[Task worker for ':' Thread 10,5,main]) started.
> Task :beam-website:check
Skipping task ':beam-website:check' as it has no actions.
:beam-website:check (Thread[Task worker for ':' Thread 10,5,main]) completed. Took 0.0 secs.
:beam-website:build (Thread[Task worker for ':' Thread 10,5,main]) started.
> Task :beam-website:build
Skipping task ':beam-website:build' as it has no actions.
:beam-website:build (Thread[Task worker for ':' Thread 10,5,main]) completed. Took 0.0 secs.
:release:compileJava (Thread[Task worker for ':' Thread 10,5,main]) started.
> Task :release:compileJava NO-SOURCE
file or directory '<https://builds.apache.org/job/beam_Release_NightlySnapshot/ws/src/release/src/main/java',> not found
Skipping task ':release:compileJava' as it has no source files and no previous output files.
:release:compileJava (Thread[Task worker for ':' Thread 10,5,main]) completed. Took 0.001 secs.
:release:compileGroovy (Thread[Task worker for ':' Thread 10,5,main]) started.
> Task :release:compileGroovy FROM-CACHE
Build cache key for task ':release:compileGroovy' is 963c3c0cb4a5245ed10f6e321c75ed98
Task ':release:compileGroovy' is not up-to-date because:
No history is available.
Origin for task ':release:compileGroovy': {executionTime=2334, hostName=apache-beam-jenkins-slave-group-jgm6, operatingSystem=Linux, buildInvocationId=st3kxejg5nalrbm6iymbsv3q6u, creationTime=1544862885897, type=org.gradle.api.tasks.compile.GroovyCompile_Decorated, userName=jenkins, gradleVersion=4.10.2, rootPath=<https://builds.apache.org/job/beam_Release_NightlySnapshot/ws/src,> path=:release:compileGroovy}
Unpacked output for task ':release:compileGroovy' from cache.
:release:compileGroovy (Thread[Task worker for ':' Thread 10,5,main]) completed. Took 0.009 secs.
:release:processResources (Thread[Task worker for ':' Thread 10,5,main]) started.
> Task :release:processResources NO-SOURCE
file or directory '<https://builds.apache.org/job/beam_Release_NightlySnapshot/ws/src/release/src/main/resources',> not found
Skipping task ':release:processResources' as it has no source files and no previous output files.
:release:processResources (Thread[Task worker for ':' Thread 10,5,main]) completed. Took 0.0 secs.
:release:classes (Thread[Task worker for ':' Thread 10,5,main]) started.
> Task :release:classes UP-TO-DATE
Skipping task ':release:classes' as it has no actions.
:release:classes (Thread[Task worker for ':' Thread 10,5,main]) completed. Took 0.0 secs.
:release:jar (Thread[Task worker for ':' Thread 10,5,main]) started.
> Task :release:jar
Build cache key for task ':release:jar' is 1a942f3268d9202c85aa89fb3487ff7e
Caching disabled for task ':release:jar': Caching has not been enabled for the task
Task ':release:jar' is not up-to-date because:
No history is available.
:release:jar (Thread[Task worker for ':' Thread 10,5,main]) completed. Took 0.007 secs.
:release:assemble (Thread[Task worker for ':' Thread 10,5,main]) started.
> Task :release:assemble
Skipping task ':release:assemble' as it has no actions.
:release:assemble (Thread[Task worker for ':' Thread 10,5,main]) completed. Took 0.0 secs.
:release:compileTestJava (Thread[Task worker for ':' Thread 4,5,main]) started.
> Task :release:compileTestJava NO-SOURCE
file or directory '<https://builds.apache.org/job/beam_Release_NightlySnapshot/ws/src/release/src/test/java',> not found
Skipping task ':release:compileTestJava' as it has no source files and no previous output files.
:release:compileTestJava (Thread[Task worker for ':' Thread 4,5,main]) completed. Took 0.0 secs.
:release:compileTestGroovy (Thread[Task worker for ':' Thread 4,5,main]) started.
> Task :release:compileTestGroovy NO-SOURCE
file or directory '<https://builds.apache.org/job/beam_Release_NightlySnapshot/ws/src/release/src/test/groovy',> not found
Skipping task ':release:compileTestGroovy' as it has no source files and no previous output files.
:release:compileTestGroovy (Thread[Task worker for ':' Thread 4,5,main]) completed. Took 0.0 secs.
:release:processTestResources (Thread[Task worker for ':' Thread 4,5,main]) started.
> Task :release:processTestResources NO-SOURCE
file or directory '<https://builds.apache.org/job/beam_Release_NightlySnapshot/ws/src/release/src/test/resources',> not found
Skipping task ':release:processTestResources' as it has no source files and no previous output files.
:release:processTestResources (Thread[Task worker for ':' Thread 4,5,main]) completed. Took 0.0 secs.
:release:testClasses (Thread[Task worker for ':' Thread 4,5,main]) started.
> Task :release:testClasses UP-TO-DATE
Skipping task ':release:testClasses' as it has no actions.
:release:testClasses (Thread[Task worker for ':' Thread 4,5,main]) completed. Took 0.0 secs.
:release:test (Thread[Task worker for ':',5,main]) started.
> Task :release:test NO-SOURCE
Skipping task ':release:test' as it has no source files and no previous output files.
:release:test (Thread[Task worker for ':',5,main]) completed. Took 0.0 secs.
:release:check (Thread[Task worker for ':',5,main]) started.
> Task :release:check UP-TO-DATE
Skipping task ':release:check' as it has no actions.
:release:check (Thread[Task worker for ':',5,main]) completed. Took 0.0 secs.
:release:build (Thread[Task worker for ':' Thread 4,5,main]) started.
> Task :release:build
Skipping task ':release:build' as it has no actions.
:release:build (Thread[Task worker for ':' Thread 4,5,main]) completed. Took 0.0 secs.
FAILURE: Build failed with an exception.
* What went wrong:
Execution failed for task ':beam-test-infra-metrics:test'.
> There were failing tests. See the report at: file://<https://builds.apache.org/job/beam_Release_NightlySnapshot/ws/src/.test-infra/metrics/build/reports/tests/test/index.html>
* Try:
Run with --stacktrace option to get the stack trace. Run with --debug option to get more log output. Run with --scan to get full insights.
* Get more help at https://help.gradle.org
Deprecated Gradle features were used in this build, making it incompatible with Gradle 5.0.
Use '--warning-mode all' to show the individual deprecation warnings.
See https://docs.gradle.org/4.10.2/userguide/command_line_interface.html#sec:command_line_warnings
BUILD FAILED in 1h 18m 54s
958 actionable tasks: 946 executed, 10 from cache, 2 up-to-date
Publishing build scan...
https://gradle.com/s/c6mfnumi5iwca
Closing Git repo: <https://builds.apache.org/job/beam_Release_NightlySnapshot/ws/src/.git>
Build step 'Invoke Gradle script' changed build result to FAILURE
Build step 'Invoke Gradle script' marked build as failure
---------------------------------------------------------------------
To unsubscribe, e-mail: builds-unsubscribe@beam.apache.org
For additional commands, e-mail: builds-help@beam.apache.org
See <https://builds.apache.org/job/beam_Release_NightlySnapshot/279/display/redirect?page=changes>
Changes:
[klk] [BEAM-6239] Add session side input join to Nexmark
[mxm] [website] Point Slack link to #beam channel instead of #general
[relax] Update JUnit
[relax] Put generated getter/setter/creator classes in the same package as the
[relax] Add schema support to AvroIO and PubsubIO. For backwards-compatibility
[relax] Remove unneeded @Rule.
------------------------------------------
[...truncated 52.04 MB...]
Caching disabled for task ':beam-vendor-sdks-java-extensions-protobuf:validateShadedJarDoesntLeakNonProjectClasses': Caching has not been enabled for the task
Task ':beam-vendor-sdks-java-extensions-protobuf:validateShadedJarDoesntLeakNonProjectClasses' is not up-to-date because:
No history is available.
:beam-vendor-sdks-java-extensions-protobuf:validateShadedJarDoesntLeakNonProjectClasses (Thread[Task worker for ':' Thread 2,5,main]) completed. Took 0.053 secs.
:beam-vendor-sdks-java-extensions-protobuf:check (Thread[Task worker for ':' Thread 2,5,main]) started.
> Task :beam-vendor-sdks-java-extensions-protobuf:check
Skipping task ':beam-vendor-sdks-java-extensions-protobuf:check' as it has no actions.
:beam-vendor-sdks-java-extensions-protobuf:check (Thread[Task worker for ':' Thread 2,5,main]) completed. Took 0.0 secs.
:beam-vendor-sdks-java-extensions-protobuf:build (Thread[Task worker for ':' Thread 3,5,main]) started.
> Task :beam-vendor-sdks-java-extensions-protobuf:build
Skipping task ':beam-vendor-sdks-java-extensions-protobuf:build' as it has no actions.
:beam-vendor-sdks-java-extensions-protobuf:build (Thread[Task worker for ':' Thread 3,5,main]) completed. Took 0.0 secs.
:beam-website:assemble (Thread[Task worker for ':' Thread 3,5,main]) started.
> Task :beam-website:assemble UP-TO-DATE
Skipping task ':beam-website:assemble' as it has no actions.
:beam-website:assemble (Thread[Task worker for ':' Thread 3,5,main]) completed. Took 0.0 secs.
:beam-website:setupBuildDir (Thread[Task worker for ':' Thread 6,5,main]) started.
> Task :beam-website:setupBuildDir
Build cache key for task ':beam-website:setupBuildDir' is fb2b365f958e0219d3a886db810dc756
Caching disabled for task ':beam-website:setupBuildDir': Caching has not been enabled for the task
Task ':beam-website:setupBuildDir' is not up-to-date because:
No history is available.
:beam-website:setupBuildDir (Thread[Task worker for ':' Thread 6,5,main]) completed. Took 0.004 secs.
:beam-website:buildDockerImage (Thread[Task worker for ':' Thread 6,5,main]) started.
> Task :beam-website:buildDockerImage
Caching disabled for task ':beam-website:buildDockerImage': Caching has not been enabled for the task
Task ':beam-website:buildDockerImage' is not up-to-date because:
Task has not declared any outputs despite executing actions.
Starting process 'command 'docker''. Working directory: <https://builds.apache.org/job/beam_Release_NightlySnapshot/ws/src/website> Command: docker build -t beam-website .
Successfully started process 'command 'docker''
Sending build context to Docker daemon 26.38MB
Step 1/7 : FROM ruby:2.5
2.5: Pulling from library/ruby
Digest: sha256:5cf80488830676b32c9533a4e3cbf06c8c940c999052412b8ed2a5b5d3200c87
Status: Downloaded newer image for ruby:2.5
---> 7834f5f61ba8
Step 2/7 : WORKDIR /ruby
---> Using cache
---> fa544db00324
Step 3/7 : RUN gem install bundler
---> Using cache
---> 3e0d9ed8a7e9
Step 4/7 : ADD Gemfile Gemfile.lock /ruby/
---> Using cache
---> d953c94860c3
Step 5/7 : RUN bundle install --deployment --path $GEM_HOME
---> Using cache
---> e465cb7cf00e
Step 6/7 : ENV LC_ALL C.UTF-8
---> Using cache
---> ab0daf0bdb66
Step 7/7 : CMD sleep 3600
---> Using cache
---> 82ddfffb318c
Successfully built 82ddfffb318c
Successfully tagged beam-website:latest
:beam-website:buildDockerImage (Thread[Task worker for ':' Thread 6,5,main]) completed. Took 0.973 secs.
:beam-website:createDockerContainer (Thread[Task worker for ':' Thread 6,5,main]) started.
> Task :beam-website:createDockerContainer
Caching disabled for task ':beam-website:createDockerContainer': Caching has not been enabled for the task
Task ':beam-website:createDockerContainer' is not up-to-date because:
Task has not declared any outputs despite executing actions.
Starting process 'command '/bin/bash''. Working directory: <https://builds.apache.org/job/beam_Release_NightlySnapshot/ws/src/website> Command: /bin/bash -c docker create -v <https://builds.apache.org/job/beam_Release_NightlySnapshot/ws/src>:/repo -u $(id -u):$(id -g) beam-website
Successfully started process 'command '/bin/bash''
:beam-website:createDockerContainer (Thread[Task worker for ':' Thread 6,5,main]) completed. Took 1.506 secs.
:beam-website:startDockerContainer (Thread[Task worker for ':' Thread 6,5,main]) started.
> Task :beam-website:startDockerContainer
Caching disabled for task ':beam-website:startDockerContainer': Caching has not been enabled for the task
Task ':beam-website:startDockerContainer' is not up-to-date because:
Task has not declared any outputs despite executing actions.
Starting process 'command 'docker''. Working directory: <https://builds.apache.org/job/beam_Release_NightlySnapshot/ws/src/website> Command: docker start 1b5a2712ab28a730b87975415fc0b17f4366717ad19dce53951e16083df5e503
Successfully started process 'command 'docker''
1b5a2712ab28a730b87975415fc0b17f4366717ad19dce53951e16083df5e503
:beam-website:startDockerContainer (Thread[Task worker for ':' Thread 6,5,main]) completed. Took 0.277 secs.
:beam-website:buildLocalWebsite (Thread[Task worker for ':' Thread 6,5,main]) started.
> Task :beam-website:buildLocalWebsite
Build cache key for task ':beam-website:buildLocalWebsite' is 7d1ecce7846c7ea51c72dbd1c96e28d7
Caching disabled for task ':beam-website:buildLocalWebsite': Caching has not been enabled for the task
Task ':beam-website:buildLocalWebsite' is not up-to-date because:
No history is available.
Starting process 'command 'docker''. Working directory: <https://builds.apache.org/job/beam_Release_NightlySnapshot/ws/src/website> Command: docker exec 1b5a2712ab28a730b87975415fc0b17f4366717ad19dce53951e16083df5e503 /bin/bash -c cd /repo/build/website && bundle exec jekyll build --destination generated-local-content --config /repo/website/_config.yml,/repo/website/_config_test.yml --incremental --source /repo/website/src
Successfully started process 'command 'docker''
`/` is not writable.
Bundler will use `/tmp/bundler/home/unknown' as your home directory temporarily.
Configuration file: /repo/website/_config.yml
Configuration file: /repo/website/_config_test.yml
Source: /repo/website/src
Destination: generated-local-content
Incremental build: enabled
Generating...
done in 11.273 seconds.
Auto-regeneration: disabled. Use --watch to enable.
:beam-website:buildLocalWebsite (Thread[Task worker for ':' Thread 6,5,main]) completed. Took 12.515 secs.
:beam-website:testWebsite (Thread[Task worker for ':' Thread 6,5,main]) started.
> Task :beam-website:testWebsite
Caching disabled for task ':beam-website:testWebsite': Caching has not been enabled for the task
Task ':beam-website:testWebsite' is not up-to-date because:
Task has not declared any outputs despite executing actions.
Starting process 'command 'docker''. Working directory: <https://builds.apache.org/job/beam_Release_NightlySnapshot/ws/src/website> Command: docker exec 1b5a2712ab28a730b87975415fc0b17f4366717ad19dce53951e16083df5e503 /bin/bash -c cd /repo/build/website && bundle exec rake test
Successfully started process 'command 'docker''
`/` is not writable.
Bundler will use `/tmp/bundler/home/unknown' as your home directory temporarily.
Running ["LinkCheck", "ScriptCheck", "ImageCheck", "HtmlCheck"] on ["./generated-local-content"] on *.html...
Checking 737 external links...
Ran on 181 files!
HTML-Proofer finished successfully.
:beam-website:testWebsite (Thread[Task worker for ':' Thread 6,5,main]) completed. Took 49.923 secs.
:beam-website:stopAndRemoveDockerContainer (Thread[Task worker for ':' Thread 6,5,main]) started.
> Task :beam-website:stopAndRemoveDockerContainer
Caching disabled for task ':beam-website:stopAndRemoveDockerContainer': Caching has not been enabled for the task
Task ':beam-website:stopAndRemoveDockerContainer' is not up-to-date because:
Task has not declared any outputs despite executing actions.
Starting process 'command 'docker''. Working directory: <https://builds.apache.org/job/beam_Release_NightlySnapshot/ws/src/website> Command: docker rm -f 1b5a2712ab28a730b87975415fc0b17f4366717ad19dce53951e16083df5e503
Successfully started process 'command 'docker''
1b5a2712ab28a730b87975415fc0b17f4366717ad19dce53951e16083df5e503
:beam-website:stopAndRemoveDockerContainer (Thread[Task worker for ':' Thread 6,5,main]) completed. Took 0.4 secs.
:beam-website:buildWebsite (Thread[Task worker for ':' Thread 6,5,main]) started.
> Task :beam-website:buildWebsite
Skipping task ':beam-website:buildWebsite' as it has no actions.
:beam-website:buildWebsite (Thread[Task worker for ':' Thread 6,5,main]) completed. Took 0.0 secs.
:beam-website:check (Thread[Task worker for ':' Thread 10,5,main]) started.
> Task :beam-website:check
Skipping task ':beam-website:check' as it has no actions.
:beam-website:check (Thread[Task worker for ':' Thread 10,5,main]) completed. Took 0.0 secs.
:beam-website:build (Thread[Task worker for ':' Thread 11,5,main]) started.
> Task :beam-website:build
Skipping task ':beam-website:build' as it has no actions.
:beam-website:build (Thread[Task worker for ':' Thread 11,5,main]) completed. Took 0.0 secs.
:release:compileJava (Thread[Task worker for ':' Thread 11,5,main]) started.
> Task :release:compileJava NO-SOURCE
file or directory '<https://builds.apache.org/job/beam_Release_NightlySnapshot/ws/src/release/src/main/java',> not found
Skipping task ':release:compileJava' as it has no source files and no previous output files.
:release:compileJava (Thread[Task worker for ':' Thread 11,5,main]) completed. Took 0.001 secs.
:release:compileGroovy (Thread[Task worker for ':' Thread 11,5,main]) started.
> Task :release:compileGroovy FROM-CACHE
Build cache key for task ':release:compileGroovy' is 963c3c0cb4a5245ed10f6e321c75ed98
Task ':release:compileGroovy' is not up-to-date because:
No history is available.
Origin for task ':release:compileGroovy': {executionTime=2334, hostName=apache-beam-jenkins-slave-group-jgm6, operatingSystem=Linux, buildInvocationId=st3kxejg5nalrbm6iymbsv3q6u, creationTime=1544862885897, type=org.gradle.api.tasks.compile.GroovyCompile_Decorated, userName=jenkins, gradleVersion=4.10.2, rootPath=<https://builds.apache.org/job/beam_Release_NightlySnapshot/ws/src,> path=:release:compileGroovy}
Unpacked output for task ':release:compileGroovy' from cache.
:release:compileGroovy (Thread[Task worker for ':' Thread 11,5,main]) completed. Took 0.016 secs.
:release:processResources (Thread[Task worker for ':' Thread 11,5,main]) started.
> Task :release:processResources NO-SOURCE
file or directory '<https://builds.apache.org/job/beam_Release_NightlySnapshot/ws/src/release/src/main/resources',> not found
Skipping task ':release:processResources' as it has no source files and no previous output files.
:release:processResources (Thread[Task worker for ':' Thread 11,5,main]) completed. Took 0.0 secs.
:release:classes (Thread[Task worker for ':' Thread 11,5,main]) started.
> Task :release:classes UP-TO-DATE
Skipping task ':release:classes' as it has no actions.
:release:classes (Thread[Task worker for ':' Thread 11,5,main]) completed. Took 0.0 secs.
:release:jar (Thread[Task worker for ':' Thread 11,5,main]) started.
> Task :release:jar
Build cache key for task ':release:jar' is 1a942f3268d9202c85aa89fb3487ff7e
Caching disabled for task ':release:jar': Caching has not been enabled for the task
Task ':release:jar' is not up-to-date because:
No history is available.
:release:jar (Thread[Task worker for ':' Thread 11,5,main]) completed. Took 0.008 secs.
:release:assemble (Thread[Task worker for ':' Thread 11,5,main]) started.
> Task :release:assemble
Skipping task ':release:assemble' as it has no actions.
:release:assemble (Thread[Task worker for ':' Thread 11,5,main]) completed. Took 0.0 secs.
:release:compileTestJava (Thread[Task worker for ':' Thread 2,5,main]) started.
> Task :release:compileTestJava NO-SOURCE
file or directory '<https://builds.apache.org/job/beam_Release_NightlySnapshot/ws/src/release/src/test/java',> not found
Skipping task ':release:compileTestJava' as it has no source files and no previous output files.
:release:compileTestJava (Thread[Task worker for ':' Thread 2,5,main]) completed. Took 0.0 secs.
:release:compileTestGroovy (Thread[Task worker for ':' Thread 2,5,main]) started.
> Task :release:compileTestGroovy NO-SOURCE
file or directory '<https://builds.apache.org/job/beam_Release_NightlySnapshot/ws/src/release/src/test/groovy',> not found
Skipping task ':release:compileTestGroovy' as it has no source files and no previous output files.
:release:compileTestGroovy (Thread[Task worker for ':' Thread 2,5,main]) completed. Took 0.001 secs.
:release:processTestResources (Thread[Task worker for ':' Thread 2,5,main]) started.
> Task :release:processTestResources NO-SOURCE
file or directory '<https://builds.apache.org/job/beam_Release_NightlySnapshot/ws/src/release/src/test/resources',> not found
Skipping task ':release:processTestResources' as it has no source files and no previous output files.
:release:processTestResources (Thread[Task worker for ':' Thread 2,5,main]) completed. Took 0.005 secs.
:release:testClasses (Thread[Task worker for ':' Thread 2,5,main]) started.
> Task :release:testClasses UP-TO-DATE
Skipping task ':release:testClasses' as it has no actions.
:release:testClasses (Thread[Task worker for ':' Thread 2,5,main]) completed. Took 0.0 secs.
:release:test (Thread[Task worker for ':' Thread 2,5,main]) started.
> Task :release:test NO-SOURCE
Skipping task ':release:test' as it has no source files and no previous output files.
:release:test (Thread[Task worker for ':' Thread 2,5,main]) completed. Took 0.001 secs.
:release:check (Thread[Task worker for ':' Thread 2,5,main]) started.
> Task :release:check UP-TO-DATE
Skipping task ':release:check' as it has no actions.
:release:check (Thread[Task worker for ':' Thread 2,5,main]) completed. Took 0.0 secs.
:release:build (Thread[Task worker for ':' Thread 10,5,main]) started.
> Task :release:build
Skipping task ':release:build' as it has no actions.
:release:build (Thread[Task worker for ':' Thread 10,5,main]) completed. Took 0.0 secs.
FAILURE: Build failed with an exception.
* What went wrong:
Execution failed for task ':beam-test-infra-metrics:test'.
> There were failing tests. See the report at: file://<https://builds.apache.org/job/beam_Release_NightlySnapshot/ws/src/.test-infra/metrics/build/reports/tests/test/index.html>
* Try:
Run with --stacktrace option to get the stack trace. Run with --debug option to get more log output. Run with --scan to get full insights.
* Get more help at https://help.gradle.org
Deprecated Gradle features were used in this build, making it incompatible with Gradle 5.0.
Use '--warning-mode all' to show the individual deprecation warnings.
See https://docs.gradle.org/4.10.2/userguide/command_line_interface.html#sec:command_line_warnings
BUILD FAILED in 1h 19m 28s
958 actionable tasks: 949 executed, 7 from cache, 2 up-to-date
Publishing build scan...
https://gradle.com/s/zektw52bz753c
Closing Git repo: <https://builds.apache.org/job/beam_Release_NightlySnapshot/ws/src/.git>
Stopped 1 worker daemon(s).
Build step 'Invoke Gradle script' changed build result to FAILURE
Build step 'Invoke Gradle script' marked build as failure
---------------------------------------------------------------------
To unsubscribe, e-mail: builds-unsubscribe@beam.apache.org
For additional commands, e-mail: builds-help@beam.apache.org