You are viewing a plain text version of this content. The canonical link for it is here.
Posted to builds@beam.apache.org by Apache Jenkins Server <je...@builds.apache.org> on 2020/08/23 00:38:55 UTC

Build failed in Jenkins: beam_PreCommit_Python_Cron #3154

See <https://ci-beam.apache.org/job/beam_PreCommit_Python_Cron/3154/display/redirect?page=changes>

Changes:

[noreply] Merge pull request #12653 from [BEAM-10758] Centralized Glob Translation


------------------------------------------
[...truncated 1.67 MB...]
apache_beam/io/fileio_test.py:394
  <https://ci-beam.apache.org/job/beam_PreCommit_Python_Cron/ws/src/sdks/python/test-suites/tox/py38/build/srcs/sdks/python/apache_beam/io/fileio_test.py>:394: FutureWarning: MatchFiles is experimental.
    | fileio.MatchFiles(FileSystems.join(dir, '*'))

apache_beam/io/fileio_test.py:395
  <https://ci-beam.apache.org/job/beam_PreCommit_Python_Cron/ws/src/sdks/python/test-suites/tox/py38/build/srcs/sdks/python/apache_beam/io/fileio_test.py>:395: FutureWarning: ReadMatches is experimental.
    | fileio.ReadMatches()

apache_beam/io/fileio_test.py:271
  <https://ci-beam.apache.org/job/beam_PreCommit_Python_Cron/ws/src/sdks/python/test-suites/tox/py38/build/srcs/sdks/python/apache_beam/io/fileio_test.py>:271: FutureWarning: ReadMatches is experimental.
    | fileio.ReadMatches(skip_directories=False)

apache_beam/io/fileio_test.py:252
  <https://ci-beam.apache.org/job/beam_PreCommit_Python_Cron/ws/src/sdks/python/test-suites/tox/py38/build/srcs/sdks/python/apache_beam/io/fileio_test.py>:252: FutureWarning: ReadMatches is experimental.
    | fileio.ReadMatches()

apache_beam/io/fileio_test.py:137
  <https://ci-beam.apache.org/job/beam_PreCommit_Python_Cron/ws/src/sdks/python/test-suites/tox/py38/build/srcs/sdks/python/apache_beam/io/fileio_test.py>:137: FutureWarning: MatchAll is experimental.
    | fileio.MatchAll(fileio.EmptyMatchTreatment.ALLOW_IF_WILDCARD)

apache_beam/io/fileio_test.py:452
  <https://ci-beam.apache.org/job/beam_PreCommit_Python_Cron/ws/src/sdks/python/test-suites/tox/py38/build/srcs/sdks/python/apache_beam/io/fileio_test.py>:452: FutureWarning: WriteToFiles is experimental.
    write_transform = beam.io.fileio.WriteToFiles(path=dir)

apache_beam/io/fileio_test.py:231
  <https://ci-beam.apache.org/job/beam_PreCommit_Python_Cron/ws/src/sdks/python/test-suites/tox/py38/build/srcs/sdks/python/apache_beam/io/fileio_test.py>:231: FutureWarning: MatchAll is experimental.
    | fileio.MatchAll()

apache_beam/io/fileio_test.py:232
  <https://ci-beam.apache.org/job/beam_PreCommit_Python_Cron/ws/src/sdks/python/test-suites/tox/py38/build/srcs/sdks/python/apache_beam/io/fileio_test.py>:232: FutureWarning: ReadMatches is experimental.
    | fileio.ReadMatches()

apache_beam/io/parquetio_test.py:414
  <https://ci-beam.apache.org/job/beam_PreCommit_Python_Cron/ws/src/sdks/python/test-suites/tox/py38/build/srcs/sdks/python/apache_beam/io/parquetio_test.py>:414: FutureWarning: The parameter chunksize is deprecated for pyarrow.Table.to_batches as of 0.15, please use the parameter max_chunksize instead
    for batch in orig.to_batches(chunksize=20)

apache_beam/io/fileio_test.py:584
  <https://ci-beam.apache.org/job/beam_PreCommit_Python_Cron/ws/src/sdks/python/test-suites/tox/py38/build/srcs/sdks/python/apache_beam/io/fileio_test.py>:584: FutureWarning: WriteToFiles is experimental.
    | beam.io.fileio.WriteToFiles(

apache_beam/io/fileio_test.py:593
  <https://ci-beam.apache.org/job/beam_PreCommit_Python_Cron/ws/src/sdks/python/test-suites/tox/py38/build/srcs/sdks/python/apache_beam/io/fileio_test.py>:593: FutureWarning: MatchFiles is experimental.
    files = (p | beam.io.fileio.MatchFiles(FileSystems.join(dir, '*')))

apache_beam/io/fileio_test.py:599
  <https://ci-beam.apache.org/job/beam_PreCommit_Python_Cron/ws/src/sdks/python/test-suites/tox/py38/build/srcs/sdks/python/apache_beam/io/fileio_test.py>:599: FutureWarning: ReadMatches is experimental.
    | beam.io.fileio.ReadMatches()

apache_beam/io/fileio_test.py:409
  <https://ci-beam.apache.org/job/beam_PreCommit_Python_Cron/ws/src/sdks/python/test-suites/tox/py38/build/srcs/sdks/python/apache_beam/io/fileio_test.py>:409: FutureWarning: WriteToFiles is experimental.
    | beam.io.fileio.WriteToFiles(

apache_beam/io/fileio_test.py:421
  <https://ci-beam.apache.org/job/beam_PreCommit_Python_Cron/ws/src/sdks/python/test-suites/tox/py38/build/srcs/sdks/python/apache_beam/io/fileio_test.py>:421: FutureWarning: MatchFiles is experimental.
    | fileio.MatchFiles(FileSystems.join(dir, 'cncf*'))

apache_beam/io/fileio_test.py:422
  <https://ci-beam.apache.org/job/beam_PreCommit_Python_Cron/ws/src/sdks/python/test-suites/tox/py38/build/srcs/sdks/python/apache_beam/io/fileio_test.py>:422: FutureWarning: ReadMatches is experimental.
    | fileio.ReadMatches()

apache_beam/io/fileio_test.py:429
  <https://ci-beam.apache.org/job/beam_PreCommit_Python_Cron/ws/src/sdks/python/test-suites/tox/py38/build/srcs/sdks/python/apache_beam/io/fileio_test.py>:429: FutureWarning: MatchFiles is experimental.
    "MatchApache" >> fileio.MatchFiles(FileSystems.join(dir, 'apache*'))

apache_beam/io/fileio_test.py:430
  <https://ci-beam.apache.org/job/beam_PreCommit_Python_Cron/ws/src/sdks/python/test-suites/tox/py38/build/srcs/sdks/python/apache_beam/io/fileio_test.py>:430: FutureWarning: ReadMatches is experimental.
    | "ReadApache" >> fileio.ReadMatches()

apache_beam/io/fileio_test.py:494
  <https://ci-beam.apache.org/job/beam_PreCommit_Python_Cron/ws/src/sdks/python/test-suites/tox/py38/build/srcs/sdks/python/apache_beam/io/fileio_test.py>:494: FutureWarning: WriteToFiles is experimental.
    | beam.io.fileio.WriteToFiles(

apache_beam/io/fileio_test.py:505
  <https://ci-beam.apache.org/job/beam_PreCommit_Python_Cron/ws/src/sdks/python/test-suites/tox/py38/build/srcs/sdks/python/apache_beam/io/fileio_test.py>:505: FutureWarning: MatchFiles is experimental.
    | fileio.MatchFiles(FileSystems.join(dir, 'cncf*'))

apache_beam/io/fileio_test.py:506
  <https://ci-beam.apache.org/job/beam_PreCommit_Python_Cron/ws/src/sdks/python/test-suites/tox/py38/build/srcs/sdks/python/apache_beam/io/fileio_test.py>:506: FutureWarning: ReadMatches is experimental.
    | fileio.ReadMatches()

apache_beam/io/fileio_test.py:513
  <https://ci-beam.apache.org/job/beam_PreCommit_Python_Cron/ws/src/sdks/python/test-suites/tox/py38/build/srcs/sdks/python/apache_beam/io/fileio_test.py>:513: FutureWarning: MatchFiles is experimental.
    "MatchApache" >> fileio.MatchFiles(FileSystems.join(dir, 'apache*'))

apache_beam/io/fileio_test.py:514
  <https://ci-beam.apache.org/job/beam_PreCommit_Python_Cron/ws/src/sdks/python/test-suites/tox/py38/build/srcs/sdks/python/apache_beam/io/fileio_test.py>:514: FutureWarning: ReadMatches is experimental.
    | "ReadApache" >> fileio.ReadMatches()

apache_beam/io/mongodbio_test.py:323
  <https://ci-beam.apache.org/job/beam_PreCommit_Python_Cron/ws/src/sdks/python/test-suites/tox/py38/build/srcs/sdks/python/apache_beam/io/mongodbio_test.py>:323: FutureWarning: WriteToMongoDB is experimental.
    | "Write" >> WriteToMongoDB(db='test', coll='test'))

apache_beam/io/mongodbio_test.py:264
  <https://ci-beam.apache.org/job/beam_PreCommit_Python_Cron/ws/src/sdks/python/test-suites/tox/py38/build/srcs/sdks/python/apache_beam/io/mongodbio_test.py>:264: FutureWarning: ReadFromMongoDB is experimental.
    docs = p | 'ReadFromMongoDB' >> ReadFromMongoDB(

apache_beam/io/mongodbio_test.py:339
  <https://ci-beam.apache.org/job/beam_PreCommit_Python_Cron/ws/src/sdks/python/test-suites/tox/py38/build/srcs/sdks/python/apache_beam/io/mongodbio_test.py>:339: FutureWarning: WriteToMongoDB is experimental.
    | "Write" >> WriteToMongoDB(db='test', coll='test'))

apache_beam/runners/interactive/interactive_beam.py:388
apache_beam/runners/interactive/interactive_beam.py:388
  <https://ci-beam.apache.org/job/beam_PreCommit_Python_Cron/ws/src/sdks/python/test-suites/tox/py38/build/srcs/sdks/python/apache_beam/runners/interactive/interactive_beam.py>:388: BeamDeprecationWarning: options is deprecated since First stable release. References to <pipeline>.options will not be supported
    runner, user_pipeline, user_pipeline.options)

apache_beam/runners/interactive/interactive_beam.py:411
apache_beam/runners/interactive/interactive_beam.py:411
  <https://ci-beam.apache.org/job/beam_PreCommit_Python_Cron/ws/src/sdks/python/test-suites/tox/py38/build/srcs/sdks/python/apache_beam/runners/interactive/interactive_beam.py>:411: BeamDeprecationWarning: options is deprecated since First stable release. References to <pipeline>.options will not be supported
    result = pf.PipelineFragment(list(pcolls), user_pipeline.options).run()

apache_beam/io/parquetio_test.py:365
  <https://ci-beam.apache.org/job/beam_PreCommit_Python_Cron/ws/src/sdks/python/test-suites/tox/py38/build/srcs/sdks/python/apache_beam/io/parquetio_test.py>:365: FutureWarning: The parameter chunksize is deprecated for pyarrow.Table.to_batches as of 0.15, please use the parameter max_chunksize instead
    pa.Table.from_batches([batch]) for batch in self._records_as_arrow(

/usr/lib/python3.8/unittest/case.py:1215
/usr/lib/python3.8/unittest/case.py:1215
/usr/lib/python3.8/unittest/case.py:1215
/usr/lib/python3.8/unittest/case.py:1215
/usr/lib/python3.8/unittest/case.py:1215
/usr/lib/python3.8/unittest/case.py:1215
/usr/lib/python3.8/unittest/case.py:1215
/usr/lib/python3.8/unittest/case.py:1215
/usr/lib/python3.8/unittest/case.py:1215
/usr/lib/python3.8/unittest/case.py:1215
/usr/lib/python3.8/unittest/case.py:1215
/usr/lib/python3.8/unittest/case.py:1215
/usr/lib/python3.8/unittest/case.py:1215
/usr/lib/python3.8/unittest/case.py:1215
/usr/lib/python3.8/unittest/case.py:1215
/usr/lib/python3.8/unittest/case.py:1215
/usr/lib/python3.8/unittest/case.py:1215
/usr/lib/python3.8/unittest/case.py:1215
/usr/lib/python3.8/unittest/case.py:1215
/usr/lib/python3.8/unittest/case.py:1215
/usr/lib/python3.8/unittest/case.py:1215
/usr/lib/python3.8/unittest/case.py:1215
/usr/lib/python3.8/unittest/case.py:1215
/usr/lib/python3.8/unittest/case.py:1215
/usr/lib/python3.8/unittest/case.py:1215
  /usr/lib/python3.8/unittest/case.py:1215: DeprecationWarning: assertDictContainsSubset is deprecated
    warnings.warn('assertDictContainsSubset is deprecated',

target/.tox-py38-cython/py38-cython/lib/python3.8/site-packages/hamcrest/library/collection/issequence_containinginorder.py:95
  <https://ci-beam.apache.org/job/beam_PreCommit_Python_Cron/ws/src/sdks/python/test-suites/tox/py38/build/srcs/sdks/python/target/.tox-py38-cython/py38-cython/lib/python3.8/site-packages/hamcrest/library/collection/issequence_containinginorder.py>:95: DeprecationWarning: deprecated - use contains_exactly(*items)
    warnings.warn("deprecated - use contains_exactly(*items)", DeprecationWarning)

apache_beam/transforms/util_test.py:651
  <https://ci-beam.apache.org/job/beam_PreCommit_Python_Cron/ws/src/sdks/python/test-suites/tox/py38/build/srcs/sdks/python/apache_beam/transforms/util_test.py>:651: FutureWarning: GroupIntoBatches is experimental.
    | util.GroupIntoBatches(GroupIntoBatchesTest.BATCH_SIZE)

-- Docs: https://docs.pytest.org/en/latest/warnings.html
- generated xml file: <https://ci-beam.apache.org/job/beam_PreCommit_Python_Cron/ws/src/sdks/python/test-suites/tox/py38/build/srcs/sdks/python/pytest_py38-cython.xml> -
=========== 2839 passed, 682 skipped, 336 warnings in 196.24 seconds ===========
============================= test session starts ==============================
platform linux -- Python 3.8.5, pytest-4.6.11, py-1.9.0, pluggy-0.13.1
cachedir: target/.tox-py38-cython/py38-cython/.pytest_cache
rootdir: <https://ci-beam.apache.org/job/beam_PreCommit_Python_Cron/ws/src/sdks/python/test-suites/tox/py38/build/srcs/sdks/python,> inifile: pytest.ini
plugins: requests-mock-1.8.0, xdist-1.34.0, timeout-1.4.2, forked-1.3.0
timeout: 600.0s
timeout method: signal
timeout func_only: False
collected 3582 items / 3520 deselected / 3 skipped / 59 selected

apache_beam/coders/fast_coders_test.py ..............................    [ 48%]
apache_beam/coders/slow_coders_test.py ..............................    [ 96%]
apache_beam/io/gcp/tests/bigquery_matcher_test.py s                      [ 98%]
apache_beam/runners/portability/stager_test.py .                         [100%]

=============================== warnings summary ===============================
apache_beam/typehints/typehints.py:693
  <https://ci-beam.apache.org/job/beam_PreCommit_Python_Cron/ws/src/sdks/python/test-suites/tox/py38/build/srcs/sdks/python/apache_beam/typehints/typehints.py>:693: DeprecationWarning: Using or importing the ABCs from 'collections' instead of from 'collections.abc' is deprecated since Python 3.3, and in 3.9 it will stop working
    if not isinstance(type_params, collections.Iterable):

apache_beam/typehints/typehints.py:532
  <https://ci-beam.apache.org/job/beam_PreCommit_Python_Cron/ws/src/sdks/python/test-suites/tox/py38/build/srcs/sdks/python/apache_beam/typehints/typehints.py>:532: DeprecationWarning: Using or importing the ABCs from 'collections' instead of from 'collections.abc' is deprecated since Python 3.3, and in 3.9 it will stop working
    if not isinstance(type_params, (collections.Sequence, set)):

apache_beam/io/vcfio.py:49
  <https://ci-beam.apache.org/job/beam_PreCommit_Python_Cron/ws/src/sdks/python/test-suites/tox/py38/build/srcs/sdks/python/apache_beam/io/vcfio.py>:49: UserWarning: VCF IO will support Python 3 after migration to Nucleus, see: BEAM-5628.
    warnings.warn(

target/.tox-py38-cython/py38-cython/lib/python3.8/site-packages/tenacity/_asyncio.py:42
  <https://ci-beam.apache.org/job/beam_PreCommit_Python_Cron/ws/src/sdks/python/test-suites/tox/py38/build/srcs/sdks/python/target/.tox-py38-cython/py38-cython/lib/python3.8/site-packages/tenacity/_asyncio.py>:42: DeprecationWarning: "@coroutine" decorator is deprecated since Python 3.8, use "async def" instead
    def call(self, fn, *args, **kwargs):

-- Docs: https://docs.pytest.org/en/latest/warnings.html
- generated xml file: <https://ci-beam.apache.org/job/beam_PreCommit_Python_Cron/ws/src/sdks/python/test-suites/tox/py38/build/srcs/sdks/python/pytest_py38-cython_no_xdist.xml> -
====== 61 passed, 4 skipped, 3520 deselected, 4 warnings in 8.05 seconds =======
py38-cython run-test-post: commands[0] | bash <https://ci-beam.apache.org/job/beam_PreCommit_Python_Cron/ws/src/sdks/python/test-suites/tox/py38/build/srcs/sdks/python/scripts/run_tox_cleanup.sh>
___________________________________ summary ____________________________________
  py38-cython: commands succeeded
  congratulations :)

> Task :sdks:python:test-suites:tox:py38:preCommitPy38

> Task :sdks:python:test-suites:dataflow:py2:preCommitIT_streaming_V2
WARNING:apache_beam.runners.dataflow.dataflow_runner:Timing out on waiting for job 2020-08-22_17_30_36-6755597624004080705 after 360 seconds
DEBUG:google.auth._default:Checking None for explicit credentials as part of auth process...
DEBUG:google.auth._default:Checking Cloud SDK credentials as part of auth process...
DEBUG:google.auth._default:Cloud SDK credentials not found on disk; not using them
DEBUG:google.auth._default:Checking for App Engine runtime as part of auth process...
DEBUG:google.auth._default:No App Engine library was found so cannot authentication via App Engine Identity Credentials.
DEBUG:google.auth.transport._http_client:Making request: GET http://169.254.169.254
DEBUG:google.auth.transport._http_client:Making request: GET http://metadata.google.internal/computeMetadata/v1/project/project-id
DEBUG:google.auth.transport.requests:Making request: GET http://metadata.google.internal/computeMetadata/v1/instance/service-accounts/default/?recursive=true
DEBUG:urllib3.connectionpool:Starting new HTTP connection (1): metadata.google.internal:80
DEBUG:urllib3.connectionpool:http://metadata.google.internal:80 "GET /computeMetadata/v1/instance/service-accounts/default/?recursive=true HTTP/1.1" 200 144
DEBUG:google.auth.transport.requests:Making request: GET http://metadata.google.internal/computeMetadata/v1/instance/service-accounts/844138762903-compute@developer.gserviceaccount.com/token
DEBUG:urllib3.connectionpool:http://metadata.google.internal:80 "GET /computeMetadata/v1/instance/service-accounts/844138762903-compute@developer.gserviceaccount.com/token HTTP/1.1" 200 221
test_streaming_wordcount_it (apache_beam.examples.streaming_wordcount_it_test.StreamingWordCountIT) ... ok

----------------------------------------------------------------------
XML: nosetests-preCommitIT-df-py27.xml
----------------------------------------------------------------------
XML: <https://ci-beam.apache.org/job/beam_PreCommit_Python_Cron/ws/src/sdks/python/nosetests.xml>
----------------------------------------------------------------------
Ran 1 test in 513.572s

OK
Worker logs: https://console.cloud.google.com/dataflow/jobs/us-central1/2020-08-22_17_30_36-6755597624004080705?project=apache-beam-testing

> Task :sdks:python:test-suites:dataflow:preCommitIT_V2

FAILURE: Build failed with an exception.

* Where:
Script '<https://ci-beam.apache.org/job/beam_PreCommit_Python_Cron/ws/src/sdks/python/test-suites/dataflow/common.gradle'> line: 79

* What went wrong:
Execution failed for task ':sdks:python:test-suites:dataflow:py37:preCommitIT_streaming'.
> Process 'command 'sh'' finished with non-zero exit value 1

* Try:
Run with --stacktrace option to get the stack trace. Run with --info or --debug option to get more log output. Run with --scan to get full insights.

* Get more help at https://help.gradle.org

Deprecated Gradle features were used in this build, making it incompatible with Gradle 6.0.
Use '--warning-mode all' to show the individual deprecation warnings.
See https://docs.gradle.org/5.2.1/userguide/command_line_interface.html#sec:command_line_warnings

BUILD FAILED in 37m 48s
87 actionable tasks: 76 executed, 11 from cache

Publishing build scan...
https://gradle.com/s/rgipi5gqj4hri

Build step 'Invoke Gradle script' changed build result to FAILURE
Build step 'Invoke Gradle script' marked build as failure

---------------------------------------------------------------------
To unsubscribe, e-mail: builds-unsubscribe@beam.apache.org
For additional commands, e-mail: builds-help@beam.apache.org


Jenkins build is back to normal : beam_PreCommit_Python_Cron #3161

Posted by Apache Jenkins Server <je...@builds.apache.org>.
See <https://ci-beam.apache.org/job/beam_PreCommit_Python_Cron/3161/display/redirect?page=changes>


---------------------------------------------------------------------
To unsubscribe, e-mail: builds-unsubscribe@beam.apache.org
For additional commands, e-mail: builds-help@beam.apache.org


Build failed in Jenkins: beam_PreCommit_Python_Cron #3160

Posted by Apache Jenkins Server <je...@builds.apache.org>.
See <https://ci-beam.apache.org/job/beam_PreCommit_Python_Cron/3160/display/redirect>

Changes:


------------------------------------------
[...truncated 1.77 MB...]
apache_beam/io/fileio_test.py:154
  <https://ci-beam.apache.org/job/beam_PreCommit_Python_Cron/ws/src/sdks/python/test-suites/tox/py38/build/srcs/sdks/python/apache_beam/io/fileio_test.py>:154: FutureWarning: ReadMatches is experimental.
    | fileio.ReadMatches()

apache_beam/io/fileio_test.py:252
  <https://ci-beam.apache.org/job/beam_PreCommit_Python_Cron/ws/src/sdks/python/test-suites/tox/py38/build/srcs/sdks/python/apache_beam/io/fileio_test.py>:252: FutureWarning: ReadMatches is experimental.
    | fileio.ReadMatches()

apache_beam/io/fileio_test.py:77
  <https://ci-beam.apache.org/job/beam_PreCommit_Python_Cron/ws/src/sdks/python/test-suites/tox/py38/build/srcs/sdks/python/apache_beam/io/fileio_test.py>:77: FutureWarning: MatchFiles is experimental.
    | fileio.MatchFiles(FileSystems.join(tempdir, '*'))

apache_beam/io/fileio_test.py:389
  <https://ci-beam.apache.org/job/beam_PreCommit_Python_Cron/ws/src/sdks/python/test-suites/tox/py38/build/srcs/sdks/python/apache_beam/io/fileio_test.py>:389: FutureWarning: WriteToFiles is experimental.
    | beam.io.fileio.WriteToFiles(path=dir))

apache_beam/io/fileio_test.py:394
  <https://ci-beam.apache.org/job/beam_PreCommit_Python_Cron/ws/src/sdks/python/test-suites/tox/py38/build/srcs/sdks/python/apache_beam/io/fileio_test.py>:394: FutureWarning: MatchFiles is experimental.
    | fileio.MatchFiles(FileSystems.join(dir, '*'))

apache_beam/io/fileio_test.py:395
  <https://ci-beam.apache.org/job/beam_PreCommit_Python_Cron/ws/src/sdks/python/test-suites/tox/py38/build/srcs/sdks/python/apache_beam/io/fileio_test.py>:395: FutureWarning: ReadMatches is experimental.
    | fileio.ReadMatches()

apache_beam/io/fileio_test.py:271
  <https://ci-beam.apache.org/job/beam_PreCommit_Python_Cron/ws/src/sdks/python/test-suites/tox/py38/build/srcs/sdks/python/apache_beam/io/fileio_test.py>:271: FutureWarning: ReadMatches is experimental.
    | fileio.ReadMatches(skip_directories=False)

apache_beam/io/fileio_test.py:137
  <https://ci-beam.apache.org/job/beam_PreCommit_Python_Cron/ws/src/sdks/python/test-suites/tox/py38/build/srcs/sdks/python/apache_beam/io/fileio_test.py>:137: FutureWarning: MatchAll is experimental.
    | fileio.MatchAll(fileio.EmptyMatchTreatment.ALLOW_IF_WILDCARD)

apache_beam/io/fileio_test.py:452
  <https://ci-beam.apache.org/job/beam_PreCommit_Python_Cron/ws/src/sdks/python/test-suites/tox/py38/build/srcs/sdks/python/apache_beam/io/fileio_test.py>:452: FutureWarning: WriteToFiles is experimental.
    write_transform = beam.io.fileio.WriteToFiles(path=dir)

apache_beam/io/fileio_test.py:231
  <https://ci-beam.apache.org/job/beam_PreCommit_Python_Cron/ws/src/sdks/python/test-suites/tox/py38/build/srcs/sdks/python/apache_beam/io/fileio_test.py>:231: FutureWarning: MatchAll is experimental.
    | fileio.MatchAll()

apache_beam/io/fileio_test.py:232
  <https://ci-beam.apache.org/job/beam_PreCommit_Python_Cron/ws/src/sdks/python/test-suites/tox/py38/build/srcs/sdks/python/apache_beam/io/fileio_test.py>:232: FutureWarning: ReadMatches is experimental.
    | fileio.ReadMatches()

apache_beam/io/parquetio_test.py:414
  <https://ci-beam.apache.org/job/beam_PreCommit_Python_Cron/ws/src/sdks/python/test-suites/tox/py38/build/srcs/sdks/python/apache_beam/io/parquetio_test.py>:414: FutureWarning: The parameter chunksize is deprecated for pyarrow.Table.to_batches as of 0.15, please use the parameter max_chunksize instead
    for batch in orig.to_batches(chunksize=20)

apache_beam/io/fileio_test.py:409
  <https://ci-beam.apache.org/job/beam_PreCommit_Python_Cron/ws/src/sdks/python/test-suites/tox/py38/build/srcs/sdks/python/apache_beam/io/fileio_test.py>:409: FutureWarning: WriteToFiles is experimental.
    | beam.io.fileio.WriteToFiles(

apache_beam/io/fileio_test.py:421
  <https://ci-beam.apache.org/job/beam_PreCommit_Python_Cron/ws/src/sdks/python/test-suites/tox/py38/build/srcs/sdks/python/apache_beam/io/fileio_test.py>:421: FutureWarning: MatchFiles is experimental.
    | fileio.MatchFiles(FileSystems.join(dir, 'cncf*'))

apache_beam/io/fileio_test.py:422
  <https://ci-beam.apache.org/job/beam_PreCommit_Python_Cron/ws/src/sdks/python/test-suites/tox/py38/build/srcs/sdks/python/apache_beam/io/fileio_test.py>:422: FutureWarning: ReadMatches is experimental.
    | fileio.ReadMatches()

apache_beam/io/fileio_test.py:429
  <https://ci-beam.apache.org/job/beam_PreCommit_Python_Cron/ws/src/sdks/python/test-suites/tox/py38/build/srcs/sdks/python/apache_beam/io/fileio_test.py>:429: FutureWarning: MatchFiles is experimental.
    "MatchApache" >> fileio.MatchFiles(FileSystems.join(dir, 'apache*'))

apache_beam/io/fileio_test.py:430
  <https://ci-beam.apache.org/job/beam_PreCommit_Python_Cron/ws/src/sdks/python/test-suites/tox/py38/build/srcs/sdks/python/apache_beam/io/fileio_test.py>:430: FutureWarning: ReadMatches is experimental.
    | "ReadApache" >> fileio.ReadMatches()

apache_beam/io/fileio_test.py:584
  <https://ci-beam.apache.org/job/beam_PreCommit_Python_Cron/ws/src/sdks/python/test-suites/tox/py38/build/srcs/sdks/python/apache_beam/io/fileio_test.py>:584: FutureWarning: WriteToFiles is experimental.
    | beam.io.fileio.WriteToFiles(

apache_beam/io/fileio_test.py:593
  <https://ci-beam.apache.org/job/beam_PreCommit_Python_Cron/ws/src/sdks/python/test-suites/tox/py38/build/srcs/sdks/python/apache_beam/io/fileio_test.py>:593: FutureWarning: MatchFiles is experimental.
    files = (p | beam.io.fileio.MatchFiles(FileSystems.join(dir, '*')))

apache_beam/io/fileio_test.py:599
  <https://ci-beam.apache.org/job/beam_PreCommit_Python_Cron/ws/src/sdks/python/test-suites/tox/py38/build/srcs/sdks/python/apache_beam/io/fileio_test.py>:599: FutureWarning: ReadMatches is experimental.
    | beam.io.fileio.ReadMatches()

apache_beam/io/fileio_test.py:494
  <https://ci-beam.apache.org/job/beam_PreCommit_Python_Cron/ws/src/sdks/python/test-suites/tox/py38/build/srcs/sdks/python/apache_beam/io/fileio_test.py>:494: FutureWarning: WriteToFiles is experimental.
    | beam.io.fileio.WriteToFiles(

apache_beam/io/fileio_test.py:505
  <https://ci-beam.apache.org/job/beam_PreCommit_Python_Cron/ws/src/sdks/python/test-suites/tox/py38/build/srcs/sdks/python/apache_beam/io/fileio_test.py>:505: FutureWarning: MatchFiles is experimental.
    | fileio.MatchFiles(FileSystems.join(dir, 'cncf*'))

apache_beam/io/fileio_test.py:506
  <https://ci-beam.apache.org/job/beam_PreCommit_Python_Cron/ws/src/sdks/python/test-suites/tox/py38/build/srcs/sdks/python/apache_beam/io/fileio_test.py>:506: FutureWarning: ReadMatches is experimental.
    | fileio.ReadMatches()

apache_beam/io/fileio_test.py:513
  <https://ci-beam.apache.org/job/beam_PreCommit_Python_Cron/ws/src/sdks/python/test-suites/tox/py38/build/srcs/sdks/python/apache_beam/io/fileio_test.py>:513: FutureWarning: MatchFiles is experimental.
    "MatchApache" >> fileio.MatchFiles(FileSystems.join(dir, 'apache*'))

apache_beam/io/fileio_test.py:514
  <https://ci-beam.apache.org/job/beam_PreCommit_Python_Cron/ws/src/sdks/python/test-suites/tox/py38/build/srcs/sdks/python/apache_beam/io/fileio_test.py>:514: FutureWarning: ReadMatches is experimental.
    | "ReadApache" >> fileio.ReadMatches()

apache_beam/io/mongodbio_test.py:323
  <https://ci-beam.apache.org/job/beam_PreCommit_Python_Cron/ws/src/sdks/python/test-suites/tox/py38/build/srcs/sdks/python/apache_beam/io/mongodbio_test.py>:323: FutureWarning: WriteToMongoDB is experimental.
    | "Write" >> WriteToMongoDB(db='test', coll='test'))

apache_beam/io/mongodbio_test.py:264
  <https://ci-beam.apache.org/job/beam_PreCommit_Python_Cron/ws/src/sdks/python/test-suites/tox/py38/build/srcs/sdks/python/apache_beam/io/mongodbio_test.py>:264: FutureWarning: ReadFromMongoDB is experimental.
    docs = p | 'ReadFromMongoDB' >> ReadFromMongoDB(

apache_beam/io/mongodbio_test.py:339
  <https://ci-beam.apache.org/job/beam_PreCommit_Python_Cron/ws/src/sdks/python/test-suites/tox/py38/build/srcs/sdks/python/apache_beam/io/mongodbio_test.py>:339: FutureWarning: WriteToMongoDB is experimental.
    | "Write" >> WriteToMongoDB(db='test', coll='test'))

/usr/lib/python3.8/unittest/case.py:1215
/usr/lib/python3.8/unittest/case.py:1215
/usr/lib/python3.8/unittest/case.py:1215
/usr/lib/python3.8/unittest/case.py:1215
/usr/lib/python3.8/unittest/case.py:1215
/usr/lib/python3.8/unittest/case.py:1215
/usr/lib/python3.8/unittest/case.py:1215
/usr/lib/python3.8/unittest/case.py:1215
/usr/lib/python3.8/unittest/case.py:1215
/usr/lib/python3.8/unittest/case.py:1215
/usr/lib/python3.8/unittest/case.py:1215
/usr/lib/python3.8/unittest/case.py:1215
/usr/lib/python3.8/unittest/case.py:1215
/usr/lib/python3.8/unittest/case.py:1215
/usr/lib/python3.8/unittest/case.py:1215
/usr/lib/python3.8/unittest/case.py:1215
/usr/lib/python3.8/unittest/case.py:1215
/usr/lib/python3.8/unittest/case.py:1215
/usr/lib/python3.8/unittest/case.py:1215
/usr/lib/python3.8/unittest/case.py:1215
/usr/lib/python3.8/unittest/case.py:1215
/usr/lib/python3.8/unittest/case.py:1215
/usr/lib/python3.8/unittest/case.py:1215
/usr/lib/python3.8/unittest/case.py:1215
/usr/lib/python3.8/unittest/case.py:1215
  /usr/lib/python3.8/unittest/case.py:1215: DeprecationWarning: assertDictContainsSubset is deprecated
    warnings.warn('assertDictContainsSubset is deprecated',

apache_beam/runners/interactive/interactive_beam.py:388
apache_beam/runners/interactive/interactive_beam.py:388
  <https://ci-beam.apache.org/job/beam_PreCommit_Python_Cron/ws/src/sdks/python/test-suites/tox/py38/build/srcs/sdks/python/apache_beam/runners/interactive/interactive_beam.py>:388: BeamDeprecationWarning: options is deprecated since First stable release. References to <pipeline>.options will not be supported
    runner, user_pipeline, user_pipeline.options)

apache_beam/runners/interactive/interactive_beam.py:411
apache_beam/runners/interactive/interactive_beam.py:411
  <https://ci-beam.apache.org/job/beam_PreCommit_Python_Cron/ws/src/sdks/python/test-suites/tox/py38/build/srcs/sdks/python/apache_beam/runners/interactive/interactive_beam.py>:411: BeamDeprecationWarning: options is deprecated since First stable release. References to <pipeline>.options will not be supported
    result = pf.PipelineFragment(list(pcolls), user_pipeline.options).run()

apache_beam/io/parquetio_test.py:365
  <https://ci-beam.apache.org/job/beam_PreCommit_Python_Cron/ws/src/sdks/python/test-suites/tox/py38/build/srcs/sdks/python/apache_beam/io/parquetio_test.py>:365: FutureWarning: The parameter chunksize is deprecated for pyarrow.Table.to_batches as of 0.15, please use the parameter max_chunksize instead
    pa.Table.from_batches([batch]) for batch in self._records_as_arrow(

target/.tox-py38-cython/py38-cython/lib/python3.8/site-packages/hamcrest/library/collection/issequence_containinginorder.py:95
  <https://ci-beam.apache.org/job/beam_PreCommit_Python_Cron/ws/src/sdks/python/test-suites/tox/py38/build/srcs/sdks/python/target/.tox-py38-cython/py38-cython/lib/python3.8/site-packages/hamcrest/library/collection/issequence_containinginorder.py>:95: DeprecationWarning: deprecated - use contains_exactly(*items)
    warnings.warn("deprecated - use contains_exactly(*items)", DeprecationWarning)

apache_beam/transforms/util_test.py:651
  <https://ci-beam.apache.org/job/beam_PreCommit_Python_Cron/ws/src/sdks/python/test-suites/tox/py38/build/srcs/sdks/python/apache_beam/transforms/util_test.py>:651: FutureWarning: GroupIntoBatches is experimental.
    | util.GroupIntoBatches(GroupIntoBatchesTest.BATCH_SIZE)

-- Docs: https://docs.pytest.org/en/latest/warnings.html
- generated xml file: <https://ci-beam.apache.org/job/beam_PreCommit_Python_Cron/ws/src/sdks/python/test-suites/tox/py38/build/srcs/sdks/python/pytest_py38-cython.xml> -
=========== 2839 passed, 682 skipped, 336 warnings in 191.77 seconds ===========
============================= test session starts ==============================
platform linux -- Python 3.8.5, pytest-4.6.11, py-1.9.0, pluggy-0.13.1
cachedir: target/.tox-py38-cython/py38-cython/.pytest_cache
rootdir: <https://ci-beam.apache.org/job/beam_PreCommit_Python_Cron/ws/src/sdks/python/test-suites/tox/py38/build/srcs/sdks/python,> inifile: pytest.ini
plugins: requests-mock-1.8.0, xdist-1.34.0, timeout-1.4.2, forked-1.3.0
timeout: 600.0s
timeout method: signal
timeout func_only: False
collected 3582 items / 3520 deselected / 3 skipped / 59 selected

apache_beam/coders/fast_coders_test.py ..............................    [ 48%]
apache_beam/coders/slow_coders_test.py ..............................    [ 96%]
apache_beam/io/gcp/tests/bigquery_matcher_test.py s                      [ 98%]
apache_beam/runners/portability/stager_test.py .                         [100%]

=============================== warnings summary ===============================
apache_beam/typehints/typehints.py:693
  <https://ci-beam.apache.org/job/beam_PreCommit_Python_Cron/ws/src/sdks/python/test-suites/tox/py38/build/srcs/sdks/python/apache_beam/typehints/typehints.py>:693: DeprecationWarning: Using or importing the ABCs from 'collections' instead of from 'collections.abc' is deprecated since Python 3.3, and in 3.9 it will stop working
    if not isinstance(type_params, collections.Iterable):

apache_beam/typehints/typehints.py:532
  <https://ci-beam.apache.org/job/beam_PreCommit_Python_Cron/ws/src/sdks/python/test-suites/tox/py38/build/srcs/sdks/python/apache_beam/typehints/typehints.py>:532: DeprecationWarning: Using or importing the ABCs from 'collections' instead of from 'collections.abc' is deprecated since Python 3.3, and in 3.9 it will stop working
    if not isinstance(type_params, (collections.Sequence, set)):

apache_beam/io/vcfio.py:49
  <https://ci-beam.apache.org/job/beam_PreCommit_Python_Cron/ws/src/sdks/python/test-suites/tox/py38/build/srcs/sdks/python/apache_beam/io/vcfio.py>:49: UserWarning: VCF IO will support Python 3 after migration to Nucleus, see: BEAM-5628.
    warnings.warn(

target/.tox-py38-cython/py38-cython/lib/python3.8/site-packages/tenacity/_asyncio.py:42
  <https://ci-beam.apache.org/job/beam_PreCommit_Python_Cron/ws/src/sdks/python/test-suites/tox/py38/build/srcs/sdks/python/target/.tox-py38-cython/py38-cython/lib/python3.8/site-packages/tenacity/_asyncio.py>:42: DeprecationWarning: "@coroutine" decorator is deprecated since Python 3.8, use "async def" instead
    def call(self, fn, *args, **kwargs):

-- Docs: https://docs.pytest.org/en/latest/warnings.html
- generated xml file: <https://ci-beam.apache.org/job/beam_PreCommit_Python_Cron/ws/src/sdks/python/test-suites/tox/py38/build/srcs/sdks/python/pytest_py38-cython_no_xdist.xml> -
====== 61 passed, 4 skipped, 3520 deselected, 4 warnings in 8.11 seconds =======
py38-cython run-test-post: commands[0] | bash <https://ci-beam.apache.org/job/beam_PreCommit_Python_Cron/ws/src/sdks/python/test-suites/tox/py38/build/srcs/sdks/python/scripts/run_tox_cleanup.sh>
___________________________________ summary ____________________________________
  py38-cython: commands succeeded
  congratulations :)

> Task :sdks:python:test-suites:tox:py38:preCommitPy38

FAILURE: Build completed with 2 failures.

1: Task failed with an exception.
-----------
* Where:
Script '<https://ci-beam.apache.org/job/beam_PreCommit_Python_Cron/ws/src/sdks/python/test-suites/dataflow/common.gradle'> line: 79

* What went wrong:
Execution failed for task ':sdks:python:test-suites:dataflow:py37:preCommitIT_batch'.
> Process 'command 'sh'' finished with non-zero exit value 1

* Try:
Run with --stacktrace option to get the stack trace. Run with --info or --debug option to get more log output. Run with --scan to get full insights.
==============================================================================

2: Task failed with an exception.
-----------
* Where:
Script '<https://ci-beam.apache.org/job/beam_PreCommit_Python_Cron/ws/src/sdks/python/test-suites/dataflow/common.gradle'> line: 79

* What went wrong:
Execution failed for task ':sdks:python:test-suites:dataflow:py2:preCommitIT_batch'.
> Process 'command 'sh'' finished with non-zero exit value 1

* Try:
Run with --stacktrace option to get the stack trace. Run with --info or --debug option to get more log output. Run with --scan to get full insights.
==============================================================================

* Get more help at https://help.gradle.org

Deprecated Gradle features were used in this build, making it incompatible with Gradle 6.0.
Use '--warning-mode all' to show the individual deprecation warnings.
See https://docs.gradle.org/5.2.1/userguide/command_line_interface.html#sec:command_line_warnings

BUILD FAILED in 33m 42s
87 actionable tasks: 70 executed, 17 from cache

Publishing build scan...
https://gradle.com/s/ml2scycutlxoq

Build step 'Invoke Gradle script' changed build result to FAILURE
Build step 'Invoke Gradle script' marked build as failure

---------------------------------------------------------------------
To unsubscribe, e-mail: builds-unsubscribe@beam.apache.org
For additional commands, e-mail: builds-help@beam.apache.org


Build failed in Jenkins: beam_PreCommit_Python_Cron #3159

Posted by Apache Jenkins Server <je...@builds.apache.org>.
See <https://ci-beam.apache.org/job/beam_PreCommit_Python_Cron/3159/display/redirect>

Changes:


------------------------------------------
[...truncated 1.68 MB...]
    | beam.io.fileio.WriteToFiles(path=dir))

apache_beam/io/fileio_test.py:394
  <https://ci-beam.apache.org/job/beam_PreCommit_Python_Cron/ws/src/sdks/python/test-suites/tox/py38/build/srcs/sdks/python/apache_beam/io/fileio_test.py>:394: FutureWarning: MatchFiles is experimental.
    | fileio.MatchFiles(FileSystems.join(dir, '*'))

apache_beam/io/fileio_test.py:395
  <https://ci-beam.apache.org/job/beam_PreCommit_Python_Cron/ws/src/sdks/python/test-suites/tox/py38/build/srcs/sdks/python/apache_beam/io/fileio_test.py>:395: FutureWarning: ReadMatches is experimental.
    | fileio.ReadMatches()

apache_beam/io/fileio_test.py:271
  <https://ci-beam.apache.org/job/beam_PreCommit_Python_Cron/ws/src/sdks/python/test-suites/tox/py38/build/srcs/sdks/python/apache_beam/io/fileio_test.py>:271: FutureWarning: ReadMatches is experimental.
    | fileio.ReadMatches(skip_directories=False)

apache_beam/io/fileio_test.py:252
  <https://ci-beam.apache.org/job/beam_PreCommit_Python_Cron/ws/src/sdks/python/test-suites/tox/py38/build/srcs/sdks/python/apache_beam/io/fileio_test.py>:252: FutureWarning: ReadMatches is experimental.
    | fileio.ReadMatches()

apache_beam/io/fileio_test.py:452
  <https://ci-beam.apache.org/job/beam_PreCommit_Python_Cron/ws/src/sdks/python/test-suites/tox/py38/build/srcs/sdks/python/apache_beam/io/fileio_test.py>:452: FutureWarning: WriteToFiles is experimental.
    write_transform = beam.io.fileio.WriteToFiles(path=dir)

apache_beam/io/fileio_test.py:137
  <https://ci-beam.apache.org/job/beam_PreCommit_Python_Cron/ws/src/sdks/python/test-suites/tox/py38/build/srcs/sdks/python/apache_beam/io/fileio_test.py>:137: FutureWarning: MatchAll is experimental.
    | fileio.MatchAll(fileio.EmptyMatchTreatment.ALLOW_IF_WILDCARD)

apache_beam/io/parquetio_test.py:414
  <https://ci-beam.apache.org/job/beam_PreCommit_Python_Cron/ws/src/sdks/python/test-suites/tox/py38/build/srcs/sdks/python/apache_beam/io/parquetio_test.py>:414: FutureWarning: The parameter chunksize is deprecated for pyarrow.Table.to_batches as of 0.15, please use the parameter max_chunksize instead
    for batch in orig.to_batches(chunksize=20)

apache_beam/io/fileio_test.py:231
  <https://ci-beam.apache.org/job/beam_PreCommit_Python_Cron/ws/src/sdks/python/test-suites/tox/py38/build/srcs/sdks/python/apache_beam/io/fileio_test.py>:231: FutureWarning: MatchAll is experimental.
    | fileio.MatchAll()

apache_beam/io/fileio_test.py:232
  <https://ci-beam.apache.org/job/beam_PreCommit_Python_Cron/ws/src/sdks/python/test-suites/tox/py38/build/srcs/sdks/python/apache_beam/io/fileio_test.py>:232: FutureWarning: ReadMatches is experimental.
    | fileio.ReadMatches()

apache_beam/io/fileio_test.py:409
  <https://ci-beam.apache.org/job/beam_PreCommit_Python_Cron/ws/src/sdks/python/test-suites/tox/py38/build/srcs/sdks/python/apache_beam/io/fileio_test.py>:409: FutureWarning: WriteToFiles is experimental.
    | beam.io.fileio.WriteToFiles(

apache_beam/io/fileio_test.py:421
  <https://ci-beam.apache.org/job/beam_PreCommit_Python_Cron/ws/src/sdks/python/test-suites/tox/py38/build/srcs/sdks/python/apache_beam/io/fileio_test.py>:421: FutureWarning: MatchFiles is experimental.
    | fileio.MatchFiles(FileSystems.join(dir, 'cncf*'))

apache_beam/io/fileio_test.py:422
  <https://ci-beam.apache.org/job/beam_PreCommit_Python_Cron/ws/src/sdks/python/test-suites/tox/py38/build/srcs/sdks/python/apache_beam/io/fileio_test.py>:422: FutureWarning: ReadMatches is experimental.
    | fileio.ReadMatches()

apache_beam/io/fileio_test.py:429
  <https://ci-beam.apache.org/job/beam_PreCommit_Python_Cron/ws/src/sdks/python/test-suites/tox/py38/build/srcs/sdks/python/apache_beam/io/fileio_test.py>:429: FutureWarning: MatchFiles is experimental.
    "MatchApache" >> fileio.MatchFiles(FileSystems.join(dir, 'apache*'))

apache_beam/io/fileio_test.py:430
  <https://ci-beam.apache.org/job/beam_PreCommit_Python_Cron/ws/src/sdks/python/test-suites/tox/py38/build/srcs/sdks/python/apache_beam/io/fileio_test.py>:430: FutureWarning: ReadMatches is experimental.
    | "ReadApache" >> fileio.ReadMatches()

apache_beam/io/fileio_test.py:584
  <https://ci-beam.apache.org/job/beam_PreCommit_Python_Cron/ws/src/sdks/python/test-suites/tox/py38/build/srcs/sdks/python/apache_beam/io/fileio_test.py>:584: FutureWarning: WriteToFiles is experimental.
    | beam.io.fileio.WriteToFiles(

apache_beam/io/fileio_test.py:593
  <https://ci-beam.apache.org/job/beam_PreCommit_Python_Cron/ws/src/sdks/python/test-suites/tox/py38/build/srcs/sdks/python/apache_beam/io/fileio_test.py>:593: FutureWarning: MatchFiles is experimental.
    files = (p | beam.io.fileio.MatchFiles(FileSystems.join(dir, '*')))

apache_beam/io/fileio_test.py:599
  <https://ci-beam.apache.org/job/beam_PreCommit_Python_Cron/ws/src/sdks/python/test-suites/tox/py38/build/srcs/sdks/python/apache_beam/io/fileio_test.py>:599: FutureWarning: ReadMatches is experimental.
    | beam.io.fileio.ReadMatches()

apache_beam/io/fileio_test.py:494
  <https://ci-beam.apache.org/job/beam_PreCommit_Python_Cron/ws/src/sdks/python/test-suites/tox/py38/build/srcs/sdks/python/apache_beam/io/fileio_test.py>:494: FutureWarning: WriteToFiles is experimental.
    | beam.io.fileio.WriteToFiles(

apache_beam/io/fileio_test.py:505
  <https://ci-beam.apache.org/job/beam_PreCommit_Python_Cron/ws/src/sdks/python/test-suites/tox/py38/build/srcs/sdks/python/apache_beam/io/fileio_test.py>:505: FutureWarning: MatchFiles is experimental.
    | fileio.MatchFiles(FileSystems.join(dir, 'cncf*'))

apache_beam/io/fileio_test.py:506
  <https://ci-beam.apache.org/job/beam_PreCommit_Python_Cron/ws/src/sdks/python/test-suites/tox/py38/build/srcs/sdks/python/apache_beam/io/fileio_test.py>:506: FutureWarning: ReadMatches is experimental.
    | fileio.ReadMatches()

apache_beam/io/fileio_test.py:513
  <https://ci-beam.apache.org/job/beam_PreCommit_Python_Cron/ws/src/sdks/python/test-suites/tox/py38/build/srcs/sdks/python/apache_beam/io/fileio_test.py>:513: FutureWarning: MatchFiles is experimental.
    "MatchApache" >> fileio.MatchFiles(FileSystems.join(dir, 'apache*'))

apache_beam/io/fileio_test.py:514
  <https://ci-beam.apache.org/job/beam_PreCommit_Python_Cron/ws/src/sdks/python/test-suites/tox/py38/build/srcs/sdks/python/apache_beam/io/fileio_test.py>:514: FutureWarning: ReadMatches is experimental.
    | "ReadApache" >> fileio.ReadMatches()

apache_beam/io/mongodbio_test.py:323
  <https://ci-beam.apache.org/job/beam_PreCommit_Python_Cron/ws/src/sdks/python/test-suites/tox/py38/build/srcs/sdks/python/apache_beam/io/mongodbio_test.py>:323: FutureWarning: WriteToMongoDB is experimental.
    | "Write" >> WriteToMongoDB(db='test', coll='test'))

/usr/lib/python3.8/unittest/case.py:1215
/usr/lib/python3.8/unittest/case.py:1215
/usr/lib/python3.8/unittest/case.py:1215
/usr/lib/python3.8/unittest/case.py:1215
/usr/lib/python3.8/unittest/case.py:1215
/usr/lib/python3.8/unittest/case.py:1215
/usr/lib/python3.8/unittest/case.py:1215
/usr/lib/python3.8/unittest/case.py:1215
/usr/lib/python3.8/unittest/case.py:1215
/usr/lib/python3.8/unittest/case.py:1215
/usr/lib/python3.8/unittest/case.py:1215
/usr/lib/python3.8/unittest/case.py:1215
/usr/lib/python3.8/unittest/case.py:1215
/usr/lib/python3.8/unittest/case.py:1215
/usr/lib/python3.8/unittest/case.py:1215
/usr/lib/python3.8/unittest/case.py:1215
/usr/lib/python3.8/unittest/case.py:1215
/usr/lib/python3.8/unittest/case.py:1215
/usr/lib/python3.8/unittest/case.py:1215
/usr/lib/python3.8/unittest/case.py:1215
/usr/lib/python3.8/unittest/case.py:1215
/usr/lib/python3.8/unittest/case.py:1215
/usr/lib/python3.8/unittest/case.py:1215
/usr/lib/python3.8/unittest/case.py:1215
/usr/lib/python3.8/unittest/case.py:1215
  /usr/lib/python3.8/unittest/case.py:1215: DeprecationWarning: assertDictContainsSubset is deprecated
    warnings.warn('assertDictContainsSubset is deprecated',

apache_beam/io/mongodbio_test.py:264
  <https://ci-beam.apache.org/job/beam_PreCommit_Python_Cron/ws/src/sdks/python/test-suites/tox/py38/build/srcs/sdks/python/apache_beam/io/mongodbio_test.py>:264: FutureWarning: ReadFromMongoDB is experimental.
    docs = p | 'ReadFromMongoDB' >> ReadFromMongoDB(

apache_beam/io/mongodbio_test.py:339
  <https://ci-beam.apache.org/job/beam_PreCommit_Python_Cron/ws/src/sdks/python/test-suites/tox/py38/build/srcs/sdks/python/apache_beam/io/mongodbio_test.py>:339: FutureWarning: WriteToMongoDB is experimental.
    | "Write" >> WriteToMongoDB(db='test', coll='test'))

apache_beam/io/parquetio_test.py:365
  <https://ci-beam.apache.org/job/beam_PreCommit_Python_Cron/ws/src/sdks/python/test-suites/tox/py38/build/srcs/sdks/python/apache_beam/io/parquetio_test.py>:365: FutureWarning: The parameter chunksize is deprecated for pyarrow.Table.to_batches as of 0.15, please use the parameter max_chunksize instead
    pa.Table.from_batches([batch]) for batch in self._records_as_arrow(

apache_beam/runners/interactive/interactive_beam.py:388
apache_beam/runners/interactive/interactive_beam.py:388
  <https://ci-beam.apache.org/job/beam_PreCommit_Python_Cron/ws/src/sdks/python/test-suites/tox/py38/build/srcs/sdks/python/apache_beam/runners/interactive/interactive_beam.py>:388: BeamDeprecationWarning: options is deprecated since First stable release. References to <pipeline>.options will not be supported
    runner, user_pipeline, user_pipeline.options)

apache_beam/runners/interactive/interactive_beam.py:411
apache_beam/runners/interactive/interactive_beam.py:411
  <https://ci-beam.apache.org/job/beam_PreCommit_Python_Cron/ws/src/sdks/python/test-suites/tox/py38/build/srcs/sdks/python/apache_beam/runners/interactive/interactive_beam.py>:411: BeamDeprecationWarning: options is deprecated since First stable release. References to <pipeline>.options will not be supported
    result = pf.PipelineFragment(list(pcolls), user_pipeline.options).run()

target/.tox-py38-cython/py38-cython/lib/python3.8/site-packages/hamcrest/library/collection/issequence_containinginorder.py:95
  <https://ci-beam.apache.org/job/beam_PreCommit_Python_Cron/ws/src/sdks/python/test-suites/tox/py38/build/srcs/sdks/python/target/.tox-py38-cython/py38-cython/lib/python3.8/site-packages/hamcrest/library/collection/issequence_containinginorder.py>:95: DeprecationWarning: deprecated - use contains_exactly(*items)
    warnings.warn("deprecated - use contains_exactly(*items)", DeprecationWarning)

apache_beam/transforms/util_test.py:651
  <https://ci-beam.apache.org/job/beam_PreCommit_Python_Cron/ws/src/sdks/python/test-suites/tox/py38/build/srcs/sdks/python/apache_beam/transforms/util_test.py>:651: FutureWarning: GroupIntoBatches is experimental.
    | util.GroupIntoBatches(GroupIntoBatchesTest.BATCH_SIZE)

-- Docs: https://docs.pytest.org/en/latest/warnings.html
- generated xml file: <https://ci-beam.apache.org/job/beam_PreCommit_Python_Cron/ws/src/sdks/python/test-suites/tox/py38/build/srcs/sdks/python/pytest_py38-cython.xml> -
=========== 2839 passed, 682 skipped, 328 warnings in 214.72 seconds ===========
============================= test session starts ==============================
platform linux -- Python 3.8.5, pytest-4.6.11, py-1.9.0, pluggy-0.13.1
cachedir: target/.tox-py38-cython/py38-cython/.pytest_cache
rootdir: <https://ci-beam.apache.org/job/beam_PreCommit_Python_Cron/ws/src/sdks/python/test-suites/tox/py38/build/srcs/sdks/python,> inifile: pytest.ini
plugins: requests-mock-1.8.0, xdist-1.34.0, timeout-1.4.2, forked-1.3.0
timeout: 600.0s
timeout method: signal
timeout func_only: False
collected 3582 items / 3520 deselected / 3 skipped / 59 selected

apache_beam/coders/fast_coders_test.py ..............................    [ 48%]
apache_beam/coders/slow_coders_test.py ..............................    [ 96%]
apache_beam/io/gcp/tests/bigquery_matcher_test.py s                      [ 98%]
apache_beam/runners/portability/stager_test.py .                         [100%]

=============================== warnings summary ===============================
apache_beam/typehints/typehints.py:693
  <https://ci-beam.apache.org/job/beam_PreCommit_Python_Cron/ws/src/sdks/python/test-suites/tox/py38/build/srcs/sdks/python/apache_beam/typehints/typehints.py>:693: DeprecationWarning: Using or importing the ABCs from 'collections' instead of from 'collections.abc' is deprecated since Python 3.3, and in 3.9 it will stop working
    if not isinstance(type_params, collections.Iterable):

apache_beam/typehints/typehints.py:532
  <https://ci-beam.apache.org/job/beam_PreCommit_Python_Cron/ws/src/sdks/python/test-suites/tox/py38/build/srcs/sdks/python/apache_beam/typehints/typehints.py>:532: DeprecationWarning: Using or importing the ABCs from 'collections' instead of from 'collections.abc' is deprecated since Python 3.3, and in 3.9 it will stop working
    if not isinstance(type_params, (collections.Sequence, set)):

apache_beam/io/vcfio.py:49
  <https://ci-beam.apache.org/job/beam_PreCommit_Python_Cron/ws/src/sdks/python/test-suites/tox/py38/build/srcs/sdks/python/apache_beam/io/vcfio.py>:49: UserWarning: VCF IO will support Python 3 after migration to Nucleus, see: BEAM-5628.
    warnings.warn(

target/.tox-py38-cython/py38-cython/lib/python3.8/site-packages/tenacity/_asyncio.py:42
  <https://ci-beam.apache.org/job/beam_PreCommit_Python_Cron/ws/src/sdks/python/test-suites/tox/py38/build/srcs/sdks/python/target/.tox-py38-cython/py38-cython/lib/python3.8/site-packages/tenacity/_asyncio.py>:42: DeprecationWarning: "@coroutine" decorator is deprecated since Python 3.8, use "async def" instead
    def call(self, fn, *args, **kwargs):

-- Docs: https://docs.pytest.org/en/latest/warnings.html
- generated xml file: <https://ci-beam.apache.org/job/beam_PreCommit_Python_Cron/ws/src/sdks/python/test-suites/tox/py38/build/srcs/sdks/python/pytest_py38-cython_no_xdist.xml> -
====== 61 passed, 4 skipped, 3520 deselected, 4 warnings in 8.30 seconds =======
py38-cython run-test-post: commands[0] | bash <https://ci-beam.apache.org/job/beam_PreCommit_Python_Cron/ws/src/sdks/python/test-suites/tox/py38/build/srcs/sdks/python/scripts/run_tox_cleanup.sh>
___________________________________ summary ____________________________________
  py38-cython: commands succeeded
  congratulations :)

> Task :sdks:python:test-suites:tox:py38:preCommitPy38

FAILURE: Build completed with 3 failures.

1: Task failed with an exception.
-----------
* Where:
Script '<https://ci-beam.apache.org/job/beam_PreCommit_Python_Cron/ws/src/sdks/python/test-suites/dataflow/common.gradle'> line: 79

* What went wrong:
Execution failed for task ':sdks:python:test-suites:dataflow:py2:preCommitIT_streaming'.
> Process 'command 'sh'' finished with non-zero exit value 1

* Try:
Run with --stacktrace option to get the stack trace. Run with --info or --debug option to get more log output. Run with --scan to get full insights.
==============================================================================

2: Task failed with an exception.
-----------
* Where:
Script '<https://ci-beam.apache.org/job/beam_PreCommit_Python_Cron/ws/src/sdks/python/test-suites/dataflow/common.gradle'> line: 79

* What went wrong:
Execution failed for task ':sdks:python:test-suites:dataflow:py37:preCommitIT_batch_V2'.
> Process 'command 'sh'' finished with non-zero exit value 1

* Try:
Run with --stacktrace option to get the stack trace. Run with --info or --debug option to get more log output. Run with --scan to get full insights.
==============================================================================

3: Task failed with an exception.
-----------
* What went wrong:
Execution failed for task ':sdks:python:test-suites:tox:py35:testPy35Cython'.
> Process 'command 'sh'' finished with non-zero exit value 1

* Try:
Run with --stacktrace option to get the stack trace. Run with --info or --debug option to get more log output. Run with --scan to get full insights.
==============================================================================

* Get more help at https://help.gradle.org

Deprecated Gradle features were used in this build, making it incompatible with Gradle 6.0.
Use '--warning-mode all' to show the individual deprecation warnings.
See https://docs.gradle.org/5.2.1/userguide/command_line_interface.html#sec:command_line_warnings

BUILD FAILED in 34m 51s
87 actionable tasks: 69 executed, 18 from cache

Publishing build scan...
https://gradle.com/s/sytwnpwfpgjs2

Build step 'Invoke Gradle script' changed build result to FAILURE
Build step 'Invoke Gradle script' marked build as failure

---------------------------------------------------------------------
To unsubscribe, e-mail: builds-unsubscribe@beam.apache.org
For additional commands, e-mail: builds-help@beam.apache.org


Build failed in Jenkins: beam_PreCommit_Python_Cron #3158

Posted by Apache Jenkins Server <je...@builds.apache.org>.
See <https://ci-beam.apache.org/job/beam_PreCommit_Python_Cron/3158/display/redirect>

Changes:


------------------------------------------
[...truncated 1.64 MB...]

apache_beam/io/fileio_test.py:271
  <https://ci-beam.apache.org/job/beam_PreCommit_Python_Cron/ws/src/sdks/python/test-suites/tox/py38/build/srcs/sdks/python/apache_beam/io/fileio_test.py>:271: FutureWarning: ReadMatches is experimental.
    | fileio.ReadMatches(skip_directories=False)

apache_beam/io/fileio_test.py:153
  <https://ci-beam.apache.org/job/beam_PreCommit_Python_Cron/ws/src/sdks/python/test-suites/tox/py38/build/srcs/sdks/python/apache_beam/io/fileio_test.py>:153: FutureWarning: MatchAll is experimental.
    | fileio.MatchAll()

apache_beam/io/fileio_test.py:154
  <https://ci-beam.apache.org/job/beam_PreCommit_Python_Cron/ws/src/sdks/python/test-suites/tox/py38/build/srcs/sdks/python/apache_beam/io/fileio_test.py>:154: FutureWarning: ReadMatches is experimental.
    | fileio.ReadMatches()

apache_beam/io/fileio_test.py:452
  <https://ci-beam.apache.org/job/beam_PreCommit_Python_Cron/ws/src/sdks/python/test-suites/tox/py38/build/srcs/sdks/python/apache_beam/io/fileio_test.py>:452: FutureWarning: WriteToFiles is experimental.
    write_transform = beam.io.fileio.WriteToFiles(path=dir)

apache_beam/io/fileio_test.py:137
  <https://ci-beam.apache.org/job/beam_PreCommit_Python_Cron/ws/src/sdks/python/test-suites/tox/py38/build/srcs/sdks/python/apache_beam/io/fileio_test.py>:137: FutureWarning: MatchAll is experimental.
    | fileio.MatchAll(fileio.EmptyMatchTreatment.ALLOW_IF_WILDCARD)

apache_beam/io/fileio_test.py:389
  <https://ci-beam.apache.org/job/beam_PreCommit_Python_Cron/ws/src/sdks/python/test-suites/tox/py38/build/srcs/sdks/python/apache_beam/io/fileio_test.py>:389: FutureWarning: WriteToFiles is experimental.
    | beam.io.fileio.WriteToFiles(path=dir))

apache_beam/io/fileio_test.py:394
  <https://ci-beam.apache.org/job/beam_PreCommit_Python_Cron/ws/src/sdks/python/test-suites/tox/py38/build/srcs/sdks/python/apache_beam/io/fileio_test.py>:394: FutureWarning: MatchFiles is experimental.
    | fileio.MatchFiles(FileSystems.join(dir, '*'))

apache_beam/io/fileio_test.py:395
  <https://ci-beam.apache.org/job/beam_PreCommit_Python_Cron/ws/src/sdks/python/test-suites/tox/py38/build/srcs/sdks/python/apache_beam/io/fileio_test.py>:395: FutureWarning: ReadMatches is experimental.
    | fileio.ReadMatches()

apache_beam/io/fileio_test.py:252
  <https://ci-beam.apache.org/job/beam_PreCommit_Python_Cron/ws/src/sdks/python/test-suites/tox/py38/build/srcs/sdks/python/apache_beam/io/fileio_test.py>:252: FutureWarning: ReadMatches is experimental.
    | fileio.ReadMatches()

apache_beam/io/fileio_test.py:231
  <https://ci-beam.apache.org/job/beam_PreCommit_Python_Cron/ws/src/sdks/python/test-suites/tox/py38/build/srcs/sdks/python/apache_beam/io/fileio_test.py>:231: FutureWarning: MatchAll is experimental.
    | fileio.MatchAll()

apache_beam/io/fileio_test.py:232
  <https://ci-beam.apache.org/job/beam_PreCommit_Python_Cron/ws/src/sdks/python/test-suites/tox/py38/build/srcs/sdks/python/apache_beam/io/fileio_test.py>:232: FutureWarning: ReadMatches is experimental.
    | fileio.ReadMatches()

apache_beam/io/parquetio_test.py:414
  <https://ci-beam.apache.org/job/beam_PreCommit_Python_Cron/ws/src/sdks/python/test-suites/tox/py38/build/srcs/sdks/python/apache_beam/io/parquetio_test.py>:414: FutureWarning: The parameter chunksize is deprecated for pyarrow.Table.to_batches as of 0.15, please use the parameter max_chunksize instead
    for batch in orig.to_batches(chunksize=20)

apache_beam/io/fileio_test.py:584
  <https://ci-beam.apache.org/job/beam_PreCommit_Python_Cron/ws/src/sdks/python/test-suites/tox/py38/build/srcs/sdks/python/apache_beam/io/fileio_test.py>:584: FutureWarning: WriteToFiles is experimental.
    | beam.io.fileio.WriteToFiles(

apache_beam/io/fileio_test.py:593
  <https://ci-beam.apache.org/job/beam_PreCommit_Python_Cron/ws/src/sdks/python/test-suites/tox/py38/build/srcs/sdks/python/apache_beam/io/fileio_test.py>:593: FutureWarning: MatchFiles is experimental.
    files = (p | beam.io.fileio.MatchFiles(FileSystems.join(dir, '*')))

apache_beam/io/fileio_test.py:599
  <https://ci-beam.apache.org/job/beam_PreCommit_Python_Cron/ws/src/sdks/python/test-suites/tox/py38/build/srcs/sdks/python/apache_beam/io/fileio_test.py>:599: FutureWarning: ReadMatches is experimental.
    | beam.io.fileio.ReadMatches()

apache_beam/io/fileio_test.py:409
  <https://ci-beam.apache.org/job/beam_PreCommit_Python_Cron/ws/src/sdks/python/test-suites/tox/py38/build/srcs/sdks/python/apache_beam/io/fileio_test.py>:409: FutureWarning: WriteToFiles is experimental.
    | beam.io.fileio.WriteToFiles(

apache_beam/io/fileio_test.py:421
  <https://ci-beam.apache.org/job/beam_PreCommit_Python_Cron/ws/src/sdks/python/test-suites/tox/py38/build/srcs/sdks/python/apache_beam/io/fileio_test.py>:421: FutureWarning: MatchFiles is experimental.
    | fileio.MatchFiles(FileSystems.join(dir, 'cncf*'))

apache_beam/io/fileio_test.py:422
  <https://ci-beam.apache.org/job/beam_PreCommit_Python_Cron/ws/src/sdks/python/test-suites/tox/py38/build/srcs/sdks/python/apache_beam/io/fileio_test.py>:422: FutureWarning: ReadMatches is experimental.
    | fileio.ReadMatches()

apache_beam/io/fileio_test.py:429
  <https://ci-beam.apache.org/job/beam_PreCommit_Python_Cron/ws/src/sdks/python/test-suites/tox/py38/build/srcs/sdks/python/apache_beam/io/fileio_test.py>:429: FutureWarning: MatchFiles is experimental.
    "MatchApache" >> fileio.MatchFiles(FileSystems.join(dir, 'apache*'))

apache_beam/io/fileio_test.py:430
  <https://ci-beam.apache.org/job/beam_PreCommit_Python_Cron/ws/src/sdks/python/test-suites/tox/py38/build/srcs/sdks/python/apache_beam/io/fileio_test.py>:430: FutureWarning: ReadMatches is experimental.
    | "ReadApache" >> fileio.ReadMatches()

apache_beam/io/fileio_test.py:494
  <https://ci-beam.apache.org/job/beam_PreCommit_Python_Cron/ws/src/sdks/python/test-suites/tox/py38/build/srcs/sdks/python/apache_beam/io/fileio_test.py>:494: FutureWarning: WriteToFiles is experimental.
    | beam.io.fileio.WriteToFiles(

apache_beam/io/fileio_test.py:505
  <https://ci-beam.apache.org/job/beam_PreCommit_Python_Cron/ws/src/sdks/python/test-suites/tox/py38/build/srcs/sdks/python/apache_beam/io/fileio_test.py>:505: FutureWarning: MatchFiles is experimental.
    | fileio.MatchFiles(FileSystems.join(dir, 'cncf*'))

apache_beam/io/fileio_test.py:506
  <https://ci-beam.apache.org/job/beam_PreCommit_Python_Cron/ws/src/sdks/python/test-suites/tox/py38/build/srcs/sdks/python/apache_beam/io/fileio_test.py>:506: FutureWarning: ReadMatches is experimental.
    | fileio.ReadMatches()

apache_beam/io/fileio_test.py:513
  <https://ci-beam.apache.org/job/beam_PreCommit_Python_Cron/ws/src/sdks/python/test-suites/tox/py38/build/srcs/sdks/python/apache_beam/io/fileio_test.py>:513: FutureWarning: MatchFiles is experimental.
    "MatchApache" >> fileio.MatchFiles(FileSystems.join(dir, 'apache*'))

apache_beam/io/fileio_test.py:514
  <https://ci-beam.apache.org/job/beam_PreCommit_Python_Cron/ws/src/sdks/python/test-suites/tox/py38/build/srcs/sdks/python/apache_beam/io/fileio_test.py>:514: FutureWarning: ReadMatches is experimental.
    | "ReadApache" >> fileio.ReadMatches()

apache_beam/io/mongodbio_test.py:323
  <https://ci-beam.apache.org/job/beam_PreCommit_Python_Cron/ws/src/sdks/python/test-suites/tox/py38/build/srcs/sdks/python/apache_beam/io/mongodbio_test.py>:323: FutureWarning: WriteToMongoDB is experimental.
    | "Write" >> WriteToMongoDB(db='test', coll='test'))

apache_beam/io/mongodbio_test.py:264
  <https://ci-beam.apache.org/job/beam_PreCommit_Python_Cron/ws/src/sdks/python/test-suites/tox/py38/build/srcs/sdks/python/apache_beam/io/mongodbio_test.py>:264: FutureWarning: ReadFromMongoDB is experimental.
    docs = p | 'ReadFromMongoDB' >> ReadFromMongoDB(

apache_beam/io/mongodbio_test.py:339
  <https://ci-beam.apache.org/job/beam_PreCommit_Python_Cron/ws/src/sdks/python/test-suites/tox/py38/build/srcs/sdks/python/apache_beam/io/mongodbio_test.py>:339: FutureWarning: WriteToMongoDB is experimental.
    | "Write" >> WriteToMongoDB(db='test', coll='test'))

apache_beam/runners/interactive/interactive_beam.py:388
apache_beam/runners/interactive/interactive_beam.py:388
  <https://ci-beam.apache.org/job/beam_PreCommit_Python_Cron/ws/src/sdks/python/test-suites/tox/py38/build/srcs/sdks/python/apache_beam/runners/interactive/interactive_beam.py>:388: BeamDeprecationWarning: options is deprecated since First stable release. References to <pipeline>.options will not be supported
    runner, user_pipeline, user_pipeline.options)

apache_beam/runners/interactive/interactive_beam.py:411
apache_beam/runners/interactive/interactive_beam.py:411
  <https://ci-beam.apache.org/job/beam_PreCommit_Python_Cron/ws/src/sdks/python/test-suites/tox/py38/build/srcs/sdks/python/apache_beam/runners/interactive/interactive_beam.py>:411: BeamDeprecationWarning: options is deprecated since First stable release. References to <pipeline>.options will not be supported
    result = pf.PipelineFragment(list(pcolls), user_pipeline.options).run()

apache_beam/io/parquetio_test.py:365
  <https://ci-beam.apache.org/job/beam_PreCommit_Python_Cron/ws/src/sdks/python/test-suites/tox/py38/build/srcs/sdks/python/apache_beam/io/parquetio_test.py>:365: FutureWarning: The parameter chunksize is deprecated for pyarrow.Table.to_batches as of 0.15, please use the parameter max_chunksize instead
    pa.Table.from_batches([batch]) for batch in self._records_as_arrow(

/usr/lib/python3.8/unittest/case.py:1215
/usr/lib/python3.8/unittest/case.py:1215
/usr/lib/python3.8/unittest/case.py:1215
/usr/lib/python3.8/unittest/case.py:1215
/usr/lib/python3.8/unittest/case.py:1215
/usr/lib/python3.8/unittest/case.py:1215
/usr/lib/python3.8/unittest/case.py:1215
/usr/lib/python3.8/unittest/case.py:1215
/usr/lib/python3.8/unittest/case.py:1215
/usr/lib/python3.8/unittest/case.py:1215
/usr/lib/python3.8/unittest/case.py:1215
/usr/lib/python3.8/unittest/case.py:1215
/usr/lib/python3.8/unittest/case.py:1215
/usr/lib/python3.8/unittest/case.py:1215
/usr/lib/python3.8/unittest/case.py:1215
/usr/lib/python3.8/unittest/case.py:1215
/usr/lib/python3.8/unittest/case.py:1215
/usr/lib/python3.8/unittest/case.py:1215
/usr/lib/python3.8/unittest/case.py:1215
/usr/lib/python3.8/unittest/case.py:1215
/usr/lib/python3.8/unittest/case.py:1215
/usr/lib/python3.8/unittest/case.py:1215
/usr/lib/python3.8/unittest/case.py:1215
/usr/lib/python3.8/unittest/case.py:1215
/usr/lib/python3.8/unittest/case.py:1215
  /usr/lib/python3.8/unittest/case.py:1215: DeprecationWarning: assertDictContainsSubset is deprecated
    warnings.warn('assertDictContainsSubset is deprecated',

target/.tox-py38-cython/py38-cython/lib/python3.8/site-packages/hamcrest/library/collection/issequence_containinginorder.py:95
  <https://ci-beam.apache.org/job/beam_PreCommit_Python_Cron/ws/src/sdks/python/test-suites/tox/py38/build/srcs/sdks/python/target/.tox-py38-cython/py38-cython/lib/python3.8/site-packages/hamcrest/library/collection/issequence_containinginorder.py>:95: DeprecationWarning: deprecated - use contains_exactly(*items)
    warnings.warn("deprecated - use contains_exactly(*items)", DeprecationWarning)

apache_beam/transforms/util_test.py:651
  <https://ci-beam.apache.org/job/beam_PreCommit_Python_Cron/ws/src/sdks/python/test-suites/tox/py38/build/srcs/sdks/python/apache_beam/transforms/util_test.py>:651: FutureWarning: GroupIntoBatches is experimental.
    | util.GroupIntoBatches(GroupIntoBatchesTest.BATCH_SIZE)

-- Docs: https://docs.pytest.org/en/latest/warnings.html
- generated xml file: <https://ci-beam.apache.org/job/beam_PreCommit_Python_Cron/ws/src/sdks/python/test-suites/tox/py38/build/srcs/sdks/python/pytest_py38-cython.xml> -
=========== 2839 passed, 682 skipped, 330 warnings in 195.03 seconds ===========
============================= test session starts ==============================
platform linux -- Python 3.8.5, pytest-4.6.11, py-1.9.0, pluggy-0.13.1
cachedir: target/.tox-py38-cython/py38-cython/.pytest_cache
rootdir: <https://ci-beam.apache.org/job/beam_PreCommit_Python_Cron/ws/src/sdks/python/test-suites/tox/py38/build/srcs/sdks/python,> inifile: pytest.ini
plugins: requests-mock-1.8.0, xdist-1.34.0, timeout-1.4.2, forked-1.3.0
timeout: 600.0s
timeout method: signal
timeout func_only: False
collected 3582 items / 3520 deselected / 3 skipped / 59 selected

apache_beam/coders/fast_coders_test.py ..............................    [ 48%]
apache_beam/coders/slow_coders_test.py ..............................    [ 96%]
apache_beam/io/gcp/tests/bigquery_matcher_test.py s                      [ 98%]
apache_beam/runners/portability/stager_test.py .                         [100%]

=============================== warnings summary ===============================
apache_beam/typehints/typehints.py:693
  <https://ci-beam.apache.org/job/beam_PreCommit_Python_Cron/ws/src/sdks/python/test-suites/tox/py38/build/srcs/sdks/python/apache_beam/typehints/typehints.py>:693: DeprecationWarning: Using or importing the ABCs from 'collections' instead of from 'collections.abc' is deprecated since Python 3.3, and in 3.9 it will stop working
    if not isinstance(type_params, collections.Iterable):

apache_beam/typehints/typehints.py:532
  <https://ci-beam.apache.org/job/beam_PreCommit_Python_Cron/ws/src/sdks/python/test-suites/tox/py38/build/srcs/sdks/python/apache_beam/typehints/typehints.py>:532: DeprecationWarning: Using or importing the ABCs from 'collections' instead of from 'collections.abc' is deprecated since Python 3.3, and in 3.9 it will stop working
    if not isinstance(type_params, (collections.Sequence, set)):

apache_beam/io/vcfio.py:49
  <https://ci-beam.apache.org/job/beam_PreCommit_Python_Cron/ws/src/sdks/python/test-suites/tox/py38/build/srcs/sdks/python/apache_beam/io/vcfio.py>:49: UserWarning: VCF IO will support Python 3 after migration to Nucleus, see: BEAM-5628.
    warnings.warn(

target/.tox-py38-cython/py38-cython/lib/python3.8/site-packages/tenacity/_asyncio.py:42
  <https://ci-beam.apache.org/job/beam_PreCommit_Python_Cron/ws/src/sdks/python/test-suites/tox/py38/build/srcs/sdks/python/target/.tox-py38-cython/py38-cython/lib/python3.8/site-packages/tenacity/_asyncio.py>:42: DeprecationWarning: "@coroutine" decorator is deprecated since Python 3.8, use "async def" instead
    def call(self, fn, *args, **kwargs):

-- Docs: https://docs.pytest.org/en/latest/warnings.html
- generated xml file: <https://ci-beam.apache.org/job/beam_PreCommit_Python_Cron/ws/src/sdks/python/test-suites/tox/py38/build/srcs/sdks/python/pytest_py38-cython_no_xdist.xml> -
====== 61 passed, 4 skipped, 3520 deselected, 4 warnings in 8.01 seconds =======
py38-cython run-test-post: commands[0] | bash <https://ci-beam.apache.org/job/beam_PreCommit_Python_Cron/ws/src/sdks/python/test-suites/tox/py38/build/srcs/sdks/python/scripts/run_tox_cleanup.sh>
___________________________________ summary ____________________________________
  py38-cython: commands succeeded
  congratulations :)

> Task :sdks:python:test-suites:tox:py38:preCommitPy38

> Task :sdks:python:test-suites:dataflow:py2:preCommitIT_streaming_V2
test_streaming_wordcount_it (apache_beam.examples.streaming_wordcount_it_test.StreamingWordCountIT) ... ok

----------------------------------------------------------------------
XML: nosetests-preCommitIT-df-py27.xml
----------------------------------------------------------------------
XML: <https://ci-beam.apache.org/job/beam_PreCommit_Python_Cron/ws/src/sdks/python/nosetests.xml>
----------------------------------------------------------------------
Ran 1 test in 559.545s

OK
Worker logs: https://console.cloud.google.com/dataflow/jobs/us-central1/2020-08-23_17_28_28-16990659681597885102?project=apache-beam-testing

> Task :sdks:python:test-suites:dataflow:preCommitIT_V2

FAILURE: Build failed with an exception.

* Where:
Script '<https://ci-beam.apache.org/job/beam_PreCommit_Python_Cron/ws/src/sdks/python/test-suites/dataflow/common.gradle'> line: 79

* What went wrong:
Execution failed for task ':sdks:python:test-suites:dataflow:py37:preCommitIT_streaming'.
> Process 'command 'sh'' finished with non-zero exit value 1

* Try:
Run with --stacktrace option to get the stack trace. Run with --info or --debug option to get more log output. Run with --scan to get full insights.

* Get more help at https://help.gradle.org

Deprecated Gradle features were used in this build, making it incompatible with Gradle 6.0.
Use '--warning-mode all' to show the individual deprecation warnings.
See https://docs.gradle.org/5.2.1/userguide/command_line_interface.html#sec:command_line_warnings

BUILD FAILED in 36m 16s
87 actionable tasks: 69 executed, 18 from cache

Publishing build scan...
https://gradle.com/s/hvm5i4qwhavgu

Build step 'Invoke Gradle script' changed build result to FAILURE
Build step 'Invoke Gradle script' marked build as failure

---------------------------------------------------------------------
To unsubscribe, e-mail: builds-unsubscribe@beam.apache.org
For additional commands, e-mail: builds-help@beam.apache.org


Build failed in Jenkins: beam_PreCommit_Python_Cron #3157

Posted by Apache Jenkins Server <je...@builds.apache.org>.
See <https://ci-beam.apache.org/job/beam_PreCommit_Python_Cron/3157/display/redirect>

Changes:


------------------------------------------
[...truncated 1.63 MB...]
apache_beam/io/fileio_test.py:271
  <https://ci-beam.apache.org/job/beam_PreCommit_Python_Cron/ws/src/sdks/python/test-suites/tox/py38/build/srcs/sdks/python/apache_beam/io/fileio_test.py>:271: FutureWarning: ReadMatches is experimental.
    | fileio.ReadMatches(skip_directories=False)

apache_beam/io/fileio_test.py:153
  <https://ci-beam.apache.org/job/beam_PreCommit_Python_Cron/ws/src/sdks/python/test-suites/tox/py38/build/srcs/sdks/python/apache_beam/io/fileio_test.py>:153: FutureWarning: MatchAll is experimental.
    | fileio.MatchAll()

apache_beam/io/fileio_test.py:154
  <https://ci-beam.apache.org/job/beam_PreCommit_Python_Cron/ws/src/sdks/python/test-suites/tox/py38/build/srcs/sdks/python/apache_beam/io/fileio_test.py>:154: FutureWarning: ReadMatches is experimental.
    | fileio.ReadMatches()

apache_beam/io/fileio_test.py:452
  <https://ci-beam.apache.org/job/beam_PreCommit_Python_Cron/ws/src/sdks/python/test-suites/tox/py38/build/srcs/sdks/python/apache_beam/io/fileio_test.py>:452: FutureWarning: WriteToFiles is experimental.
    write_transform = beam.io.fileio.WriteToFiles(path=dir)

apache_beam/io/fileio_test.py:137
  <https://ci-beam.apache.org/job/beam_PreCommit_Python_Cron/ws/src/sdks/python/test-suites/tox/py38/build/srcs/sdks/python/apache_beam/io/fileio_test.py>:137: FutureWarning: MatchAll is experimental.
    | fileio.MatchAll(fileio.EmptyMatchTreatment.ALLOW_IF_WILDCARD)

apache_beam/io/parquetio_test.py:414
  <https://ci-beam.apache.org/job/beam_PreCommit_Python_Cron/ws/src/sdks/python/test-suites/tox/py38/build/srcs/sdks/python/apache_beam/io/parquetio_test.py>:414: FutureWarning: The parameter chunksize is deprecated for pyarrow.Table.to_batches as of 0.15, please use the parameter max_chunksize instead
    for batch in orig.to_batches(chunksize=20)

apache_beam/io/fileio_test.py:252
  <https://ci-beam.apache.org/job/beam_PreCommit_Python_Cron/ws/src/sdks/python/test-suites/tox/py38/build/srcs/sdks/python/apache_beam/io/fileio_test.py>:252: FutureWarning: ReadMatches is experimental.
    | fileio.ReadMatches()

apache_beam/io/fileio_test.py:231
  <https://ci-beam.apache.org/job/beam_PreCommit_Python_Cron/ws/src/sdks/python/test-suites/tox/py38/build/srcs/sdks/python/apache_beam/io/fileio_test.py>:231: FutureWarning: MatchAll is experimental.
    | fileio.MatchAll()

apache_beam/io/fileio_test.py:232
  <https://ci-beam.apache.org/job/beam_PreCommit_Python_Cron/ws/src/sdks/python/test-suites/tox/py38/build/srcs/sdks/python/apache_beam/io/fileio_test.py>:232: FutureWarning: ReadMatches is experimental.
    | fileio.ReadMatches()

apache_beam/io/fileio_test.py:584
  <https://ci-beam.apache.org/job/beam_PreCommit_Python_Cron/ws/src/sdks/python/test-suites/tox/py38/build/srcs/sdks/python/apache_beam/io/fileio_test.py>:584: FutureWarning: WriteToFiles is experimental.
    | beam.io.fileio.WriteToFiles(

apache_beam/io/fileio_test.py:593
  <https://ci-beam.apache.org/job/beam_PreCommit_Python_Cron/ws/src/sdks/python/test-suites/tox/py38/build/srcs/sdks/python/apache_beam/io/fileio_test.py>:593: FutureWarning: MatchFiles is experimental.
    files = (p | beam.io.fileio.MatchFiles(FileSystems.join(dir, '*')))

apache_beam/io/fileio_test.py:599
  <https://ci-beam.apache.org/job/beam_PreCommit_Python_Cron/ws/src/sdks/python/test-suites/tox/py38/build/srcs/sdks/python/apache_beam/io/fileio_test.py>:599: FutureWarning: ReadMatches is experimental.
    | beam.io.fileio.ReadMatches()

apache_beam/io/fileio_test.py:409
  <https://ci-beam.apache.org/job/beam_PreCommit_Python_Cron/ws/src/sdks/python/test-suites/tox/py38/build/srcs/sdks/python/apache_beam/io/fileio_test.py>:409: FutureWarning: WriteToFiles is experimental.
    | beam.io.fileio.WriteToFiles(

apache_beam/io/fileio_test.py:421
  <https://ci-beam.apache.org/job/beam_PreCommit_Python_Cron/ws/src/sdks/python/test-suites/tox/py38/build/srcs/sdks/python/apache_beam/io/fileio_test.py>:421: FutureWarning: MatchFiles is experimental.
    | fileio.MatchFiles(FileSystems.join(dir, 'cncf*'))

apache_beam/io/fileio_test.py:422
  <https://ci-beam.apache.org/job/beam_PreCommit_Python_Cron/ws/src/sdks/python/test-suites/tox/py38/build/srcs/sdks/python/apache_beam/io/fileio_test.py>:422: FutureWarning: ReadMatches is experimental.
    | fileio.ReadMatches()

apache_beam/io/fileio_test.py:429
  <https://ci-beam.apache.org/job/beam_PreCommit_Python_Cron/ws/src/sdks/python/test-suites/tox/py38/build/srcs/sdks/python/apache_beam/io/fileio_test.py>:429: FutureWarning: MatchFiles is experimental.
    "MatchApache" >> fileio.MatchFiles(FileSystems.join(dir, 'apache*'))

apache_beam/io/fileio_test.py:430
  <https://ci-beam.apache.org/job/beam_PreCommit_Python_Cron/ws/src/sdks/python/test-suites/tox/py38/build/srcs/sdks/python/apache_beam/io/fileio_test.py>:430: FutureWarning: ReadMatches is experimental.
    | "ReadApache" >> fileio.ReadMatches()

apache_beam/io/fileio_test.py:494
  <https://ci-beam.apache.org/job/beam_PreCommit_Python_Cron/ws/src/sdks/python/test-suites/tox/py38/build/srcs/sdks/python/apache_beam/io/fileio_test.py>:494: FutureWarning: WriteToFiles is experimental.
    | beam.io.fileio.WriteToFiles(

apache_beam/io/fileio_test.py:505
  <https://ci-beam.apache.org/job/beam_PreCommit_Python_Cron/ws/src/sdks/python/test-suites/tox/py38/build/srcs/sdks/python/apache_beam/io/fileio_test.py>:505: FutureWarning: MatchFiles is experimental.
    | fileio.MatchFiles(FileSystems.join(dir, 'cncf*'))

apache_beam/io/fileio_test.py:506
  <https://ci-beam.apache.org/job/beam_PreCommit_Python_Cron/ws/src/sdks/python/test-suites/tox/py38/build/srcs/sdks/python/apache_beam/io/fileio_test.py>:506: FutureWarning: ReadMatches is experimental.
    | fileio.ReadMatches()

apache_beam/io/fileio_test.py:513
  <https://ci-beam.apache.org/job/beam_PreCommit_Python_Cron/ws/src/sdks/python/test-suites/tox/py38/build/srcs/sdks/python/apache_beam/io/fileio_test.py>:513: FutureWarning: MatchFiles is experimental.
    "MatchApache" >> fileio.MatchFiles(FileSystems.join(dir, 'apache*'))

apache_beam/io/fileio_test.py:514
  <https://ci-beam.apache.org/job/beam_PreCommit_Python_Cron/ws/src/sdks/python/test-suites/tox/py38/build/srcs/sdks/python/apache_beam/io/fileio_test.py>:514: FutureWarning: ReadMatches is experimental.
    | "ReadApache" >> fileio.ReadMatches()

apache_beam/io/mongodbio_test.py:323
  <https://ci-beam.apache.org/job/beam_PreCommit_Python_Cron/ws/src/sdks/python/test-suites/tox/py38/build/srcs/sdks/python/apache_beam/io/mongodbio_test.py>:323: FutureWarning: WriteToMongoDB is experimental.
    | "Write" >> WriteToMongoDB(db='test', coll='test'))

/usr/lib/python3.8/unittest/case.py:1215
/usr/lib/python3.8/unittest/case.py:1215
/usr/lib/python3.8/unittest/case.py:1215
/usr/lib/python3.8/unittest/case.py:1215
/usr/lib/python3.8/unittest/case.py:1215
/usr/lib/python3.8/unittest/case.py:1215
/usr/lib/python3.8/unittest/case.py:1215
/usr/lib/python3.8/unittest/case.py:1215
/usr/lib/python3.8/unittest/case.py:1215
/usr/lib/python3.8/unittest/case.py:1215
/usr/lib/python3.8/unittest/case.py:1215
/usr/lib/python3.8/unittest/case.py:1215
/usr/lib/python3.8/unittest/case.py:1215
/usr/lib/python3.8/unittest/case.py:1215
/usr/lib/python3.8/unittest/case.py:1215
/usr/lib/python3.8/unittest/case.py:1215
/usr/lib/python3.8/unittest/case.py:1215
/usr/lib/python3.8/unittest/case.py:1215
/usr/lib/python3.8/unittest/case.py:1215
/usr/lib/python3.8/unittest/case.py:1215
/usr/lib/python3.8/unittest/case.py:1215
/usr/lib/python3.8/unittest/case.py:1215
/usr/lib/python3.8/unittest/case.py:1215
/usr/lib/python3.8/unittest/case.py:1215
/usr/lib/python3.8/unittest/case.py:1215
  /usr/lib/python3.8/unittest/case.py:1215: DeprecationWarning: assertDictContainsSubset is deprecated
    warnings.warn('assertDictContainsSubset is deprecated',

apache_beam/io/mongodbio_test.py:264
  <https://ci-beam.apache.org/job/beam_PreCommit_Python_Cron/ws/src/sdks/python/test-suites/tox/py38/build/srcs/sdks/python/apache_beam/io/mongodbio_test.py>:264: FutureWarning: ReadFromMongoDB is experimental.
    docs = p | 'ReadFromMongoDB' >> ReadFromMongoDB(

apache_beam/io/mongodbio_test.py:339
  <https://ci-beam.apache.org/job/beam_PreCommit_Python_Cron/ws/src/sdks/python/test-suites/tox/py38/build/srcs/sdks/python/apache_beam/io/mongodbio_test.py>:339: FutureWarning: WriteToMongoDB is experimental.
    | "Write" >> WriteToMongoDB(db='test', coll='test'))

apache_beam/io/parquetio_test.py:365
  <https://ci-beam.apache.org/job/beam_PreCommit_Python_Cron/ws/src/sdks/python/test-suites/tox/py38/build/srcs/sdks/python/apache_beam/io/parquetio_test.py>:365: FutureWarning: The parameter chunksize is deprecated for pyarrow.Table.to_batches as of 0.15, please use the parameter max_chunksize instead
    pa.Table.from_batches([batch]) for batch in self._records_as_arrow(

apache_beam/runners/interactive/interactive_beam.py:388
apache_beam/runners/interactive/interactive_beam.py:388
  <https://ci-beam.apache.org/job/beam_PreCommit_Python_Cron/ws/src/sdks/python/test-suites/tox/py38/build/srcs/sdks/python/apache_beam/runners/interactive/interactive_beam.py>:388: BeamDeprecationWarning: options is deprecated since First stable release. References to <pipeline>.options will not be supported
    runner, user_pipeline, user_pipeline.options)

apache_beam/runners/interactive/interactive_beam.py:411
apache_beam/runners/interactive/interactive_beam.py:411
  <https://ci-beam.apache.org/job/beam_PreCommit_Python_Cron/ws/src/sdks/python/test-suites/tox/py38/build/srcs/sdks/python/apache_beam/runners/interactive/interactive_beam.py>:411: BeamDeprecationWarning: options is deprecated since First stable release. References to <pipeline>.options will not be supported
    result = pf.PipelineFragment(list(pcolls), user_pipeline.options).run()

target/.tox-py38-cython/py38-cython/lib/python3.8/site-packages/hamcrest/library/collection/issequence_containinginorder.py:95
  <https://ci-beam.apache.org/job/beam_PreCommit_Python_Cron/ws/src/sdks/python/test-suites/tox/py38/build/srcs/sdks/python/target/.tox-py38-cython/py38-cython/lib/python3.8/site-packages/hamcrest/library/collection/issequence_containinginorder.py>:95: DeprecationWarning: deprecated - use contains_exactly(*items)
    warnings.warn("deprecated - use contains_exactly(*items)", DeprecationWarning)

apache_beam/transforms/util_test.py:651
  <https://ci-beam.apache.org/job/beam_PreCommit_Python_Cron/ws/src/sdks/python/test-suites/tox/py38/build/srcs/sdks/python/apache_beam/transforms/util_test.py>:651: FutureWarning: GroupIntoBatches is experimental.
    | util.GroupIntoBatches(GroupIntoBatchesTest.BATCH_SIZE)

-- Docs: https://docs.pytest.org/en/latest/warnings.html
- generated xml file: <https://ci-beam.apache.org/job/beam_PreCommit_Python_Cron/ws/src/sdks/python/test-suites/tox/py38/build/srcs/sdks/python/pytest_py38-cython.xml> -
=========== 2839 passed, 682 skipped, 326 warnings in 201.23 seconds ===========
============================= test session starts ==============================
platform linux -- Python 3.8.5, pytest-4.6.11, py-1.9.0, pluggy-0.13.1
cachedir: target/.tox-py38-cython/py38-cython/.pytest_cache
rootdir: <https://ci-beam.apache.org/job/beam_PreCommit_Python_Cron/ws/src/sdks/python/test-suites/tox/py38/build/srcs/sdks/python,> inifile: pytest.ini
plugins: requests-mock-1.8.0, xdist-1.34.0, timeout-1.4.2, forked-1.3.0
timeout: 600.0s
timeout method: signal
timeout func_only: False
collected 3582 items / 3520 deselected / 3 skipped / 59 selected

apache_beam/coders/fast_coders_test.py ..............................    [ 48%]
apache_beam/coders/slow_coders_test.py ..............................    [ 96%]
apache_beam/io/gcp/tests/bigquery_matcher_test.py s                      [ 98%]
apache_beam/runners/portability/stager_test.py .                         [100%]

=============================== warnings summary ===============================
apache_beam/typehints/typehints.py:693
  <https://ci-beam.apache.org/job/beam_PreCommit_Python_Cron/ws/src/sdks/python/test-suites/tox/py38/build/srcs/sdks/python/apache_beam/typehints/typehints.py>:693: DeprecationWarning: Using or importing the ABCs from 'collections' instead of from 'collections.abc' is deprecated since Python 3.3, and in 3.9 it will stop working
    if not isinstance(type_params, collections.Iterable):

apache_beam/typehints/typehints.py:532
  <https://ci-beam.apache.org/job/beam_PreCommit_Python_Cron/ws/src/sdks/python/test-suites/tox/py38/build/srcs/sdks/python/apache_beam/typehints/typehints.py>:532: DeprecationWarning: Using or importing the ABCs from 'collections' instead of from 'collections.abc' is deprecated since Python 3.3, and in 3.9 it will stop working
    if not isinstance(type_params, (collections.Sequence, set)):

apache_beam/io/vcfio.py:49
  <https://ci-beam.apache.org/job/beam_PreCommit_Python_Cron/ws/src/sdks/python/test-suites/tox/py38/build/srcs/sdks/python/apache_beam/io/vcfio.py>:49: UserWarning: VCF IO will support Python 3 after migration to Nucleus, see: BEAM-5628.
    warnings.warn(

target/.tox-py38-cython/py38-cython/lib/python3.8/site-packages/tenacity/_asyncio.py:42
  <https://ci-beam.apache.org/job/beam_PreCommit_Python_Cron/ws/src/sdks/python/test-suites/tox/py38/build/srcs/sdks/python/target/.tox-py38-cython/py38-cython/lib/python3.8/site-packages/tenacity/_asyncio.py>:42: DeprecationWarning: "@coroutine" decorator is deprecated since Python 3.8, use "async def" instead
    def call(self, fn, *args, **kwargs):

-- Docs: https://docs.pytest.org/en/latest/warnings.html
- generated xml file: <https://ci-beam.apache.org/job/beam_PreCommit_Python_Cron/ws/src/sdks/python/test-suites/tox/py38/build/srcs/sdks/python/pytest_py38-cython_no_xdist.xml> -
====== 61 passed, 4 skipped, 3520 deselected, 4 warnings in 7.75 seconds =======
py38-cython run-test-post: commands[0] | bash <https://ci-beam.apache.org/job/beam_PreCommit_Python_Cron/ws/src/sdks/python/test-suites/tox/py38/build/srcs/sdks/python/scripts/run_tox_cleanup.sh>
___________________________________ summary ____________________________________
  py38-cython: commands succeeded
  congratulations :)

> Task :sdks:python:test-suites:tox:py38:preCommitPy38

> Task :sdks:python:test-suites:dataflow:py37:preCommitIT_streaming_V2
WARNING:apache_beam.runners.dataflow.dataflow_runner:Timing out on waiting for job 2020-08-23_11_29_58-11559784248041926712 after 364 seconds
DEBUG:google.auth._default:Checking None for explicit credentials as part of auth process...
DEBUG:google.auth._default:Checking Cloud SDK credentials as part of auth process...
DEBUG:google.auth._default:Cloud SDK credentials not found on disk; not using them
DEBUG:google.auth._default:Checking for App Engine runtime as part of auth process...
DEBUG:google.auth._default:No App Engine library was found so cannot authentication via App Engine Identity Credentials.
DEBUG:google.auth.transport._http_client:Making request: GET http://169.254.169.254
DEBUG:google.auth.transport._http_client:Making request: GET http://metadata.google.internal/computeMetadata/v1/project/project-id
DEBUG:google.auth.transport.requests:Making request: GET http://metadata.google.internal/computeMetadata/v1/instance/service-accounts/default/?recursive=true
DEBUG:urllib3.connectionpool:Starting new HTTP connection (1): metadata.google.internal:80
DEBUG:urllib3.connectionpool:http://metadata.google.internal:80 "GET /computeMetadata/v1/instance/service-accounts/default/?recursive=true HTTP/1.1" 200 144
DEBUG:google.auth.transport.requests:Making request: GET http://metadata.google.internal/computeMetadata/v1/instance/service-accounts/844138762903-compute@developer.gserviceaccount.com/token
DEBUG:urllib3.connectionpool:http://metadata.google.internal:80 "GET /computeMetadata/v1/instance/service-accounts/844138762903-compute@developer.gserviceaccount.com/token HTTP/1.1" 200 221
Worker logs: https://console.cloud.google.com/dataflow/jobs/us-central1/2020-08-23_11_29_58-11559784248041926712?project=apache-beam-testing
test_streaming_wordcount_it (apache_beam.examples.streaming_wordcount_it_test.StreamingWordCountIT) ... ok

----------------------------------------------------------------------
XML: nosetests-preCommitIT-df-py37.xml
----------------------------------------------------------------------
XML: <https://ci-beam.apache.org/job/beam_PreCommit_Python_Cron/ws/src/sdks/python/nosetests.xml>
----------------------------------------------------------------------
Ran 1 test in 506.312s

OK

> Task :sdks:python:test-suites:dataflow:preCommitIT_V2

FAILURE: Build failed with an exception.

* Where:
Script '<https://ci-beam.apache.org/job/beam_PreCommit_Python_Cron/ws/src/sdks/python/test-suites/dataflow/common.gradle'> line: 79

* What went wrong:
Execution failed for task ':sdks:python:test-suites:dataflow:py2:preCommitIT_streaming'.
> Process 'command 'sh'' finished with non-zero exit value 1

* Try:
Run with --stacktrace option to get the stack trace. Run with --info or --debug option to get more log output. Run with --scan to get full insights.

* Get more help at https://help.gradle.org

Deprecated Gradle features were used in this build, making it incompatible with Gradle 6.0.
Use '--warning-mode all' to show the individual deprecation warnings.
See https://docs.gradle.org/5.2.1/userguide/command_line_interface.html#sec:command_line_warnings

BUILD FAILED in 37m 46s
87 actionable tasks: 69 executed, 18 from cache

Publishing build scan...
https://gradle.com/s/ka73urum6ttfm

Build step 'Invoke Gradle script' changed build result to FAILURE
Build step 'Invoke Gradle script' marked build as failure

---------------------------------------------------------------------
To unsubscribe, e-mail: builds-unsubscribe@beam.apache.org
For additional commands, e-mail: builds-help@beam.apache.org


Build failed in Jenkins: beam_PreCommit_Python_Cron #3156

Posted by Apache Jenkins Server <je...@builds.apache.org>.
See <https://ci-beam.apache.org/job/beam_PreCommit_Python_Cron/3156/display/redirect>

Changes:


------------------------------------------
[...truncated 1.65 MB...]

apache_beam/io/fileio_test.py:153
  <https://ci-beam.apache.org/job/beam_PreCommit_Python_Cron/ws/src/sdks/python/test-suites/tox/py38/build/srcs/sdks/python/apache_beam/io/fileio_test.py>:153: FutureWarning: MatchAll is experimental.
    | fileio.MatchAll()

apache_beam/io/fileio_test.py:154
  <https://ci-beam.apache.org/job/beam_PreCommit_Python_Cron/ws/src/sdks/python/test-suites/tox/py38/build/srcs/sdks/python/apache_beam/io/fileio_test.py>:154: FutureWarning: ReadMatches is experimental.
    | fileio.ReadMatches()

apache_beam/io/fileio_test.py:389
  <https://ci-beam.apache.org/job/beam_PreCommit_Python_Cron/ws/src/sdks/python/test-suites/tox/py38/build/srcs/sdks/python/apache_beam/io/fileio_test.py>:389: FutureWarning: WriteToFiles is experimental.
    | beam.io.fileio.WriteToFiles(path=dir))

apache_beam/io/fileio_test.py:394
  <https://ci-beam.apache.org/job/beam_PreCommit_Python_Cron/ws/src/sdks/python/test-suites/tox/py38/build/srcs/sdks/python/apache_beam/io/fileio_test.py>:394: FutureWarning: MatchFiles is experimental.
    | fileio.MatchFiles(FileSystems.join(dir, '*'))

apache_beam/io/fileio_test.py:395
  <https://ci-beam.apache.org/job/beam_PreCommit_Python_Cron/ws/src/sdks/python/test-suites/tox/py38/build/srcs/sdks/python/apache_beam/io/fileio_test.py>:395: FutureWarning: ReadMatches is experimental.
    | fileio.ReadMatches()

apache_beam/io/fileio_test.py:271
  <https://ci-beam.apache.org/job/beam_PreCommit_Python_Cron/ws/src/sdks/python/test-suites/tox/py38/build/srcs/sdks/python/apache_beam/io/fileio_test.py>:271: FutureWarning: ReadMatches is experimental.
    | fileio.ReadMatches(skip_directories=False)

apache_beam/io/fileio_test.py:452
  <https://ci-beam.apache.org/job/beam_PreCommit_Python_Cron/ws/src/sdks/python/test-suites/tox/py38/build/srcs/sdks/python/apache_beam/io/fileio_test.py>:452: FutureWarning: WriteToFiles is experimental.
    write_transform = beam.io.fileio.WriteToFiles(path=dir)

apache_beam/io/fileio_test.py:252
  <https://ci-beam.apache.org/job/beam_PreCommit_Python_Cron/ws/src/sdks/python/test-suites/tox/py38/build/srcs/sdks/python/apache_beam/io/fileio_test.py>:252: FutureWarning: ReadMatches is experimental.
    | fileio.ReadMatches()

apache_beam/io/parquetio_test.py:414
  <https://ci-beam.apache.org/job/beam_PreCommit_Python_Cron/ws/src/sdks/python/test-suites/tox/py38/build/srcs/sdks/python/apache_beam/io/parquetio_test.py>:414: FutureWarning: The parameter chunksize is deprecated for pyarrow.Table.to_batches as of 0.15, please use the parameter max_chunksize instead
    for batch in orig.to_batches(chunksize=20)

apache_beam/io/fileio_test.py:584
  <https://ci-beam.apache.org/job/beam_PreCommit_Python_Cron/ws/src/sdks/python/test-suites/tox/py38/build/srcs/sdks/python/apache_beam/io/fileio_test.py>:584: FutureWarning: WriteToFiles is experimental.
    | beam.io.fileio.WriteToFiles(

apache_beam/io/fileio_test.py:593
  <https://ci-beam.apache.org/job/beam_PreCommit_Python_Cron/ws/src/sdks/python/test-suites/tox/py38/build/srcs/sdks/python/apache_beam/io/fileio_test.py>:593: FutureWarning: MatchFiles is experimental.
    files = (p | beam.io.fileio.MatchFiles(FileSystems.join(dir, '*')))

apache_beam/io/fileio_test.py:599
  <https://ci-beam.apache.org/job/beam_PreCommit_Python_Cron/ws/src/sdks/python/test-suites/tox/py38/build/srcs/sdks/python/apache_beam/io/fileio_test.py>:599: FutureWarning: ReadMatches is experimental.
    | beam.io.fileio.ReadMatches()

apache_beam/io/fileio_test.py:409
  <https://ci-beam.apache.org/job/beam_PreCommit_Python_Cron/ws/src/sdks/python/test-suites/tox/py38/build/srcs/sdks/python/apache_beam/io/fileio_test.py>:409: FutureWarning: WriteToFiles is experimental.
    | beam.io.fileio.WriteToFiles(

apache_beam/io/fileio_test.py:421
  <https://ci-beam.apache.org/job/beam_PreCommit_Python_Cron/ws/src/sdks/python/test-suites/tox/py38/build/srcs/sdks/python/apache_beam/io/fileio_test.py>:421: FutureWarning: MatchFiles is experimental.
    | fileio.MatchFiles(FileSystems.join(dir, 'cncf*'))

apache_beam/io/fileio_test.py:422
  <https://ci-beam.apache.org/job/beam_PreCommit_Python_Cron/ws/src/sdks/python/test-suites/tox/py38/build/srcs/sdks/python/apache_beam/io/fileio_test.py>:422: FutureWarning: ReadMatches is experimental.
    | fileio.ReadMatches()

apache_beam/io/fileio_test.py:429
  <https://ci-beam.apache.org/job/beam_PreCommit_Python_Cron/ws/src/sdks/python/test-suites/tox/py38/build/srcs/sdks/python/apache_beam/io/fileio_test.py>:429: FutureWarning: MatchFiles is experimental.
    "MatchApache" >> fileio.MatchFiles(FileSystems.join(dir, 'apache*'))

apache_beam/io/fileio_test.py:430
  <https://ci-beam.apache.org/job/beam_PreCommit_Python_Cron/ws/src/sdks/python/test-suites/tox/py38/build/srcs/sdks/python/apache_beam/io/fileio_test.py>:430: FutureWarning: ReadMatches is experimental.
    | "ReadApache" >> fileio.ReadMatches()

apache_beam/io/mongodbio_test.py:264
  <https://ci-beam.apache.org/job/beam_PreCommit_Python_Cron/ws/src/sdks/python/test-suites/tox/py38/build/srcs/sdks/python/apache_beam/io/mongodbio_test.py>:264: FutureWarning: ReadFromMongoDB is experimental.
    docs = p | 'ReadFromMongoDB' >> ReadFromMongoDB(

apache_beam/io/mongodbio_test.py:339
  <https://ci-beam.apache.org/job/beam_PreCommit_Python_Cron/ws/src/sdks/python/test-suites/tox/py38/build/srcs/sdks/python/apache_beam/io/mongodbio_test.py>:339: FutureWarning: WriteToMongoDB is experimental.
    | "Write" >> WriteToMongoDB(db='test', coll='test'))

apache_beam/io/fileio_test.py:137
  <https://ci-beam.apache.org/job/beam_PreCommit_Python_Cron/ws/src/sdks/python/test-suites/tox/py38/build/srcs/sdks/python/apache_beam/io/fileio_test.py>:137: FutureWarning: MatchAll is experimental.
    | fileio.MatchAll(fileio.EmptyMatchTreatment.ALLOW_IF_WILDCARD)

apache_beam/io/fileio_test.py:231
  <https://ci-beam.apache.org/job/beam_PreCommit_Python_Cron/ws/src/sdks/python/test-suites/tox/py38/build/srcs/sdks/python/apache_beam/io/fileio_test.py>:231: FutureWarning: MatchAll is experimental.
    | fileio.MatchAll()

apache_beam/io/fileio_test.py:232
  <https://ci-beam.apache.org/job/beam_PreCommit_Python_Cron/ws/src/sdks/python/test-suites/tox/py38/build/srcs/sdks/python/apache_beam/io/fileio_test.py>:232: FutureWarning: ReadMatches is experimental.
    | fileio.ReadMatches()

apache_beam/io/fileio_test.py:494
  <https://ci-beam.apache.org/job/beam_PreCommit_Python_Cron/ws/src/sdks/python/test-suites/tox/py38/build/srcs/sdks/python/apache_beam/io/fileio_test.py>:494: FutureWarning: WriteToFiles is experimental.
    | beam.io.fileio.WriteToFiles(

apache_beam/io/fileio_test.py:505
  <https://ci-beam.apache.org/job/beam_PreCommit_Python_Cron/ws/src/sdks/python/test-suites/tox/py38/build/srcs/sdks/python/apache_beam/io/fileio_test.py>:505: FutureWarning: MatchFiles is experimental.
    | fileio.MatchFiles(FileSystems.join(dir, 'cncf*'))

apache_beam/io/fileio_test.py:506
  <https://ci-beam.apache.org/job/beam_PreCommit_Python_Cron/ws/src/sdks/python/test-suites/tox/py38/build/srcs/sdks/python/apache_beam/io/fileio_test.py>:506: FutureWarning: ReadMatches is experimental.
    | fileio.ReadMatches()

apache_beam/io/fileio_test.py:513
  <https://ci-beam.apache.org/job/beam_PreCommit_Python_Cron/ws/src/sdks/python/test-suites/tox/py38/build/srcs/sdks/python/apache_beam/io/fileio_test.py>:513: FutureWarning: MatchFiles is experimental.
    "MatchApache" >> fileio.MatchFiles(FileSystems.join(dir, 'apache*'))

apache_beam/io/fileio_test.py:514
  <https://ci-beam.apache.org/job/beam_PreCommit_Python_Cron/ws/src/sdks/python/test-suites/tox/py38/build/srcs/sdks/python/apache_beam/io/fileio_test.py>:514: FutureWarning: ReadMatches is experimental.
    | "ReadApache" >> fileio.ReadMatches()

apache_beam/io/mongodbio_test.py:323
  <https://ci-beam.apache.org/job/beam_PreCommit_Python_Cron/ws/src/sdks/python/test-suites/tox/py38/build/srcs/sdks/python/apache_beam/io/mongodbio_test.py>:323: FutureWarning: WriteToMongoDB is experimental.
    | "Write" >> WriteToMongoDB(db='test', coll='test'))

apache_beam/runners/interactive/interactive_beam.py:388
apache_beam/runners/interactive/interactive_beam.py:388
  <https://ci-beam.apache.org/job/beam_PreCommit_Python_Cron/ws/src/sdks/python/test-suites/tox/py38/build/srcs/sdks/python/apache_beam/runners/interactive/interactive_beam.py>:388: BeamDeprecationWarning: options is deprecated since First stable release. References to <pipeline>.options will not be supported
    runner, user_pipeline, user_pipeline.options)

apache_beam/runners/interactive/interactive_beam.py:411
apache_beam/runners/interactive/interactive_beam.py:411
  <https://ci-beam.apache.org/job/beam_PreCommit_Python_Cron/ws/src/sdks/python/test-suites/tox/py38/build/srcs/sdks/python/apache_beam/runners/interactive/interactive_beam.py>:411: BeamDeprecationWarning: options is deprecated since First stable release. References to <pipeline>.options will not be supported
    result = pf.PipelineFragment(list(pcolls), user_pipeline.options).run()

apache_beam/io/parquetio_test.py:365
  <https://ci-beam.apache.org/job/beam_PreCommit_Python_Cron/ws/src/sdks/python/test-suites/tox/py38/build/srcs/sdks/python/apache_beam/io/parquetio_test.py>:365: FutureWarning: The parameter chunksize is deprecated for pyarrow.Table.to_batches as of 0.15, please use the parameter max_chunksize instead
    pa.Table.from_batches([batch]) for batch in self._records_as_arrow(

/usr/lib/python3.8/unittest/case.py:1215
/usr/lib/python3.8/unittest/case.py:1215
/usr/lib/python3.8/unittest/case.py:1215
/usr/lib/python3.8/unittest/case.py:1215
/usr/lib/python3.8/unittest/case.py:1215
/usr/lib/python3.8/unittest/case.py:1215
/usr/lib/python3.8/unittest/case.py:1215
/usr/lib/python3.8/unittest/case.py:1215
/usr/lib/python3.8/unittest/case.py:1215
/usr/lib/python3.8/unittest/case.py:1215
/usr/lib/python3.8/unittest/case.py:1215
/usr/lib/python3.8/unittest/case.py:1215
/usr/lib/python3.8/unittest/case.py:1215
/usr/lib/python3.8/unittest/case.py:1215
/usr/lib/python3.8/unittest/case.py:1215
/usr/lib/python3.8/unittest/case.py:1215
/usr/lib/python3.8/unittest/case.py:1215
/usr/lib/python3.8/unittest/case.py:1215
/usr/lib/python3.8/unittest/case.py:1215
/usr/lib/python3.8/unittest/case.py:1215
/usr/lib/python3.8/unittest/case.py:1215
/usr/lib/python3.8/unittest/case.py:1215
/usr/lib/python3.8/unittest/case.py:1215
/usr/lib/python3.8/unittest/case.py:1215
/usr/lib/python3.8/unittest/case.py:1215
  /usr/lib/python3.8/unittest/case.py:1215: DeprecationWarning: assertDictContainsSubset is deprecated
    warnings.warn('assertDictContainsSubset is deprecated',

target/.tox-py38-cython/py38-cython/lib/python3.8/site-packages/hamcrest/library/collection/issequence_containinginorder.py:95
  <https://ci-beam.apache.org/job/beam_PreCommit_Python_Cron/ws/src/sdks/python/test-suites/tox/py38/build/srcs/sdks/python/target/.tox-py38-cython/py38-cython/lib/python3.8/site-packages/hamcrest/library/collection/issequence_containinginorder.py>:95: DeprecationWarning: deprecated - use contains_exactly(*items)
    warnings.warn("deprecated - use contains_exactly(*items)", DeprecationWarning)

apache_beam/transforms/util_test.py:651
  <https://ci-beam.apache.org/job/beam_PreCommit_Python_Cron/ws/src/sdks/python/test-suites/tox/py38/build/srcs/sdks/python/apache_beam/transforms/util_test.py>:651: FutureWarning: GroupIntoBatches is experimental.
    | util.GroupIntoBatches(GroupIntoBatchesTest.BATCH_SIZE)

-- Docs: https://docs.pytest.org/en/latest/warnings.html
- generated xml file: <https://ci-beam.apache.org/job/beam_PreCommit_Python_Cron/ws/src/sdks/python/test-suites/tox/py38/build/srcs/sdks/python/pytest_py38-cython.xml> -
=========== 2839 passed, 682 skipped, 334 warnings in 197.58 seconds ===========
============================= test session starts ==============================
platform linux -- Python 3.8.5, pytest-4.6.11, py-1.9.0, pluggy-0.13.1
cachedir: target/.tox-py38-cython/py38-cython/.pytest_cache
rootdir: <https://ci-beam.apache.org/job/beam_PreCommit_Python_Cron/ws/src/sdks/python/test-suites/tox/py38/build/srcs/sdks/python,> inifile: pytest.ini
plugins: requests-mock-1.8.0, xdist-1.34.0, timeout-1.4.2, forked-1.3.0
timeout: 600.0s
timeout method: signal
timeout func_only: False
collected 3582 items / 3520 deselected / 3 skipped / 59 selected

apache_beam/coders/fast_coders_test.py ..............................    [ 48%]
apache_beam/coders/slow_coders_test.py ..............................    [ 96%]
apache_beam/io/gcp/tests/bigquery_matcher_test.py s                      [ 98%]
apache_beam/runners/portability/stager_test.py .                         [100%]

=============================== warnings summary ===============================
apache_beam/typehints/typehints.py:693
  <https://ci-beam.apache.org/job/beam_PreCommit_Python_Cron/ws/src/sdks/python/test-suites/tox/py38/build/srcs/sdks/python/apache_beam/typehints/typehints.py>:693: DeprecationWarning: Using or importing the ABCs from 'collections' instead of from 'collections.abc' is deprecated since Python 3.3, and in 3.9 it will stop working
    if not isinstance(type_params, collections.Iterable):

apache_beam/typehints/typehints.py:532
  <https://ci-beam.apache.org/job/beam_PreCommit_Python_Cron/ws/src/sdks/python/test-suites/tox/py38/build/srcs/sdks/python/apache_beam/typehints/typehints.py>:532: DeprecationWarning: Using or importing the ABCs from 'collections' instead of from 'collections.abc' is deprecated since Python 3.3, and in 3.9 it will stop working
    if not isinstance(type_params, (collections.Sequence, set)):

apache_beam/io/vcfio.py:49
  <https://ci-beam.apache.org/job/beam_PreCommit_Python_Cron/ws/src/sdks/python/test-suites/tox/py38/build/srcs/sdks/python/apache_beam/io/vcfio.py>:49: UserWarning: VCF IO will support Python 3 after migration to Nucleus, see: BEAM-5628.
    warnings.warn(

target/.tox-py38-cython/py38-cython/lib/python3.8/site-packages/tenacity/_asyncio.py:42
  <https://ci-beam.apache.org/job/beam_PreCommit_Python_Cron/ws/src/sdks/python/test-suites/tox/py38/build/srcs/sdks/python/target/.tox-py38-cython/py38-cython/lib/python3.8/site-packages/tenacity/_asyncio.py>:42: DeprecationWarning: "@coroutine" decorator is deprecated since Python 3.8, use "async def" instead
    def call(self, fn, *args, **kwargs):

-- Docs: https://docs.pytest.org/en/latest/warnings.html
- generated xml file: <https://ci-beam.apache.org/job/beam_PreCommit_Python_Cron/ws/src/sdks/python/test-suites/tox/py38/build/srcs/sdks/python/pytest_py38-cython_no_xdist.xml> -
====== 61 passed, 4 skipped, 3520 deselected, 4 warnings in 7.88 seconds =======
py38-cython run-test-post: commands[0] | bash <https://ci-beam.apache.org/job/beam_PreCommit_Python_Cron/ws/src/sdks/python/test-suites/tox/py38/build/srcs/sdks/python/scripts/run_tox_cleanup.sh>
___________________________________ summary ____________________________________
  py38-cython: commands succeeded
  congratulations :)

> Task :sdks:python:test-suites:tox:py38:preCommitPy38

> Task :sdks:python:test-suites:dataflow:py2:preCommitIT_streaming_V2
test_streaming_wordcount_it (apache_beam.examples.streaming_wordcount_it_test.StreamingWordCountIT) ... ok

----------------------------------------------------------------------
XML: nosetests-preCommitIT-df-py27.xml
----------------------------------------------------------------------
XML: <https://ci-beam.apache.org/job/beam_PreCommit_Python_Cron/ws/src/sdks/python/nosetests.xml>
----------------------------------------------------------------------
Ran 1 test in 498.219s

OK
Worker logs: https://console.cloud.google.com/dataflow/jobs/us-central1/2020-08-23_05_28_25-3233595316047239090?project=apache-beam-testing

> Task :sdks:python:test-suites:dataflow:preCommitIT_V2

FAILURE: Build failed with an exception.

* Where:
Script '<https://ci-beam.apache.org/job/beam_PreCommit_Python_Cron/ws/src/sdks/python/test-suites/dataflow/common.gradle'> line: 79

* What went wrong:
Execution failed for task ':sdks:python:test-suites:dataflow:py37:preCommitIT_batch'.
> Process 'command 'sh'' finished with non-zero exit value 1

* Try:
Run with --stacktrace option to get the stack trace. Run with --info or --debug option to get more log output. Run with --scan to get full insights.

* Get more help at https://help.gradle.org

Deprecated Gradle features were used in this build, making it incompatible with Gradle 6.0.
Use '--warning-mode all' to show the individual deprecation warnings.
See https://docs.gradle.org/5.2.1/userguide/command_line_interface.html#sec:command_line_warnings

BUILD FAILED in 35m 18s
87 actionable tasks: 69 executed, 18 from cache

Publishing build scan...
https://gradle.com/s/uytlofcsp5bck

Build step 'Invoke Gradle script' changed build result to FAILURE
Build step 'Invoke Gradle script' marked build as failure

---------------------------------------------------------------------
To unsubscribe, e-mail: builds-unsubscribe@beam.apache.org
For additional commands, e-mail: builds-help@beam.apache.org


Build failed in Jenkins: beam_PreCommit_Python_Cron #3155

Posted by Apache Jenkins Server <je...@builds.apache.org>.
See <https://ci-beam.apache.org/job/beam_PreCommit_Python_Cron/3155/display/redirect>

Changes:


------------------------------------------
[...truncated 1.59 MB...]
apache_beam/io/parquetio_test.py:375
  <https://ci-beam.apache.org/job/beam_PreCommit_Python_Cron/ws/src/sdks/python/test-suites/tox/py38/build/srcs/sdks/python/apache_beam/io/parquetio_test.py>:375: FutureWarning: The parameter chunksize is deprecated for pyarrow.Table.to_batches as of 0.15, please use the parameter max_chunksize instead
    pa.Table.from_batches([batch]) for batch in self._records_as_arrow(

apache_beam/io/fileio_test.py:170
  <https://ci-beam.apache.org/job/beam_PreCommit_Python_Cron/ws/src/sdks/python/test-suites/tox/py38/build/srcs/sdks/python/apache_beam/io/fileio_test.py>:170: FutureWarning: MatchAll is experimental.
    | fileio.MatchAll()

apache_beam/io/fileio_test.py:171
  <https://ci-beam.apache.org/job/beam_PreCommit_Python_Cron/ws/src/sdks/python/test-suites/tox/py38/build/srcs/sdks/python/apache_beam/io/fileio_test.py>:171: FutureWarning: ReadMatches is experimental.
    | fileio.ReadMatches()

apache_beam/io/fileio_test.py:153
  <https://ci-beam.apache.org/job/beam_PreCommit_Python_Cron/ws/src/sdks/python/test-suites/tox/py38/build/srcs/sdks/python/apache_beam/io/fileio_test.py>:153: FutureWarning: MatchAll is experimental.
    | fileio.MatchAll()

apache_beam/io/fileio_test.py:154
  <https://ci-beam.apache.org/job/beam_PreCommit_Python_Cron/ws/src/sdks/python/test-suites/tox/py38/build/srcs/sdks/python/apache_beam/io/fileio_test.py>:154: FutureWarning: ReadMatches is experimental.
    | fileio.ReadMatches()

apache_beam/io/fileio_test.py:252
  <https://ci-beam.apache.org/job/beam_PreCommit_Python_Cron/ws/src/sdks/python/test-suites/tox/py38/build/srcs/sdks/python/apache_beam/io/fileio_test.py>:252: FutureWarning: ReadMatches is experimental.
    | fileio.ReadMatches()

apache_beam/io/fileio_test.py:77
  <https://ci-beam.apache.org/job/beam_PreCommit_Python_Cron/ws/src/sdks/python/test-suites/tox/py38/build/srcs/sdks/python/apache_beam/io/fileio_test.py>:77: FutureWarning: MatchFiles is experimental.
    | fileio.MatchFiles(FileSystems.join(tempdir, '*'))

apache_beam/io/fileio_test.py:137
  <https://ci-beam.apache.org/job/beam_PreCommit_Python_Cron/ws/src/sdks/python/test-suites/tox/py38/build/srcs/sdks/python/apache_beam/io/fileio_test.py>:137: FutureWarning: MatchAll is experimental.
    | fileio.MatchAll(fileio.EmptyMatchTreatment.ALLOW_IF_WILDCARD)

apache_beam/io/fileio_test.py:389
  <https://ci-beam.apache.org/job/beam_PreCommit_Python_Cron/ws/src/sdks/python/test-suites/tox/py38/build/srcs/sdks/python/apache_beam/io/fileio_test.py>:389: FutureWarning: WriteToFiles is experimental.
    | beam.io.fileio.WriteToFiles(path=dir))

apache_beam/io/fileio_test.py:394
  <https://ci-beam.apache.org/job/beam_PreCommit_Python_Cron/ws/src/sdks/python/test-suites/tox/py38/build/srcs/sdks/python/apache_beam/io/fileio_test.py>:394: FutureWarning: MatchFiles is experimental.
    | fileio.MatchFiles(FileSystems.join(dir, '*'))

apache_beam/io/fileio_test.py:395
  <https://ci-beam.apache.org/job/beam_PreCommit_Python_Cron/ws/src/sdks/python/test-suites/tox/py38/build/srcs/sdks/python/apache_beam/io/fileio_test.py>:395: FutureWarning: ReadMatches is experimental.
    | fileio.ReadMatches()

apache_beam/io/fileio_test.py:271
  <https://ci-beam.apache.org/job/beam_PreCommit_Python_Cron/ws/src/sdks/python/test-suites/tox/py38/build/srcs/sdks/python/apache_beam/io/fileio_test.py>:271: FutureWarning: ReadMatches is experimental.
    | fileio.ReadMatches(skip_directories=False)

apache_beam/io/fileio_test.py:231
  <https://ci-beam.apache.org/job/beam_PreCommit_Python_Cron/ws/src/sdks/python/test-suites/tox/py38/build/srcs/sdks/python/apache_beam/io/fileio_test.py>:231: FutureWarning: MatchAll is experimental.
    | fileio.MatchAll()

apache_beam/io/fileio_test.py:232
  <https://ci-beam.apache.org/job/beam_PreCommit_Python_Cron/ws/src/sdks/python/test-suites/tox/py38/build/srcs/sdks/python/apache_beam/io/fileio_test.py>:232: FutureWarning: ReadMatches is experimental.
    | fileio.ReadMatches()

apache_beam/io/fileio_test.py:452
  <https://ci-beam.apache.org/job/beam_PreCommit_Python_Cron/ws/src/sdks/python/test-suites/tox/py38/build/srcs/sdks/python/apache_beam/io/fileio_test.py>:452: FutureWarning: WriteToFiles is experimental.
    write_transform = beam.io.fileio.WriteToFiles(path=dir)

apache_beam/io/parquetio_test.py:414
  <https://ci-beam.apache.org/job/beam_PreCommit_Python_Cron/ws/src/sdks/python/test-suites/tox/py38/build/srcs/sdks/python/apache_beam/io/parquetio_test.py>:414: FutureWarning: The parameter chunksize is deprecated for pyarrow.Table.to_batches as of 0.15, please use the parameter max_chunksize instead
    for batch in orig.to_batches(chunksize=20)

apache_beam/io/fileio_test.py:409
  <https://ci-beam.apache.org/job/beam_PreCommit_Python_Cron/ws/src/sdks/python/test-suites/tox/py38/build/srcs/sdks/python/apache_beam/io/fileio_test.py>:409: FutureWarning: WriteToFiles is experimental.
    | beam.io.fileio.WriteToFiles(

apache_beam/io/fileio_test.py:421
  <https://ci-beam.apache.org/job/beam_PreCommit_Python_Cron/ws/src/sdks/python/test-suites/tox/py38/build/srcs/sdks/python/apache_beam/io/fileio_test.py>:421: FutureWarning: MatchFiles is experimental.
    | fileio.MatchFiles(FileSystems.join(dir, 'cncf*'))

apache_beam/io/fileio_test.py:422
  <https://ci-beam.apache.org/job/beam_PreCommit_Python_Cron/ws/src/sdks/python/test-suites/tox/py38/build/srcs/sdks/python/apache_beam/io/fileio_test.py>:422: FutureWarning: ReadMatches is experimental.
    | fileio.ReadMatches()

apache_beam/io/fileio_test.py:429
  <https://ci-beam.apache.org/job/beam_PreCommit_Python_Cron/ws/src/sdks/python/test-suites/tox/py38/build/srcs/sdks/python/apache_beam/io/fileio_test.py>:429: FutureWarning: MatchFiles is experimental.
    "MatchApache" >> fileio.MatchFiles(FileSystems.join(dir, 'apache*'))

apache_beam/io/fileio_test.py:430
  <https://ci-beam.apache.org/job/beam_PreCommit_Python_Cron/ws/src/sdks/python/test-suites/tox/py38/build/srcs/sdks/python/apache_beam/io/fileio_test.py>:430: FutureWarning: ReadMatches is experimental.
    | "ReadApache" >> fileio.ReadMatches()

apache_beam/io/fileio_test.py:584
  <https://ci-beam.apache.org/job/beam_PreCommit_Python_Cron/ws/src/sdks/python/test-suites/tox/py38/build/srcs/sdks/python/apache_beam/io/fileio_test.py>:584: FutureWarning: WriteToFiles is experimental.
    | beam.io.fileio.WriteToFiles(

apache_beam/io/fileio_test.py:593
  <https://ci-beam.apache.org/job/beam_PreCommit_Python_Cron/ws/src/sdks/python/test-suites/tox/py38/build/srcs/sdks/python/apache_beam/io/fileio_test.py>:593: FutureWarning: MatchFiles is experimental.
    files = (p | beam.io.fileio.MatchFiles(FileSystems.join(dir, '*')))

apache_beam/io/fileio_test.py:599
  <https://ci-beam.apache.org/job/beam_PreCommit_Python_Cron/ws/src/sdks/python/test-suites/tox/py38/build/srcs/sdks/python/apache_beam/io/fileio_test.py>:599: FutureWarning: ReadMatches is experimental.
    | beam.io.fileio.ReadMatches()

apache_beam/io/fileio_test.py:494
  <https://ci-beam.apache.org/job/beam_PreCommit_Python_Cron/ws/src/sdks/python/test-suites/tox/py38/build/srcs/sdks/python/apache_beam/io/fileio_test.py>:494: FutureWarning: WriteToFiles is experimental.
    | beam.io.fileio.WriteToFiles(

apache_beam/io/fileio_test.py:505
  <https://ci-beam.apache.org/job/beam_PreCommit_Python_Cron/ws/src/sdks/python/test-suites/tox/py38/build/srcs/sdks/python/apache_beam/io/fileio_test.py>:505: FutureWarning: MatchFiles is experimental.
    | fileio.MatchFiles(FileSystems.join(dir, 'cncf*'))

apache_beam/io/fileio_test.py:506
  <https://ci-beam.apache.org/job/beam_PreCommit_Python_Cron/ws/src/sdks/python/test-suites/tox/py38/build/srcs/sdks/python/apache_beam/io/fileio_test.py>:506: FutureWarning: ReadMatches is experimental.
    | fileio.ReadMatches()

apache_beam/io/fileio_test.py:513
  <https://ci-beam.apache.org/job/beam_PreCommit_Python_Cron/ws/src/sdks/python/test-suites/tox/py38/build/srcs/sdks/python/apache_beam/io/fileio_test.py>:513: FutureWarning: MatchFiles is experimental.
    "MatchApache" >> fileio.MatchFiles(FileSystems.join(dir, 'apache*'))

apache_beam/io/fileio_test.py:514
  <https://ci-beam.apache.org/job/beam_PreCommit_Python_Cron/ws/src/sdks/python/test-suites/tox/py38/build/srcs/sdks/python/apache_beam/io/fileio_test.py>:514: FutureWarning: ReadMatches is experimental.
    | "ReadApache" >> fileio.ReadMatches()

apache_beam/io/mongodbio_test.py:323
  <https://ci-beam.apache.org/job/beam_PreCommit_Python_Cron/ws/src/sdks/python/test-suites/tox/py38/build/srcs/sdks/python/apache_beam/io/mongodbio_test.py>:323: FutureWarning: WriteToMongoDB is experimental.
    | "Write" >> WriteToMongoDB(db='test', coll='test'))

apache_beam/io/mongodbio_test.py:264
  <https://ci-beam.apache.org/job/beam_PreCommit_Python_Cron/ws/src/sdks/python/test-suites/tox/py38/build/srcs/sdks/python/apache_beam/io/mongodbio_test.py>:264: FutureWarning: ReadFromMongoDB is experimental.
    docs = p | 'ReadFromMongoDB' >> ReadFromMongoDB(

apache_beam/io/mongodbio_test.py:339
  <https://ci-beam.apache.org/job/beam_PreCommit_Python_Cron/ws/src/sdks/python/test-suites/tox/py38/build/srcs/sdks/python/apache_beam/io/mongodbio_test.py>:339: FutureWarning: WriteToMongoDB is experimental.
    | "Write" >> WriteToMongoDB(db='test', coll='test'))

/usr/lib/python3.8/unittest/case.py:1215
/usr/lib/python3.8/unittest/case.py:1215
/usr/lib/python3.8/unittest/case.py:1215
/usr/lib/python3.8/unittest/case.py:1215
/usr/lib/python3.8/unittest/case.py:1215
/usr/lib/python3.8/unittest/case.py:1215
/usr/lib/python3.8/unittest/case.py:1215
/usr/lib/python3.8/unittest/case.py:1215
/usr/lib/python3.8/unittest/case.py:1215
/usr/lib/python3.8/unittest/case.py:1215
/usr/lib/python3.8/unittest/case.py:1215
/usr/lib/python3.8/unittest/case.py:1215
/usr/lib/python3.8/unittest/case.py:1215
/usr/lib/python3.8/unittest/case.py:1215
/usr/lib/python3.8/unittest/case.py:1215
/usr/lib/python3.8/unittest/case.py:1215
/usr/lib/python3.8/unittest/case.py:1215
/usr/lib/python3.8/unittest/case.py:1215
/usr/lib/python3.8/unittest/case.py:1215
/usr/lib/python3.8/unittest/case.py:1215
/usr/lib/python3.8/unittest/case.py:1215
/usr/lib/python3.8/unittest/case.py:1215
/usr/lib/python3.8/unittest/case.py:1215
/usr/lib/python3.8/unittest/case.py:1215
/usr/lib/python3.8/unittest/case.py:1215
  /usr/lib/python3.8/unittest/case.py:1215: DeprecationWarning: assertDictContainsSubset is deprecated
    warnings.warn('assertDictContainsSubset is deprecated',

apache_beam/io/parquetio_test.py:365
  <https://ci-beam.apache.org/job/beam_PreCommit_Python_Cron/ws/src/sdks/python/test-suites/tox/py38/build/srcs/sdks/python/apache_beam/io/parquetio_test.py>:365: FutureWarning: The parameter chunksize is deprecated for pyarrow.Table.to_batches as of 0.15, please use the parameter max_chunksize instead
    pa.Table.from_batches([batch]) for batch in self._records_as_arrow(

apache_beam/runners/interactive/interactive_beam.py:388
apache_beam/runners/interactive/interactive_beam.py:388
  <https://ci-beam.apache.org/job/beam_PreCommit_Python_Cron/ws/src/sdks/python/test-suites/tox/py38/build/srcs/sdks/python/apache_beam/runners/interactive/interactive_beam.py>:388: BeamDeprecationWarning: options is deprecated since First stable release. References to <pipeline>.options will not be supported
    runner, user_pipeline, user_pipeline.options)

apache_beam/runners/interactive/interactive_beam.py:411
apache_beam/runners/interactive/interactive_beam.py:411
  <https://ci-beam.apache.org/job/beam_PreCommit_Python_Cron/ws/src/sdks/python/test-suites/tox/py38/build/srcs/sdks/python/apache_beam/runners/interactive/interactive_beam.py>:411: BeamDeprecationWarning: options is deprecated since First stable release. References to <pipeline>.options will not be supported
    result = pf.PipelineFragment(list(pcolls), user_pipeline.options).run()

target/.tox-py38-cython/py38-cython/lib/python3.8/site-packages/hamcrest/library/collection/issequence_containinginorder.py:95
  <https://ci-beam.apache.org/job/beam_PreCommit_Python_Cron/ws/src/sdks/python/test-suites/tox/py38/build/srcs/sdks/python/target/.tox-py38-cython/py38-cython/lib/python3.8/site-packages/hamcrest/library/collection/issequence_containinginorder.py>:95: DeprecationWarning: deprecated - use contains_exactly(*items)
    warnings.warn("deprecated - use contains_exactly(*items)", DeprecationWarning)

apache_beam/transforms/util_test.py:651
  <https://ci-beam.apache.org/job/beam_PreCommit_Python_Cron/ws/src/sdks/python/test-suites/tox/py38/build/srcs/sdks/python/apache_beam/transforms/util_test.py>:651: FutureWarning: GroupIntoBatches is experimental.
    | util.GroupIntoBatches(GroupIntoBatchesTest.BATCH_SIZE)

-- Docs: https://docs.pytest.org/en/latest/warnings.html
- generated xml file: <https://ci-beam.apache.org/job/beam_PreCommit_Python_Cron/ws/src/sdks/python/test-suites/tox/py38/build/srcs/sdks/python/pytest_py38-cython.xml> -
=========== 2839 passed, 682 skipped, 326 warnings in 210.07 seconds ===========
============================= test session starts ==============================
platform linux -- Python 3.8.5, pytest-4.6.11, py-1.9.0, pluggy-0.13.1
cachedir: target/.tox-py38-cython/py38-cython/.pytest_cache
rootdir: <https://ci-beam.apache.org/job/beam_PreCommit_Python_Cron/ws/src/sdks/python/test-suites/tox/py38/build/srcs/sdks/python,> inifile: pytest.ini
plugins: requests-mock-1.8.0, xdist-1.34.0, timeout-1.4.2, forked-1.3.0
timeout: 600.0s
timeout method: signal
timeout func_only: False
collected 3582 items / 3520 deselected / 3 skipped / 59 selected

apache_beam/coders/fast_coders_test.py ..............................    [ 48%]
apache_beam/coders/slow_coders_test.py ..............................    [ 96%]
apache_beam/io/gcp/tests/bigquery_matcher_test.py s                      [ 98%]
apache_beam/runners/portability/stager_test.py .                         [100%]

=============================== warnings summary ===============================
apache_beam/typehints/typehints.py:693
  <https://ci-beam.apache.org/job/beam_PreCommit_Python_Cron/ws/src/sdks/python/test-suites/tox/py38/build/srcs/sdks/python/apache_beam/typehints/typehints.py>:693: DeprecationWarning: Using or importing the ABCs from 'collections' instead of from 'collections.abc' is deprecated since Python 3.3, and in 3.9 it will stop working
    if not isinstance(type_params, collections.Iterable):

apache_beam/typehints/typehints.py:532
  <https://ci-beam.apache.org/job/beam_PreCommit_Python_Cron/ws/src/sdks/python/test-suites/tox/py38/build/srcs/sdks/python/apache_beam/typehints/typehints.py>:532: DeprecationWarning: Using or importing the ABCs from 'collections' instead of from 'collections.abc' is deprecated since Python 3.3, and in 3.9 it will stop working
    if not isinstance(type_params, (collections.Sequence, set)):

apache_beam/io/vcfio.py:49
  <https://ci-beam.apache.org/job/beam_PreCommit_Python_Cron/ws/src/sdks/python/test-suites/tox/py38/build/srcs/sdks/python/apache_beam/io/vcfio.py>:49: UserWarning: VCF IO will support Python 3 after migration to Nucleus, see: BEAM-5628.
    warnings.warn(

target/.tox-py38-cython/py38-cython/lib/python3.8/site-packages/tenacity/_asyncio.py:42
  <https://ci-beam.apache.org/job/beam_PreCommit_Python_Cron/ws/src/sdks/python/test-suites/tox/py38/build/srcs/sdks/python/target/.tox-py38-cython/py38-cython/lib/python3.8/site-packages/tenacity/_asyncio.py>:42: DeprecationWarning: "@coroutine" decorator is deprecated since Python 3.8, use "async def" instead
    def call(self, fn, *args, **kwargs):

-- Docs: https://docs.pytest.org/en/latest/warnings.html
- generated xml file: <https://ci-beam.apache.org/job/beam_PreCommit_Python_Cron/ws/src/sdks/python/test-suites/tox/py38/build/srcs/sdks/python/pytest_py38-cython_no_xdist.xml> -
====== 61 passed, 4 skipped, 3520 deselected, 4 warnings in 7.94 seconds =======
py38-cython run-test-post: commands[0] | bash <https://ci-beam.apache.org/job/beam_PreCommit_Python_Cron/ws/src/sdks/python/test-suites/tox/py38/build/srcs/sdks/python/scripts/run_tox_cleanup.sh>
___________________________________ summary ____________________________________
  py38-cython: commands succeeded
  congratulations :)

> Task :sdks:python:test-suites:tox:py38:preCommitPy38

FAILURE: Build failed with an exception.

* Where:
Script '<https://ci-beam.apache.org/job/beam_PreCommit_Python_Cron/ws/src/sdks/python/test-suites/dataflow/common.gradle'> line: 79

* What went wrong:
Execution failed for task ':sdks:python:test-suites:dataflow:py2:preCommitIT_streaming'.
> Process 'command 'sh'' finished with non-zero exit value 1

* Try:
Run with --stacktrace option to get the stack trace. Run with --info or --debug option to get more log output. Run with --scan to get full insights.

* Get more help at https://help.gradle.org

Deprecated Gradle features were used in this build, making it incompatible with Gradle 6.0.
Use '--warning-mode all' to show the individual deprecation warnings.
See https://docs.gradle.org/5.2.1/userguide/command_line_interface.html#sec:command_line_warnings

BUILD FAILED in 36m 49s
87 actionable tasks: 69 executed, 18 from cache

Publishing build scan...
https://gradle.com/s/o5riknx4l2aq6

Build step 'Invoke Gradle script' changed build result to FAILURE
Build step 'Invoke Gradle script' marked build as failure

---------------------------------------------------------------------
To unsubscribe, e-mail: builds-unsubscribe@beam.apache.org
For additional commands, e-mail: builds-help@beam.apache.org