You are viewing a plain text version of this content. The canonical link for it is here.
Posted to dev@lucene.apache.org by Apache Jenkins Server <je...@builds.apache.org> on 2017/07/02 23:28:22 UTC
[JENKINS] Lucene-Solr-Tests-master - Build # 1933 - Unstable
Build: https://builds.apache.org/job/Lucene-Solr-Tests-master/1933/
3 tests failed.
FAILED: org.apache.lucene.index.TestBinaryDocValuesUpdates.testManyReopensAndFields
Error Message:
invalid value for doc=0, field=f2, reader=_m(7.0.0):c178/1:delGen=1:fieldInfosGen=2:dvGen=2 expected:<5> but was:<4>
Stack Trace:
java.lang.AssertionError: invalid value for doc=0, field=f2, reader=_m(7.0.0):c178/1:delGen=1:fieldInfosGen=2:dvGen=2 expected:<5> but was:<4>
at __randomizedtesting.SeedInfo.seed([C78E0024D5E1AE49:F172620B5414CD55]:0)
at org.junit.Assert.fail(Assert.java:93)
at org.junit.Assert.failNotEquals(Assert.java:647)
at org.junit.Assert.assertEquals(Assert.java:128)
at org.junit.Assert.assertEquals(Assert.java:472)
at org.apache.lucene.index.TestBinaryDocValuesUpdates.testManyReopensAndFields(TestBinaryDocValuesUpdates.java:844)
at sun.reflect.NativeMethodAccessorImpl.invoke0(Native Method)
at sun.reflect.NativeMethodAccessorImpl.invoke(NativeMethodAccessorImpl.java:62)
at sun.reflect.DelegatingMethodAccessorImpl.invoke(DelegatingMethodAccessorImpl.java:43)
at java.lang.reflect.Method.invoke(Method.java:498)
at com.carrotsearch.randomizedtesting.RandomizedRunner.invoke(RandomizedRunner.java:1713)
at com.carrotsearch.randomizedtesting.RandomizedRunner$8.evaluate(RandomizedRunner.java:907)
at com.carrotsearch.randomizedtesting.RandomizedRunner$9.evaluate(RandomizedRunner.java:943)
at com.carrotsearch.randomizedtesting.RandomizedRunner$10.evaluate(RandomizedRunner.java:957)
at org.apache.lucene.util.TestRuleSetupTeardownChained$1.evaluate(TestRuleSetupTeardownChained.java:49)
at org.apache.lucene.util.AbstractBeforeAfterRule$1.evaluate(AbstractBeforeAfterRule.java:45)
at org.apache.lucene.util.TestRuleThreadAndTestName$1.evaluate(TestRuleThreadAndTestName.java:48)
at org.apache.lucene.util.TestRuleIgnoreAfterMaxFailures$1.evaluate(TestRuleIgnoreAfterMaxFailures.java:64)
at org.apache.lucene.util.TestRuleMarkFailure$1.evaluate(TestRuleMarkFailure.java:47)
at com.carrotsearch.randomizedtesting.rules.StatementAdapter.evaluate(StatementAdapter.java:36)
at com.carrotsearch.randomizedtesting.ThreadLeakControl$StatementRunner.run(ThreadLeakControl.java:368)
at com.carrotsearch.randomizedtesting.ThreadLeakControl.forkTimeoutingTask(ThreadLeakControl.java:817)
at com.carrotsearch.randomizedtesting.ThreadLeakControl$3.evaluate(ThreadLeakControl.java:468)
at com.carrotsearch.randomizedtesting.RandomizedRunner.runSingleTest(RandomizedRunner.java:916)
at com.carrotsearch.randomizedtesting.RandomizedRunner$5.evaluate(RandomizedRunner.java:802)
at com.carrotsearch.randomizedtesting.RandomizedRunner$6.evaluate(RandomizedRunner.java:852)
at com.carrotsearch.randomizedtesting.RandomizedRunner$7.evaluate(RandomizedRunner.java:863)
at org.apache.lucene.util.AbstractBeforeAfterRule$1.evaluate(AbstractBeforeAfterRule.java:45)
at com.carrotsearch.randomizedtesting.rules.StatementAdapter.evaluate(StatementAdapter.java:36)
at org.apache.lucene.util.TestRuleStoreClassName$1.evaluate(TestRuleStoreClassName.java:41)
at com.carrotsearch.randomizedtesting.rules.NoShadowingOrOverridesOnMethodsRule$1.evaluate(NoShadowingOrOverridesOnMethodsRule.java:40)
at com.carrotsearch.randomizedtesting.rules.NoShadowingOrOverridesOnMethodsRule$1.evaluate(NoShadowingOrOverridesOnMethodsRule.java:40)
at com.carrotsearch.randomizedtesting.rules.StatementAdapter.evaluate(StatementAdapter.java:36)
at com.carrotsearch.randomizedtesting.rules.StatementAdapter.evaluate(StatementAdapter.java:36)
at com.carrotsearch.randomizedtesting.rules.StatementAdapter.evaluate(StatementAdapter.java:36)
at org.apache.lucene.util.TestRuleAssertionsRequired$1.evaluate(TestRuleAssertionsRequired.java:53)
at org.apache.lucene.util.TestRuleMarkFailure$1.evaluate(TestRuleMarkFailure.java:47)
at org.apache.lucene.util.TestRuleIgnoreAfterMaxFailures$1.evaluate(TestRuleIgnoreAfterMaxFailures.java:64)
at org.apache.lucene.util.TestRuleIgnoreTestSuites$1.evaluate(TestRuleIgnoreTestSuites.java:54)
at com.carrotsearch.randomizedtesting.rules.StatementAdapter.evaluate(StatementAdapter.java:36)
at com.carrotsearch.randomizedtesting.ThreadLeakControl$StatementRunner.run(ThreadLeakControl.java:368)
at java.lang.Thread.run(Thread.java:748)
FAILED: org.apache.lucene.index.TestMixedDocValuesUpdates.testManyReopensAndFields
Error Message:
invalid binary value for doc=0, field=f2, reader=_l(7.0.0):c187/1:delGen=1:fieldInfosGen=2:dvGen=2 expected:<5> but was:<4>
Stack Trace:
java.lang.AssertionError: invalid binary value for doc=0, field=f2, reader=_l(7.0.0):c187/1:delGen=1:fieldInfosGen=2:dvGen=2 expected:<5> but was:<4>
at __randomizedtesting.SeedInfo.seed([C78E0024D5E1AE49:F172620B5414CD55]:0)
at org.junit.Assert.fail(Assert.java:93)
at org.junit.Assert.failNotEquals(Assert.java:647)
at org.junit.Assert.assertEquals(Assert.java:128)
at org.junit.Assert.assertEquals(Assert.java:472)
at org.apache.lucene.index.TestMixedDocValuesUpdates.testManyReopensAndFields(TestMixedDocValuesUpdates.java:141)
at sun.reflect.NativeMethodAccessorImpl.invoke0(Native Method)
at sun.reflect.NativeMethodAccessorImpl.invoke(NativeMethodAccessorImpl.java:62)
at sun.reflect.DelegatingMethodAccessorImpl.invoke(DelegatingMethodAccessorImpl.java:43)
at java.lang.reflect.Method.invoke(Method.java:498)
at com.carrotsearch.randomizedtesting.RandomizedRunner.invoke(RandomizedRunner.java:1713)
at com.carrotsearch.randomizedtesting.RandomizedRunner$8.evaluate(RandomizedRunner.java:907)
at com.carrotsearch.randomizedtesting.RandomizedRunner$9.evaluate(RandomizedRunner.java:943)
at com.carrotsearch.randomizedtesting.RandomizedRunner$10.evaluate(RandomizedRunner.java:957)
at org.apache.lucene.util.TestRuleSetupTeardownChained$1.evaluate(TestRuleSetupTeardownChained.java:49)
at org.apache.lucene.util.AbstractBeforeAfterRule$1.evaluate(AbstractBeforeAfterRule.java:45)
at org.apache.lucene.util.TestRuleThreadAndTestName$1.evaluate(TestRuleThreadAndTestName.java:48)
at org.apache.lucene.util.TestRuleIgnoreAfterMaxFailures$1.evaluate(TestRuleIgnoreAfterMaxFailures.java:64)
at org.apache.lucene.util.TestRuleMarkFailure$1.evaluate(TestRuleMarkFailure.java:47)
at com.carrotsearch.randomizedtesting.rules.StatementAdapter.evaluate(StatementAdapter.java:36)
at com.carrotsearch.randomizedtesting.ThreadLeakControl$StatementRunner.run(ThreadLeakControl.java:368)
at com.carrotsearch.randomizedtesting.ThreadLeakControl.forkTimeoutingTask(ThreadLeakControl.java:817)
at com.carrotsearch.randomizedtesting.ThreadLeakControl$3.evaluate(ThreadLeakControl.java:468)
at com.carrotsearch.randomizedtesting.RandomizedRunner.runSingleTest(RandomizedRunner.java:916)
at com.carrotsearch.randomizedtesting.RandomizedRunner$5.evaluate(RandomizedRunner.java:802)
at com.carrotsearch.randomizedtesting.RandomizedRunner$6.evaluate(RandomizedRunner.java:852)
at com.carrotsearch.randomizedtesting.RandomizedRunner$7.evaluate(RandomizedRunner.java:863)
at org.apache.lucene.util.AbstractBeforeAfterRule$1.evaluate(AbstractBeforeAfterRule.java:45)
at com.carrotsearch.randomizedtesting.rules.StatementAdapter.evaluate(StatementAdapter.java:36)
at org.apache.lucene.util.TestRuleStoreClassName$1.evaluate(TestRuleStoreClassName.java:41)
at com.carrotsearch.randomizedtesting.rules.NoShadowingOrOverridesOnMethodsRule$1.evaluate(NoShadowingOrOverridesOnMethodsRule.java:40)
at com.carrotsearch.randomizedtesting.rules.NoShadowingOrOverridesOnMethodsRule$1.evaluate(NoShadowingOrOverridesOnMethodsRule.java:40)
at com.carrotsearch.randomizedtesting.rules.StatementAdapter.evaluate(StatementAdapter.java:36)
at com.carrotsearch.randomizedtesting.rules.StatementAdapter.evaluate(StatementAdapter.java:36)
at com.carrotsearch.randomizedtesting.rules.StatementAdapter.evaluate(StatementAdapter.java:36)
at org.apache.lucene.util.TestRuleAssertionsRequired$1.evaluate(TestRuleAssertionsRequired.java:53)
at org.apache.lucene.util.TestRuleMarkFailure$1.evaluate(TestRuleMarkFailure.java:47)
at org.apache.lucene.util.TestRuleIgnoreAfterMaxFailures$1.evaluate(TestRuleIgnoreAfterMaxFailures.java:64)
at org.apache.lucene.util.TestRuleIgnoreTestSuites$1.evaluate(TestRuleIgnoreTestSuites.java:54)
at com.carrotsearch.randomizedtesting.rules.StatementAdapter.evaluate(StatementAdapter.java:36)
at com.carrotsearch.randomizedtesting.ThreadLeakControl$StatementRunner.run(ThreadLeakControl.java:368)
at java.lang.Thread.run(Thread.java:748)
FAILED: org.apache.solr.update.HardAutoCommitTest.testCommitWithin
Error Message:
Exception during query
Stack Trace:
java.lang.RuntimeException: Exception during query
at __randomizedtesting.SeedInfo.seed([CA9ADB9E5C0BBA8D:7048B4E6DF255498]:0)
at org.apache.solr.SolrTestCaseJ4.assertQ(SolrTestCaseJ4.java:878)
at org.apache.solr.update.HardAutoCommitTest.testCommitWithin(HardAutoCommitTest.java:100)
at sun.reflect.NativeMethodAccessorImpl.invoke0(Native Method)
at sun.reflect.NativeMethodAccessorImpl.invoke(NativeMethodAccessorImpl.java:62)
at sun.reflect.DelegatingMethodAccessorImpl.invoke(DelegatingMethodAccessorImpl.java:43)
at java.lang.reflect.Method.invoke(Method.java:498)
at com.carrotsearch.randomizedtesting.RandomizedRunner.invoke(RandomizedRunner.java:1713)
at com.carrotsearch.randomizedtesting.RandomizedRunner$8.evaluate(RandomizedRunner.java:907)
at com.carrotsearch.randomizedtesting.RandomizedRunner$9.evaluate(RandomizedRunner.java:943)
at com.carrotsearch.randomizedtesting.RandomizedRunner$10.evaluate(RandomizedRunner.java:957)
at com.carrotsearch.randomizedtesting.rules.SystemPropertiesRestoreRule$1.evaluate(SystemPropertiesRestoreRule.java:57)
at org.apache.lucene.util.TestRuleSetupTeardownChained$1.evaluate(TestRuleSetupTeardownChained.java:49)
at org.apache.lucene.util.AbstractBeforeAfterRule$1.evaluate(AbstractBeforeAfterRule.java:45)
at org.apache.lucene.util.TestRuleThreadAndTestName$1.evaluate(TestRuleThreadAndTestName.java:48)
at org.apache.lucene.util.TestRuleIgnoreAfterMaxFailures$1.evaluate(TestRuleIgnoreAfterMaxFailures.java:64)
at org.apache.lucene.util.TestRuleMarkFailure$1.evaluate(TestRuleMarkFailure.java:47)
at com.carrotsearch.randomizedtesting.rules.StatementAdapter.evaluate(StatementAdapter.java:36)
at com.carrotsearch.randomizedtesting.ThreadLeakControl$StatementRunner.run(ThreadLeakControl.java:368)
at com.carrotsearch.randomizedtesting.ThreadLeakControl.forkTimeoutingTask(ThreadLeakControl.java:817)
at com.carrotsearch.randomizedtesting.ThreadLeakControl$3.evaluate(ThreadLeakControl.java:468)
at com.carrotsearch.randomizedtesting.RandomizedRunner.runSingleTest(RandomizedRunner.java:916)
at com.carrotsearch.randomizedtesting.RandomizedRunner$5.evaluate(RandomizedRunner.java:802)
at com.carrotsearch.randomizedtesting.RandomizedRunner$6.evaluate(RandomizedRunner.java:852)
at com.carrotsearch.randomizedtesting.RandomizedRunner$7.evaluate(RandomizedRunner.java:863)
at com.carrotsearch.randomizedtesting.rules.StatementAdapter.evaluate(StatementAdapter.java:36)
at com.carrotsearch.randomizedtesting.rules.SystemPropertiesRestoreRule$1.evaluate(SystemPropertiesRestoreRule.java:57)
at org.apache.lucene.util.AbstractBeforeAfterRule$1.evaluate(AbstractBeforeAfterRule.java:45)
at com.carrotsearch.randomizedtesting.rules.StatementAdapter.evaluate(StatementAdapter.java:36)
at org.apache.lucene.util.TestRuleStoreClassName$1.evaluate(TestRuleStoreClassName.java:41)
at com.carrotsearch.randomizedtesting.rules.NoShadowingOrOverridesOnMethodsRule$1.evaluate(NoShadowingOrOverridesOnMethodsRule.java:40)
at com.carrotsearch.randomizedtesting.rules.NoShadowingOrOverridesOnMethodsRule$1.evaluate(NoShadowingOrOverridesOnMethodsRule.java:40)
at com.carrotsearch.randomizedtesting.rules.StatementAdapter.evaluate(StatementAdapter.java:36)
at com.carrotsearch.randomizedtesting.rules.StatementAdapter.evaluate(StatementAdapter.java:36)
at com.carrotsearch.randomizedtesting.rules.StatementAdapter.evaluate(StatementAdapter.java:36)
at org.apache.lucene.util.TestRuleAssertionsRequired$1.evaluate(TestRuleAssertionsRequired.java:53)
at org.apache.lucene.util.TestRuleMarkFailure$1.evaluate(TestRuleMarkFailure.java:47)
at org.apache.lucene.util.TestRuleIgnoreAfterMaxFailures$1.evaluate(TestRuleIgnoreAfterMaxFailures.java:64)
at org.apache.lucene.util.TestRuleIgnoreTestSuites$1.evaluate(TestRuleIgnoreTestSuites.java:54)
at com.carrotsearch.randomizedtesting.rules.StatementAdapter.evaluate(StatementAdapter.java:36)
at com.carrotsearch.randomizedtesting.ThreadLeakControl$StatementRunner.run(ThreadLeakControl.java:368)
at java.lang.Thread.run(Thread.java:748)
Caused by: java.lang.RuntimeException: REQUEST FAILED: xpath=//result[@numFound=1]
xml response was: <?xml version="1.0" encoding="UTF-8"?>
<response>
<lst name="responseHeader"><int name="status">0</int><int name="QTime">0</int></lst><result name="response" numFound="0" start="0"></result>
</response>
request was:q=id:529&qt=&start=0&rows=20&version=2.2
at org.apache.solr.SolrTestCaseJ4.assertQ(SolrTestCaseJ4.java:871)
... 40 more
Build Log:
[...truncated 466 lines...]
[junit4] Suite: org.apache.lucene.index.TestBinaryDocValuesUpdates
[junit4] 1> TEST: isNRT=false reader1=StandardDirectoryReader(segments_1:4 _0(7.0.0):C2)
[junit4] 1> TEST: now reopen
[junit4] 2> NOTE: reproduce with: ant test -Dtestcase=TestBinaryDocValuesUpdates -Dtests.method=testManyReopensAndFields -Dtests.seed=C78E0024D5E1AE49 -Dtests.multiplier=2 -Dtests.slow=true -Dtests.locale=zh -Dtests.timezone=Etc/GMT-4 -Dtests.asserts=true -Dtests.file.encoding=UTF-8
[junit4] FAILURE 0.23s J0 | TestBinaryDocValuesUpdates.testManyReopensAndFields <<<
[junit4] > Throwable #1: java.lang.AssertionError: invalid value for doc=0, field=f2, reader=_m(7.0.0):c178/1:delGen=1:fieldInfosGen=2:dvGen=2 expected:<5> but was:<4>
[junit4] > at __randomizedtesting.SeedInfo.seed([C78E0024D5E1AE49:F172620B5414CD55]:0)
[junit4] > at org.apache.lucene.index.TestBinaryDocValuesUpdates.testManyReopensAndFields(TestBinaryDocValuesUpdates.java:844)
[junit4] > at java.lang.Thread.run(Thread.java:748)
[junit4] IGNOR/A 0.00s J0 | TestBinaryDocValuesUpdates.testTonsOfUpdates
[junit4] > Assumption #1: 'nightly' test group is disabled (@Nightly())
[junit4] 2> NOTE: test params are: codec=DummyCompressingStoredFields(storedFieldsFormat=CompressingStoredFieldsFormat(compressionMode=DUMMY, chunkSize=9, maxDocsPerChunk=303, blockSize=5), termVectorsFormat=CompressingTermVectorsFormat(compressionMode=DUMMY, chunkSize=9, blockSize=5)), sim=RandomSimilarity(queryNorm=false): {}, locale=zh, timezone=Etc/GMT-4
[junit4] 2> NOTE: Linux 3.13.0-88-generic amd64/Oracle Corporation 1.8.0_131 (64-bit)/cpus=4,threads=1,free=70735048,total=242221056
[junit4] 2> NOTE: All tests run in this JVM: [TestSort, TestLucene50CompoundFormat, TestSegmentMerger, TestBinaryTerms, TestIndexWriterConfig, TestCodecHoldsOpenFiles, TestSimpleExplanations, TestOrdinalMap, TestTermVectorsWriter, TestDocValuesIndexing, TestBooleanScorer, TestGeoUtils, TestMultiCollector, TestTotalHitCountCollector, TestSparseFixedBitDocIdSet, TestUnicodeUtil, TestMaxTermFrequency, TestPerSegmentDeletes, TestSnapshotDeletionPolicy, TestSimilarityProvider, TestFloatRangeFieldQueries, Test4GBStoredFields, TestIndexWriterOnVMError, TestTrackingDirectoryWrapper, TestBooleanQueryVisitSubscorers, TestForceMergeForever, TestIntRangeFieldQueries, TestNGramPhraseQuery, TestIndexInput, TestDateTools, TestBinaryDocValuesUpdates]
[junit4] Completed [75/454 (1!)] on J0 in 5.94s, 29 tests, 1 failure, 1 skipped <<< FAILURES!
[...truncated 971 lines...]
[junit4] Suite: org.apache.lucene.index.TestMixedDocValuesUpdates
[junit4] IGNOR/A 0.00s J0 | TestMixedDocValuesUpdates.testTonsOfUpdates
[junit4] > Assumption #1: 'nightly' test group is disabled (@Nightly())
[junit4] 2> NOTE: reproduce with: ant test -Dtestcase=TestMixedDocValuesUpdates -Dtests.method=testManyReopensAndFields -Dtests.seed=C78E0024D5E1AE49 -Dtests.multiplier=2 -Dtests.slow=true -Dtests.locale=ar-IQ -Dtests.timezone=Europe/Dublin -Dtests.asserts=true -Dtests.file.encoding=UTF-8
[junit4] FAILURE 0.47s J0 | TestMixedDocValuesUpdates.testManyReopensAndFields <<<
[junit4] > Throwable #1: java.lang.AssertionError: invalid binary value for doc=0, field=f2, reader=_l(7.0.0):c187/1:delGen=1:fieldInfosGen=2:dvGen=2 expected:<5> but was:<4>
[junit4] > at __randomizedtesting.SeedInfo.seed([C78E0024D5E1AE49:F172620B5414CD55]:0)
[junit4] > at org.apache.lucene.index.TestMixedDocValuesUpdates.testManyReopensAndFields(TestMixedDocValuesUpdates.java:141)
[junit4] > at java.lang.Thread.run(Thread.java:748)
[junit4] 2> NOTE: test params are: codec=Asserting(Lucene70): {updKey=PostingsFormat(name=Memory), id=PostingsFormat(name=LuceneFixedGap), key=PostingsFormat(name=LuceneFixedGap)}, docValues:{cf3=DocValuesFormat(name=Lucene70), cf=DocValuesFormat(name=Direct), f=DocValuesFormat(name=Asserting), f0=DocValuesFormat(name=Asserting), f1=DocValuesFormat(name=Direct), id=DocValuesFormat(name=Direct), f2=DocValuesFormat(name=Lucene70), cf0=DocValuesFormat(name=Memory), f3=DocValuesFormat(name=Memory), cf2=DocValuesFormat(name=Direct), key=DocValuesFormat(name=Direct), cf1=DocValuesFormat(name=Asserting)}, maxPointsInLeafNode=466, maxMBSortInHeap=7.527995647794963, sim=RandomSimilarity(queryNorm=false): {}, locale=ar-IQ, timezone=Europe/Dublin
[junit4] 2> NOTE: Linux 3.13.0-88-generic amd64/Oracle Corporation 1.8.0_131 (64-bit)/cpus=4,threads=1,free=209478800,total=374341632
[junit4] 2> NOTE: All tests run in this JVM: [TestSort, TestLucene50CompoundFormat, TestSegmentMerger, TestBinaryTerms, TestIndexWriterConfig, TestCodecHoldsOpenFiles, TestSimpleExplanations, TestOrdinalMap, TestTermVectorsWriter, TestDocValuesIndexing, TestBooleanScorer, TestGeoUtils, TestMultiCollector, TestTotalHitCountCollector, TestSparseFixedBitDocIdSet, TestUnicodeUtil, TestMaxTermFrequency, TestPerSegmentDeletes, TestSnapshotDeletionPolicy, TestSimilarityProvider, TestFloatRangeFieldQueries, Test4GBStoredFields, TestIndexWriterOnVMError, TestTrackingDirectoryWrapper, TestBooleanQueryVisitSubscorers, TestForceMergeForever, TestIntRangeFieldQueries, TestNGramPhraseQuery, TestIndexInput, TestDateTools, TestBinaryDocValuesUpdates, TestBooleanRewrites, TestFieldMaskingSpanQuery, TestSearch, TestNeverDelete, TestStandardAnalyzer, TestNewestSegment, FiniteStringsIteratorTest, TestIndexWriterExceptions2, TestDirectPacked, TestBKD, TestThreadedForceMerge, TestLongValuesSource, TestCharFilter, TestGraphTokenStreamFiniteStrings, TestLiveFieldValues, TestBytesRef, TestLucene50TermVectorsFormat, TestAxiomaticSimilarity, TestDeletionPolicy, TestDocCount, TestSimpleFSLockFactory, TestSpanCollection, TestNot, TestMergeRateLimiter, TestSynonymQuery, TestOperations, TestNoDeletionPolicy, TestPostingsOffsets, TestMultiTermQueryRewrites, TestGrowableByteArrayDataOutput, TestSimpleSearchEquivalence, TestBytesStore, TestPersistentSnapshotDeletionPolicy, TestControlledRealTimeReopenThread, TestMultiThreadTermVectors, TestMatchAllDocsQuery, TestIndexReaderClose, TestIsCurrent, TestIndexingSequenceNumbers, TestAutomatonQuery, TestDoubleRangeFieldQueries, TestAllFilesCheckIndexHeader, TestWildcardRandom, TestSortedNumericSortField, TestIndexWriterExceptions, TestBasics, TestSloppyPhraseQuery, TestIndexWriterMergePolicy, TestBoolean2, TestSearchAfter, TestDocumentsWriterStallControl, TestLongPostings, TestIndexWriterForceMerge, TestPerFieldPostingsFormat, TestConsistentFieldNumbers, TestWeakIdentityMap, TestPhraseQuery, TestBagOfPositions, TestOmitNorms, TestNRTCachingDirectory, TestSegmentReader, TestIndexWriterNRTIsCurrent, TestFieldCacheRewriteMethod, TestTransactions, TestCrash, TestSegmentTermDocs, TestMultiDocValues, TestToken, TestFieldsReader, TestSimilarityBase, TestHugeRamFile, TestTermsEnum2, TestDeterminizeLexicon, TestMixedCodecs, TestStressIndexing2, TestMultiPhraseQuery, TestLazyProxSkipping, TestDeterminism, TestOmitPositions, TestStressNRT, TestTermRangeQuery, TestDocumentWriter, TestForTooMuchCloning, TestSpanSearchEquivalence, TestPayloads, TestDoc, TestExternalCodecs, TestRegexpQuery, TestIntBlockPool, TestComplexExplanationsOfNonMatches, TestTermScorer, TestSumDocFreq, TestDocValuesScoring, TestDirectory, TestSpanMultiTermQueryWrapper, TestSizeBoundedForceMerge, TestConstantScoreQuery, TestPrefixQuery, TestNoMergePolicy, TestNamedSPILoader, TestDemo, TestRollback, TestSimpleAttributeImpl, TestTerm, Test2BTerms, TestCharArrayMap, TestStopFilter, TestBytesRefAttImpl, TestBlockPostingsFormat, TestIndexedDISI, TestPolygon2D, TestIndexWriterFromReader, TestIndexWriterOutOfFileDescriptors, TestLogMergePolicy, TestManyFields, TestMaxPosition, TestMergePolicyWrapper, TestMixedDocValuesUpdates]
[junit4] Completed [371/454 (2!)] on J0 in 4.05s, 4 tests, 1 failure, 1 skipped <<< FAILURES!
[...truncated 10616 lines...]
[junit4] Suite: org.apache.solr.update.HardAutoCommitTest
[junit4] 2> Creating dataDir: /x1/jenkins/jenkins-slave/workspace/Lucene-Solr-Tests-master/solr/build/solr-core/test/J2/temp/solr.update.HardAutoCommitTest_CA9ADB9E5C0BBA8D-001/init-core-data-001
[junit4] 2> 1139700 WARN (SUITE-HardAutoCommitTest-seed#[CA9ADB9E5C0BBA8D]-worker) [ ] o.a.s.SolrTestCaseJ4 startTrackingSearchers: numOpens=18 numCloses=18
[junit4] 2> 1139701 INFO (SUITE-HardAutoCommitTest-seed#[CA9ADB9E5C0BBA8D]-worker) [ ] o.a.s.SolrTestCaseJ4 Using TrieFields (NUMERIC_POINTS_SYSPROP=false) w/NUMERIC_DOCVALUES_SYSPROP=true
[junit4] 2> 1139702 INFO (SUITE-HardAutoCommitTest-seed#[CA9ADB9E5C0BBA8D]-worker) [ ] o.a.s.SolrTestCaseJ4 Randomized ssl (false) and clientAuth (true) via: @org.apache.solr.util.RandomizeSSL(reason=, ssl=NaN, value=NaN, clientAuth=NaN)
[junit4] 2> 1139702 INFO (SUITE-HardAutoCommitTest-seed#[CA9ADB9E5C0BBA8D]-worker) [ ] o.a.s.SolrTestCaseJ4 ####initCore
[junit4] 2> 1139703 INFO (SUITE-HardAutoCommitTest-seed#[CA9ADB9E5C0BBA8D]-worker) [ ] o.a.s.c.SolrResourceLoader [null] Added 2 libs to classloader, from paths: [/x1/jenkins/jenkins-slave/workspace/Lucene-Solr-Tests-master/solr/core/src/test-files/solr/collection1/lib, /x1/jenkins/jenkins-slave/workspace/Lucene-Solr-Tests-master/solr/core/src/test-files/solr/collection1/lib/classes]
[junit4] 2> 1139734 INFO (SUITE-HardAutoCommitTest-seed#[CA9ADB9E5C0BBA8D]-worker) [ ] o.a.s.c.SolrConfig Using Lucene MatchVersion: 7.0.0
[junit4] 2> 1139761 INFO (SUITE-HardAutoCommitTest-seed#[CA9ADB9E5C0BBA8D]-worker) [ ] o.a.s.s.IndexSchema [null] Schema name=test
[junit4] 2> 1139940 INFO (SUITE-HardAutoCommitTest-seed#[CA9ADB9E5C0BBA8D]-worker) [ ] o.a.s.s.IndexSchema Loaded schema test/1.0 with uniqueid field id
[junit4] 2> 1140010 INFO (SUITE-HardAutoCommitTest-seed#[CA9ADB9E5C0BBA8D]-worker) [ ] o.a.s.m.r.SolrJmxReporter JMX monitoring for 'solr.node' (registry 'solr.node') enabled at server: com.sun.jmx.mbeanserver.JmxMBeanServer@8488638
[junit4] 2> 1140016 INFO (SUITE-HardAutoCommitTest-seed#[CA9ADB9E5C0BBA8D]-worker) [ ] o.a.s.m.r.SolrJmxReporter JMX monitoring for 'solr.jvm' (registry 'solr.jvm') enabled at server: com.sun.jmx.mbeanserver.JmxMBeanServer@8488638
[junit4] 2> 1140016 INFO (SUITE-HardAutoCommitTest-seed#[CA9ADB9E5C0BBA8D]-worker) [ ] o.a.s.m.r.SolrJmxReporter JMX monitoring for 'solr.jetty' (registry 'solr.jetty') enabled at server: com.sun.jmx.mbeanserver.JmxMBeanServer@8488638
[junit4] 2> 1140021 INFO (coreLoadExecutor-4753-thread-1) [ x:collection1] o.a.s.c.SolrResourceLoader [null] Added 2 libs to classloader, from paths: [/x1/jenkins/jenkins-slave/workspace/Lucene-Solr-Tests-master/solr/core/src/test-files/solr/collection1/lib, /x1/jenkins/jenkins-slave/workspace/Lucene-Solr-Tests-master/solr/core/src/test-files/solr/collection1/lib/classes]
[junit4] 2> 1140062 INFO (coreLoadExecutor-4753-thread-1) [ x:collection1] o.a.s.c.SolrConfig Using Lucene MatchVersion: 7.0.0
[junit4] 2> 1140097 INFO (coreLoadExecutor-4753-thread-1) [ x:collection1] o.a.s.s.IndexSchema [collection1] Schema name=test
[junit4] 2> 1140287 INFO (coreLoadExecutor-4753-thread-1) [ x:collection1] o.a.s.s.IndexSchema Loaded schema test/1.0 with uniqueid field id
[junit4] 2> 1140295 INFO (coreLoadExecutor-4753-thread-1) [ x:collection1] o.a.s.c.CoreContainer Creating SolrCore 'collection1' using configuration from instancedir /x1/jenkins/jenkins-slave/workspace/Lucene-Solr-Tests-master/solr/core/src/test-files/solr/collection1, trusted=true
[junit4] 2> 1140296 INFO (coreLoadExecutor-4753-thread-1) [ x:collection1] o.a.s.m.r.SolrJmxReporter JMX monitoring for 'solr.core.collection1' (registry 'solr.core.collection1') enabled at server: com.sun.jmx.mbeanserver.JmxMBeanServer@8488638
[junit4] 2> 1140296 INFO (coreLoadExecutor-4753-thread-1) [ x:collection1] o.a.s.c.SolrCore solr.RecoveryStrategy.Builder
[junit4] 2> 1140296 INFO (coreLoadExecutor-4753-thread-1) [ x:collection1] o.a.s.c.SolrCore [[collection1] ] Opening new SolrCore at [/x1/jenkins/jenkins-slave/workspace/Lucene-Solr-Tests-master/solr/core/src/test-files/solr/collection1], dataDir=[/x1/jenkins/jenkins-slave/workspace/Lucene-Solr-Tests-master/solr/build/solr-core/test/J2/temp/solr.update.HardAutoCommitTest_CA9ADB9E5C0BBA8D-001/init-core-data-001/]
[junit4] 2> 1140298 INFO (coreLoadExecutor-4753-thread-1) [ x:collection1] o.a.s.u.RandomMergePolicy RandomMergePolicy wrapping class org.apache.lucene.index.LogDocMergePolicy: [LogDocMergePolicy: minMergeSize=1000, mergeFactor=40, maxMergeSize=9223372036854775807, maxMergeSizeForForcedMerge=9223372036854775807, calibrateSizeByDeletes=false, maxMergeDocs=2147483647, maxCFSSegmentSizeMB=8.796093022207999E12, noCFSRatio=0.692988452898353]
[junit4] 2> 1140420 INFO (coreLoadExecutor-4753-thread-1) [ x:collection1] o.a.s.u.UpdateHandler Using UpdateLog implementation: org.apache.solr.update.UpdateLog
[junit4] 2> 1140420 INFO (coreLoadExecutor-4753-thread-1) [ x:collection1] o.a.s.u.UpdateLog Initializing UpdateLog: dataDir= defaultSyncLevel=FLUSH numRecordsToKeep=100 maxNumLogsToKeep=10 numVersionBuckets=65536
[junit4] 2> 1140421 INFO (coreLoadExecutor-4753-thread-1) [ x:collection1] o.a.s.u.CommitTracker Hard AutoCommit: disabled
[junit4] 2> 1140421 INFO (coreLoadExecutor-4753-thread-1) [ x:collection1] o.a.s.u.CommitTracker Soft AutoCommit: disabled
[junit4] 2> 1140422 INFO (coreLoadExecutor-4753-thread-1) [ x:collection1] o.a.s.u.RandomMergePolicy RandomMergePolicy wrapping class org.apache.lucene.index.TieredMergePolicy: [TieredMergePolicy: maxMergeAtOnce=37, maxMergeAtOnceExplicit=24, maxMergedSegmentMB=71.9453125, floorSegmentMB=0.830078125, forceMergeDeletesPctAllowed=6.27020175248207, segmentsPerTier=47.0, maxCFSSegmentSizeMB=8.796093022207999E12, noCFSRatio=1.0
[junit4] 2> 1140423 INFO (coreLoadExecutor-4753-thread-1) [ x:collection1] o.a.s.s.SolrIndexSearcher Opening [Searcher@12b52dd7[collection1] main]
[junit4] 2> 1140423 INFO (coreLoadExecutor-4753-thread-1) [ x:collection1] o.a.s.h.c.SpellCheckComponent Initializing spell checkers
[junit4] 2> 1140432 INFO (coreLoadExecutor-4753-thread-1) [ x:collection1] o.a.s.s.DirectSolrSpellChecker init: {name=direct,classname=DirectSolrSpellChecker,field=lowerfilt,minQueryLength=3}
[junit4] 2> 1140470 INFO (coreLoadExecutor-4753-thread-1) [ x:collection1] o.a.s.h.ReplicationHandler Commits will be reserved for 10000
[junit4] 2> 1140470 INFO (coreLoadExecutor-4753-thread-1) [ x:collection1] o.a.s.u.UpdateLog Could not find max version in index or recent updates, using new clock 1571853306263764992
[junit4] 2> 1140472 INFO (searcherExecutor-4754-thread-1-processing-x:collection1) [ x:collection1] o.a.s.h.c.SpellCheckComponent Loading spell index for spellchecker: default
[junit4] 2> 1140472 INFO (searcherExecutor-4754-thread-1-processing-x:collection1) [ x:collection1] o.a.s.h.c.SpellCheckComponent Loading spell index for spellchecker: direct
[junit4] 2> 1140472 INFO (searcherExecutor-4754-thread-1-processing-x:collection1) [ x:collection1] o.a.s.h.c.SpellCheckComponent Loading spell index for spellchecker: wordbreak
[junit4] 2> 1140472 INFO (searcherExecutor-4754-thread-1-processing-x:collection1) [ x:collection1] o.a.s.h.c.SpellCheckComponent Loading spell index for spellchecker: multipleFields
[junit4] 2> 1140473 INFO (searcherExecutor-4754-thread-1-processing-x:collection1) [ x:collection1] o.a.s.h.c.SpellCheckComponent Loading spell index for spellchecker: jarowinkler
[junit4] 2> 1140473 INFO (searcherExecutor-4754-thread-1-processing-x:collection1) [ x:collection1] o.a.s.h.c.SpellCheckComponent Loading spell index for spellchecker: external
[junit4] 2> 1140473 INFO (searcherExecutor-4754-thread-1-processing-x:collection1) [ x:collection1] o.a.s.h.c.SpellCheckComponent Loading spell index for spellchecker: freq
[junit4] 2> 1140473 INFO (searcherExecutor-4754-thread-1-processing-x:collection1) [ x:collection1] o.a.s.h.c.SpellCheckComponent Loading spell index for spellchecker: fqcn
[junit4] 2> 1140474 INFO (searcherExecutor-4754-thread-1-processing-x:collection1) [ x:collection1] o.a.s.h.c.SpellCheckComponent Loading spell index for spellchecker: perDict
[junit4] 2> 1140475 INFO (searcherExecutor-4754-thread-1-processing-x:collection1) [ x:collection1] o.a.s.c.SolrCore [collection1] Registered new searcher Searcher@12b52dd7[collection1] main{ExitableDirectoryReader(UninvertingDirectoryReader())}
[junit4] 2> 1140476 INFO (SUITE-HardAutoCommitTest-seed#[CA9ADB9E5C0BBA8D]-worker) [ ] o.a.s.SolrTestCaseJ4 ####initCore end
[junit4] 2> 1140479 INFO (TEST-HardAutoCommitTest.testCommitWithin-seed#[CA9ADB9E5C0BBA8D]) [ ] o.a.s.SolrTestCaseJ4 ###Starting testCommitWithin
[junit4] 2> 1140479 INFO (TEST-HardAutoCommitTest.testCommitWithin-seed#[CA9ADB9E5C0BBA8D]) [ ] o.a.s.u.DirectUpdateHandler2 [collection1] REMOVING ALL DOCUMENTS FROM INDEX
[junit4] 2> 1140480 INFO (TEST-HardAutoCommitTest.testCommitWithin-seed#[CA9ADB9E5C0BBA8D]) [ ] o.a.s.s.SolrIndexSearcher Opening [Searcher@41735728[collection1] realtime]
[junit4] 2> 1140480 INFO (TEST-HardAutoCommitTest.testCommitWithin-seed#[CA9ADB9E5C0BBA8D]) [ ] o.a.s.u.p.LogUpdateProcessorFactory [collection1] webapp=null path=null params={_version_=-9223372036854775807&update.distrib=FROMLEADER&versions=true&wt=json&indent=true}{deleteByQuery=*:* (-9223372036854775807)} 0 0
[junit4] 2> 1140480 ERROR (TEST-HardAutoCommitTest.testCommitWithin-seed#[CA9ADB9E5C0BBA8D]) [ ] o.a.s.c.CorePropertiesLocator Couldn't load core descriptor from /x1/jenkins/jenkins-slave/workspace/Lucene-Solr-Tests-master/solr/core/src/test-files/solr/collection1/core.properties:java.nio.file.NoSuchFileException: /x1/jenkins/jenkins-slave/workspace/Lucene-Solr-Tests-master/solr/core/src/test-files/solr/collection1/core.properties
[junit4] 2> 1140481 INFO (TEST-HardAutoCommitTest.testCommitWithin-seed#[CA9ADB9E5C0BBA8D]) [ ] o.a.s.c.SolrResourceLoader [null] Added 2 libs to classloader, from paths: [/x1/jenkins/jenkins-slave/workspace/Lucene-Solr-Tests-master/solr/core/src/test-files/solr/collection1/lib, /x1/jenkins/jenkins-slave/workspace/Lucene-Solr-Tests-master/solr/core/src/test-files/solr/collection1/lib/classes]
[junit4] 2> 1140695 INFO (TEST-HardAutoCommitTest.testCommitWithin-seed#[CA9ADB9E5C0BBA8D]) [ ] o.a.s.c.SolrConfig Using Lucene MatchVersion: 7.0.0
[junit4] 2> 1140734 INFO (TEST-HardAutoCommitTest.testCommitWithin-seed#[CA9ADB9E5C0BBA8D]) [ ] o.a.s.s.IndexSchema [collection1] Schema name=test
[junit4] 2> 1140929 INFO (TEST-HardAutoCommitTest.testCommitWithin-seed#[CA9ADB9E5C0BBA8D]) [ ] o.a.s.s.IndexSchema Loaded schema test/1.0 with uniqueid field id
[junit4] 2> 1140943 INFO (TEST-HardAutoCommitTest.testCommitWithin-seed#[CA9ADB9E5C0BBA8D]) [ ] o.a.s.c.CoreContainer Reloading SolrCore 'collection1' using configuration from instancedir /x1/jenkins/jenkins-slave/workspace/Lucene-Solr-Tests-master/solr/core/src/test-files/solr/collection1
[junit4] 2> 1140966 INFO (TEST-HardAutoCommitTest.testCommitWithin-seed#[CA9ADB9E5C0BBA8D]) [ x:collection1] o.a.s.m.r.SolrJmxReporter JMX monitoring for 'solr.core.collection1' (registry 'solr.core.collection1') enabled at server: com.sun.jmx.mbeanserver.JmxMBeanServer@8488638
[junit4] 2> 1140966 INFO (TEST-HardAutoCommitTest.testCommitWithin-seed#[CA9ADB9E5C0BBA8D]) [ x:collection1] o.a.s.c.SolrCore [[collection1] ] Opening new SolrCore at [/x1/jenkins/jenkins-slave/workspace/Lucene-Solr-Tests-master/solr/core/src/test-files/solr/collection1], dataDir=[/x1/jenkins/jenkins-slave/workspace/Lucene-Solr-Tests-master/solr/build/solr-core/test/J2/temp/solr.update.HardAutoCommitTest_CA9ADB9E5C0BBA8D-001/init-core-data-001/]
[junit4] 2> 1141058 INFO (TEST-HardAutoCommitTest.testCommitWithin-seed#[CA9ADB9E5C0BBA8D]) [ x:collection1] o.a.s.u.CommitTracker Hard AutoCommit: disabled
[junit4] 2> 1141058 INFO (TEST-HardAutoCommitTest.testCommitWithin-seed#[CA9ADB9E5C0BBA8D]) [ x:collection1] o.a.s.u.CommitTracker Soft AutoCommit: disabled
[junit4] 2> 1141059 INFO (TEST-HardAutoCommitTest.testCommitWithin-seed#[CA9ADB9E5C0BBA8D]) [ x:collection1] o.a.s.s.SolrIndexSearcher Opening [Searcher@174d2ea4[collection1] main]
[junit4] 2> 1141060 INFO (TEST-HardAutoCommitTest.testCommitWithin-seed#[CA9ADB9E5C0BBA8D]) [ x:collection1] o.a.s.h.c.SpellCheckComponent Initializing spell checkers
[junit4] 2> 1141065 INFO (TEST-HardAutoCommitTest.testCommitWithin-seed#[CA9ADB9E5C0BBA8D]) [ x:collection1] o.a.s.s.DirectSolrSpellChecker init: {name=direct,classname=DirectSolrSpellChecker,field=lowerfilt,minQueryLength=3}
[junit4] 2> 1141068 INFO (TEST-HardAutoCommitTest.testCommitWithin-seed#[CA9ADB9E5C0BBA8D]) [ x:collection1] o.a.s.h.ReplicationHandler Commits will be reserved for 10000
[junit4] 2> 1141068 INFO (TEST-HardAutoCommitTest.testCommitWithin-seed#[CA9ADB9E5C0BBA8D]) [ x:collection1] o.a.s.u.UpdateLog Could not find max version in index or recent updates, using new clock 1571853306890813440
[junit4] 2> 1141073 INFO (searcherExecutor-4759-thread-1-processing-x:collection1) [ x:collection1] o.a.s.h.c.SpellCheckComponent Loading spell index for spellchecker: default
[junit4] 2> 1141074 INFO (searcherExecutor-4759-thread-1-processing-x:collection1) [ x:collection1] o.a.s.h.c.SpellCheckComponent Loading spell index for spellchecker: direct
[junit4] 2> 1141074 INFO (searcherExecutor-4759-thread-1-processing-x:collection1) [ x:collection1] o.a.s.h.c.SpellCheckComponent Loading spell index for spellchecker: wordbreak
[junit4] 2> 1141074 INFO (searcherExecutor-4759-thread-1-processing-x:collection1) [ x:collection1] o.a.s.h.c.SpellCheckComponent Loading spell index for spellchecker: multipleFields
[junit4] 2> 1141074 INFO (searcherExecutor-4759-thread-1-processing-x:collection1) [ x:collection1] o.a.s.h.c.SpellCheckComponent Loading spell index for spellchecker: jarowinkler
[junit4] 2> 1141075 INFO (searcherExecutor-4759-thread-1-processing-x:collection1) [ x:collection1] o.a.s.h.c.SpellCheckComponent Loading spell index for spellchecker: external
[junit4] 2> 1141075 INFO (searcherExecutor-4759-thread-1-processing-x:collection1) [ x:collection1] o.a.s.h.c.SpellCheckComponent Loading spell index for spellchecker: freq
[junit4] 2> 1141079 INFO (searcherExecutor-4759-thread-1-processing-x:collection1) [ x:collection1] o.a.s.h.c.SpellCheckComponent Loading spell index for spellchecker: fqcn
[junit4] 2> 1141082 INFO (TEST-HardAutoCommitTest.testCommitWithin-seed#[CA9ADB9E5C0BBA8D]) [ x:collection1] o.a.s.u.RandomMergePolicy RandomMergePolicy wrapping class org.apache.lucene.index.LogByteSizeMergePolicy: [LogByteSizeMergePolicy: minMergeSize=1677721, mergeFactor=21, maxMergeSize=2147483648, maxMergeSizeForForcedMerge=9223372036854775807, calibrateSizeByDeletes=false, maxMergeDocs=2147483647, maxCFSSegmentSizeMB=8.796093022207999E12, noCFSRatio=0.757485158597013]
[junit4] 2> 1141082 INFO (TEST-HardAutoCommitTest.testCommitWithin-seed#[CA9ADB9E5C0BBA8D]) [ x:collection1] o.a.s.u.DefaultSolrCoreState New IndexWriter is ready to be used.
[junit4] 2> 1141166 INFO (searcherExecutor-4759-thread-1-processing-x:collection1) [ x:collection1] o.a.s.h.c.SpellCheckComponent Loading spell index for spellchecker: perDict
[junit4] 2> 1141169 INFO (searcherExecutor-4759-thread-1-processing-x:collection1) [ x:collection1] o.a.s.c.SolrCore [collection1] Registered new searcher Searcher@174d2ea4[collection1] main{ExitableDirectoryReader(UninvertingDirectoryReader())}
[junit4] 2> 1141169 INFO (TEST-HardAutoCommitTest.testCommitWithin-seed#[CA9ADB9E5C0BBA8D]) [ x:collection1] o.a.s.s.SolrIndexSearcher Opening [Searcher@39c6cddd[collection1] main]
[junit4] 2> 1141170 INFO (TEST-HardAutoCommitTest.testCommitWithin-seed#[CA9ADB9E5C0BBA8D]) [ x:collection1] o.a.s.c.SolrCore [collection1] CLOSING SolrCore org.apache.solr.core.SolrCore@596eba99
[junit4] 2> 1141170 INFO (TEST-HardAutoCommitTest.testCommitWithin-seed#[CA9ADB9E5C0BBA8D]) [ x:collection1] o.a.s.m.SolrMetricManager Closing metric reporters for registry=solr.core.collection1, tag=1500428953
[junit4] 2> 1141180 INFO (searcherExecutor-4759-thread-1-processing-x:collection1) [ x:collection1] o.a.s.c.SolrCore [collection1] Registered new searcher Searcher@39c6cddd[collection1] main{ExitableDirectoryReader(UninvertingDirectoryReader())}
[junit4] 2> 1141181 INFO (TEST-HardAutoCommitTest.testCommitWithin-seed#[CA9ADB9E5C0BBA8D]) [ x:collection1] o.a.s.u.p.LogUpdateProcessorFactory [collection1] {add=[529 (1571853307005108224)]} 0 4
[junit4] 2> 1141182 INFO (TEST-HardAutoCommitTest.testCommitWithin-seed#[CA9ADB9E5C0BBA8D]) [ x:collection1] o.a.s.c.S.Request [collection1] webapp=null path=null params={q=id:529&qt=&start=0&rows=20&version=2.2} hits=0 status=0 QTime=0
[junit4] 2> 1141185 INFO (TEST-HardAutoCommitTest.testCommitWithin-seed#[CA9ADB9E5C0BBA8D]) [ x:collection1] o.a.s.u.p.LogUpdateProcessorFactory [collection1] {add=[530 (1571853307012448256)]} 0 7
[junit4] 2> 1141185 INFO (TEST-HardAutoCommitTest.testCommitWithin-seed#[CA9ADB9E5C0BBA8D]) [ x:collection1] o.a.s.c.S.Request [collection1] webapp=null path=null params={q=id:530&qt=&start=0&rows=20&version=2.2} hits=0 status=0 QTime=0
[junit4] 2> 1141185 INFO (TEST-HardAutoCommitTest.testCommitWithin-seed#[CA9ADB9E5C0BBA8D]) [ x:collection1] o.a.s.u.p.LogUpdateProcessorFactory [collection1] {delete=[529 (-1571853307013496832)]} 0 8
[junit4] 2> 1141186 INFO (TEST-HardAutoCommitTest.testCommitWithin-seed#[CA9ADB9E5C0BBA8D]) [ x:collection1] o.a.s.c.S.Request [collection1] webapp=null path=null params={q=id:529&qt=&start=0&rows=20&version=2.2} hits=0 status=0 QTime=0
[junit4] 2> 1141186 ERROR (TEST-HardAutoCommitTest.testCommitWithin-seed#[CA9ADB9E5C0BBA8D]) [ x:collection1] o.a.s.SolrTestCaseJ4 REQUEST FAILED: xpath=//result[@numFound=1]
[junit4] 2> xml response was: <?xml version="1.0" encoding="UTF-8"?>
[junit4] 2> <response>
[junit4] 2> <lst name="responseHeader"><int name="status">0</int><int name="QTime">0</int></lst><result name="response" numFound="0" start="0"></result>
[junit4] 2> </response>
[junit4] 2>
[junit4] 2> request was:q=id:529&qt=&start=0&rows=20&version=2.2
[junit4] 2> 1141186 ERROR (TEST-HardAutoCommitTest.testCommitWithin-seed#[CA9ADB9E5C0BBA8D]) [ x:collection1] o.a.s.SolrTestCaseJ4 REQUEST FAILED: q=id:529&qt=&start=0&rows=20&version=2.2:java.lang.RuntimeException: REQUEST FAILED: xpath=//result[@numFound=1]
[junit4] 2> xml response was: <?xml version="1.0" encoding="UTF-8"?>
[junit4] 2> <response>
[junit4] 2> <lst name="responseHeader"><int name="status">0</int><int name="QTime">0</int></lst><result name="response" numFound="0" start="0"></result>
[junit4] 2> </response>
[junit4] 2>
[junit4] 2> request was:q=id:529&qt=&start=0&rows=20&version=2.2
[junit4] 2> at org.apache.solr.SolrTestCaseJ4.assertQ(SolrTestCaseJ4.java:871)
[junit4] 2> at org.apache.solr.update.HardAutoCommitTest.testCommitWithin(HardAutoCommitTest.java:100)
[junit4] 2> at sun.reflect.NativeMethodAccessorImpl.invoke0(Native Method)
[junit4] 2> at sun.reflect.NativeMethodAccessorImpl.invoke(NativeMethodAccessorImpl.java:62)
[junit4] 2> at sun.reflect.DelegatingMethodAccessorImpl.invoke(DelegatingMethodAccessorImpl.java:43)
[junit4] 2> at java.lang.reflect.Method.invoke(Method.java:498)
[junit4] 2> at com.carrotsearch.randomizedtesting.RandomizedRunner.invoke(RandomizedRunner.java:1713)
[junit4] 2> at com.carrotsearch.randomizedtesting.RandomizedRunner$8.evaluate(RandomizedRunner.java:907)
[junit4] 2> at com.carrotsearch.randomizedtesting.RandomizedRunner$9.evaluate(RandomizedRunner.java:943)
[junit4] 2> at com.carrotsearch.randomizedtesting.RandomizedRunner$10.evaluate(RandomizedRunner.java:957)
[junit4] 2> at com.carrotsearch.randomizedtesting.rules.SystemPropertiesRestoreRule$1.evaluate(SystemPropertiesRestoreRule.java:57)
[junit4] 2> at org.apache.lucene.util.TestRuleSetupTeardownChained$1.evaluate(TestRuleSetupTeardownChained.java:49)
[junit4] 2> at org.apache.lucene.util.AbstractBeforeAfterRule$1.evaluate(AbstractBeforeAfterRule.java:45)
[junit4] 2> at org.apache.lucene.util.TestRuleThreadAndTestName$1.evaluate(TestRuleThreadAndTestName.java:48)
[junit4] 2> at org.apache.lucene.util.TestRuleIgnoreAfterMaxFailures$1.evaluate(TestRuleIgnoreAfterMaxFailures.java:64)
[junit4] 2> at org.apache.lucene.util.TestRuleMarkFailure$1.evaluate(TestRuleMarkFailure.java:47)
[junit4] 2> at com.carrotsearch.randomizedtesting.rules.StatementAdapter.evaluate(StatementAdapter.java:36)
[junit4] 2> at com.carrotsearch.randomizedtesting.ThreadLeakControl$StatementRunner.run(ThreadLeakControl.java:368)
[junit4] 2> at com.carrotsearch.randomizedtesting.ThreadLeakControl.forkTimeoutingTask(ThreadLeakControl.java:817)
[junit4] 2> at com.carrotsearch.randomizedtesting.ThreadLeakControl$3.evaluate(ThreadLeakControl.java:468)
[junit4] 2> at com.carrotsearch.randomizedtesting.RandomizedRunner.runSingleTest(RandomizedRunner.java:916)
[junit4] 2> at com.carrotsearch.randomizedtesting.RandomizedRunner$5.evaluate(RandomizedRunner.java:802)
[junit4] 2> at com.carrotsearch.randomizedtesting.RandomizedRunner$6.evaluate(RandomizedRunner.java:852)
[junit4] 2> at com.carrotsearch.randomizedtesting.RandomizedRunner$7.evaluate(RandomizedRunner.java:863)
[junit4] 2> at com.carrotsearch.randomizedtesting.rules.StatementAdapter.evaluate(StatementAdapter.java:36)
[junit4] 2> at com.carrotsearch.randomizedtesting.rules.SystemPropertiesRestoreRule$1.evaluate(SystemPropertiesRestoreRule.java:57)
[junit4] 2> at org.apache.lucene.util.AbstractBeforeAfterRule$1.evaluate(AbstractBeforeAfterRule.java:45)
[junit4] 2> at com.carrotsearch.randomizedtesting.rules.StatementAdapter.evaluate(StatementAdapter.java:36)
[junit4] 2> at org.apache.lucene.util.TestRuleStoreClassName$1.evaluate(TestRuleStoreClassName.java:41)
[junit4] 2> at com.carrotsearch.randomizedtesting.rules.NoShadowingOrOverridesOnMethodsRule$1.evaluate(NoShadowingOrOverridesOnMethodsRule.java:40)
[junit4] 2> at com.carrotsearch.randomizedtesting.rules.NoShadowingOrOverridesOnMethodsRule$1.evaluate(NoShadowingOrOverridesOnMethodsRule.java:40)
[junit4] 2> at com.carrotsearch.randomizedtesting.rules.StatementAdapter.evaluate(StatementAdapter.java:36)
[junit4] 2> at com.carrotsearch.randomizedtesting.rules.StatementAdapter.evaluate(StatementAdapter.java:36)
[junit4] 2> at com.carrotsearch.randomizedtesting.rules.StatementAdapter.evaluate(StatementAdapter.java:36)
[junit4] 2> at org.apache.lucene.util.TestRuleAssertionsRequired$1.evaluate(TestRuleAssertionsRequired.java:53)
[junit4] 2> at org.apache.lucene.util.TestRuleMarkFailure$1.evaluate(TestRuleMarkFailure.java:47)
[junit4] 2> at org.apache.lucene.util.TestRuleIgnoreAfterMaxFailures$1.evaluate(TestRuleIgnoreAfterMaxFailures.java:64)
[junit4] 2> at org.apache.lucene.util.TestRuleIgnoreTestSuites$1.evaluate(TestRuleIgnoreTestSuites.java:54)
[junit4] 2> at com.carrotsearch.randomizedtesting.rules.StatementAdapter.evaluate(StatementAdapter.java:36)
[junit4] 2> at com.carrotsearch.randomizedtesting.ThreadLeakControl$StatementRunner.run(ThreadLeakControl.java:368)
[junit4] 2> at java.lang.Thread.run(Thread.java:748)
[junit4] 2>
[junit4] 2> 1141187 INFO (TEST-HardAutoCommitTest.testCommitWithin-seed#[CA9ADB9E5C0BBA8D]) [ x:collection1] o.a.s.SolrTestCaseJ4 ###Ending testCommitWithin
[junit4] 2> NOTE: reproduce with: ant test -Dtestcase=HardAutoCommitTest -Dtests.method=testCommitWithin -Dtests.seed=CA9ADB9E5C0BBA8D -Dtests.multiplier=2 -Dtests.slow=true -Dtests.locale=id-ID -Dtests.timezone=Antarctica/Troll -Dtests.asserts=true -Dtests.file.encoding=ISO-8859-1
[junit4] ERROR 0.72s J2 | HardAutoCommitTest.testCommitWithin <<<
[junit4] > Throwable #1: java.lang.RuntimeException: Exception during query
[junit4] > at __randomizedtesting.SeedInfo.seed([CA9ADB9E5C0BBA8D:7048B4E6DF255498]:0)
[junit4] > at org.apache.solr.SolrTestCaseJ4.assertQ(SolrTestCaseJ4.java:878)
[junit4] > at org.apache.solr.update.HardAutoCommitTest.testCommitWithin(HardAutoCommitTest.java:100)
[junit4] > at java.lang.Thread.run(Thread.java:748)
[junit4] > Caused by: java.lang.RuntimeException: REQUEST FAILED: xpath=//result[@numFound=1]
[junit4] > xml response was: <?xml version="1.0" encoding="UTF-8"?>
[junit4] > <response>
[junit4] > <lst name="responseHeader"><int name="status">0</int><int name="QTime">0</int></lst><result name="response" numFound="0" start="0"></result>
[junit4] > </response>
[junit4] > request was:q=id:529&qt=&start=0&rows=20&version=2.2
[junit4] > at org.apache.solr.SolrTestCaseJ4.assertQ(SolrTestCaseJ4.java:871)
[junit4] > ... 40 more
[junit4] 2> 1141196 INFO (SUITE-HardAutoCommitTest-seed#[CA9ADB9E5C0BBA8D]-worker) [ x:collection1] o.a.s.SolrTestCaseJ4 ###deleteCore
[junit4] 2> 1141196 INFO (SUITE-HardAutoCommitTest-seed#[CA9ADB9E5C0BBA8D]-worker) [ x:collection1] o.a.s.c.CoreContainer Shutting down CoreContainer instance=15453608
[junit4] 2> 1141197 INFO (SUITE-HardAutoCommitTest-seed#[CA9ADB9E5C0BBA8D]-worker) [ x:collection1] o.a.s.m.SolrMetricManager Closing metric reporters for registry=solr.node, tag=null
[junit4] 2> 1141198 INFO (SUITE-HardAutoCommitTest-seed#[CA9ADB9E5C0BBA8D]-worker) [ x:collection1] o.a.s.m.SolrMetricManager Closing metric reporters for registry=solr.jvm, tag=null
[junit4] 2> 1141214 INFO (SUITE-HardAutoCommitTest-seed#[CA9ADB9E5C0BBA8D]-worker) [ x:collection1] o.a.s.m.SolrMetricManager Closing metric reporters for registry=solr.jetty, tag=null
[junit4] 2> 1141214 INFO (SUITE-HardAutoCommitTest-seed#[CA9ADB9E5C0BBA8D]-worker) [ x:collection1] o.a.s.c.TransientSolrCoreCacheDefault Allocating transient cache for 2147483647 transient cores
[junit4] 2> 1141214 INFO (coreCloseExecutor-4763-thread-1-processing-x:collection1) [ x:collection1] o.a.s.c.SolrCore [collection1] CLOSING SolrCore org.apache.solr.core.SolrCore@5b223846
[junit4] 2> 1141218 INFO (coreCloseExecutor-4763-thread-1-processing-x:collection1) [ x:collection1] o.a.s.u.DirectUpdateHandler2 Committing on IndexWriter close.
[junit4] 2> 1141218 INFO (coreCloseExecutor-4763-thread-1-processing-x:collection1) [ x:collection1] o.a.s.u.SolrIndexWriter Calling setCommitData with IW:org.apache.solr.update.SolrIndexWriter@680e2884 commitCommandVersion:0
[junit4] 2> 1141229 INFO (coreCloseExecutor-4763-thread-1-processing-x:collection1) [ x:collection1] o.a.s.m.SolrMetricManager Closing metric reporters for registry=solr.core.collection1, tag=1528969286
[junit4] 2> NOTE: leaving temporary files on disk at: /x1/jenkins/jenkins-slave/workspace/Lucene-Solr-Tests-master/solr/build/solr-core/test/J2/temp/solr.update.HardAutoCommitTest_CA9ADB9E5C0BBA8D-001
[junit4] 2> NOTE: test params are: codec=Asserting(Lucene70), sim=RandomSimilarity(queryNorm=true): {}, locale=id-ID, timezone=Antarctica/Troll
[junit4] 2> NOTE: Linux 3.13.0-88-generic amd64/Oracle Corporation 1.8.0_131 (64-bit)/cpus=4,threads=1,free=134636440,total=529530880
[junit4] 2> NOTE: All tests run in this JVM: [TestRecoveryHdfs, HdfsRestartWhileUpdatingTest, OverseerTest, TestManagedStopFilterFactory, TestClusterProperties, TestSolrConfigHandlerCloud, FullSolrCloudDistribCmdsTest, AtomicUpdatesTest, TestSolrCloudSnapshots, DeleteInactiveReplicaTest, TestDistributedMissingSort, AutoCommitTest, TestSurroundQueryParser, TestShortCircuitedRequests, TestClassicSimilarityFactory, SolrCloudExampleTest, TestPayloadCheckQParserPlugin, MetricsHandlerTest, InfixSuggestersTest, TestHdfsBackupRestoreCore, TolerantUpdateProcessorTest, DirectUpdateHandlerTest, TestPivotHelperCode, TestQueryUtils, ReturnFieldsTest, IgnoreCommitOptimizeUpdateProcessorFactoryTest, UninvertDocValuesMergePolicyTest, V2ApiIntegrationTest, ConnectionManagerTest, PrimitiveFieldTypeTest, TestMacroExpander, SmileWriterTest, DistribCursorPagingTest, DocumentBuilderTest, TestLegacyNumericRangeQueryBuilder, MinimalSchemaTest, TestSimpleTextCodec, TestSimpleQParserPlugin, SuggesterFSTTest, TestCollectionAPIs, SimplePostToolTest, HdfsTlogReplayBufferedWhileIndexingTest, TestPolicyCloud, TimeZoneUtilsTest, BasicDistributedZk2Test, SearchHandlerTest, TestIndexSearcher, ZkStateWriterTest, TestSubQueryTransformer, TestRebalanceLeaders, TestDistribIDF, TestNestedDocsSort, TestAnalyzeInfixSuggestions, TestSuggestSpellingConverter, ResponseHeaderTest, TestLMJelinekMercerSimilarityFactory, DateMathParserTest, TestAnalyzedSuggestions, URLClassifyProcessorTest, DistributedQueueTest, AddBlockUpdateTest, ResponseLogComponentTest, RestartWhileUpdatingTest, TestSchemaManager, TestFoldingMultitermQuery, MoveReplicaTest, TestTrie, ForceLeaderTest, TestExclusionRuleCollectionAccess, MultiTermTest, TestReversedWildcardFilterFactory, XsltUpdateRequestHandlerTest, TestExportWriter, TestLFUCache, DirectoryFactoryTest, OverseerModifyCollectionTest, DistributedQueryComponentOptimizationTest, TestFreeTextSuggestions, SpellPossibilityIteratorTest, TestFieldCacheReopen, TestLRUStatsCache, TestBulkSchemaAPI, RulesTest, OverseerTaskQueueTest, HdfsLockFactoryTest, TestCustomSort, TestConfigSetsAPIExclusivity, NotRequiredUniqueKeyTest, MetricUtilsTest, SolrSlf4jReporterTest, TestStressInPlaceUpdates, TestManagedSchemaAPI, TestReload, EnumFieldTest, QueryEqualityTest, SaslZkACLProviderTest, SortByFunctionTest, TestInPlaceUpdatesDistrib, TestDynamicFieldCollectionResource, TestDistributedStatsComponentCardinality, RegexBoostProcessorTest, TestMaxTokenLenTokenizer, TestCloudManagedSchema, SharedFSAutoReplicaFailoverUtilsTest, CopyFieldTest, TestMultiWordSynonyms, TestTolerantUpdateProcessorCloud, BaseCdcrDistributedZkTest, TestNumericTerms32, TestManagedResource, OutOfBoxZkACLAndCredentialsProvidersTest, RecoveryZkTest, TestRuleBasedAuthorizationPlugin, VersionInfoTest, TestPseudoReturnFields, BadIndexSchemaTest, TestDistributedGrouping, TestRecovery, TermVectorComponentDistributedTest, HardAutoCommitTest]
[junit4] Completed [379/724 (1!)] on J2 in 1.54s, 1 test, 1 error <<< FAILURES!
[...truncated 44442 lines...]