You are viewing a plain text version of this content. The canonical link for it is here.
Posted to builds@hbase.apache.org by Apache Jenkins Server <je...@builds.apache.org> on 2015/12/18 02:37:41 UTC

Build failed in Jenkins: HBase-1.3 » latest1.8,Hadoop #448

See <https://builds.apache.org/job/HBase-1.3/jdk=latest1.8,label=Hadoop/448/changes>

Changes:

[eclark] HBASE-14978 Don't allow Multi to retain too many blocks

------------------------------------------
[...truncated 42945 lines...]
5/5 KB   131/246 KB   112/281 KB   
5/5 KB   131/246 KB   116/281 KB   
5/5 KB   131/246 KB   120/281 KB   
5/5 KB   131/246 KB   124/281 KB   
5/5 KB   131/246 KB   128/281 KB   
5/5 KB   131/246 KB   132/281 KB   
5/5 KB   131/246 KB   136/281 KB   
5/5 KB   131/246 KB   140/281 KB   
5/5 KB   131/246 KB   144/281 KB   
5/5 KB   131/246 KB   148/281 KB   
5/5 KB   131/246 KB   152/281 KB   
5/5 KB   131/246 KB   156/281 KB   
5/5 KB   131/246 KB   160/281 KB   
5/5 KB   131/246 KB   164/281 KB   
5/5 KB   131/246 KB   168/281 KB   
5/5 KB   131/246 KB   172/281 KB   
5/5 KB   131/246 KB   176/281 KB   
5/5 KB   131/246 KB   180/281 KB   
5/5 KB   131/246 KB   184/281 KB   
5/5 KB   131/246 KB   188/281 KB   
5/5 KB   131/246 KB   192/281 KB   
5/5 KB   131/246 KB   196/281 KB   
5/5 KB   131/246 KB   200/281 KB   
5/5 KB   131/246 KB   204/281 KB   
5/5 KB   131/246 KB   208/281 KB   
5/5 KB   131/246 KB   212/281 KB   
5/5 KB   131/246 KB   216/281 KB   
5/5 KB   131/246 KB   220/281 KB   
5/5 KB   131/246 KB   224/281 KB   
5/5 KB   131/246 KB   228/281 KB   
5/5 KB   131/246 KB   232/281 KB   
                                   
Downloaded: http://repo.maven.apache.org/maven2/org/jamon/jamon-api/2.3.0/jamon-api-2.3.0.jar (5 KB at 33.5 KB/sec)
131/246 KB   236/281 KB            
131/246 KB   240/281 KB   
131/246 KB   244/281 KB   
131/246 KB   248/281 KB   
131/246 KB   252/281 KB   
131/246 KB   256/281 KB   
131/246 KB   260/281 KB   
131/246 KB   264/281 KB   
131/246 KB   268/281 KB   
131/246 KB   272/281 KB   
131/246 KB   276/281 KB   
131/246 KB   280/281 KB   
131/246 KB   281/281 KB   
135/246 KB   281/281 KB   
139/246 KB   281/281 KB   
143/246 KB   281/281 KB   
147/246 KB   281/281 KB   
151/246 KB   281/281 KB   
155/246 KB   281/281 KB   
159/246 KB   281/281 KB   
163/246 KB   281/281 KB   
167/246 KB   281/281 KB   
171/246 KB   281/281 KB   
175/246 KB   281/281 KB   
179/246 KB   281/281 KB   
183/246 KB   281/281 KB   
187/246 KB   281/281 KB   
191/246 KB   281/281 KB   
195/246 KB   281/281 KB   
199/246 KB   281/281 KB   
203/246 KB   281/281 KB   
207/246 KB   281/281 KB   
211/246 KB   281/281 KB   
215/246 KB   281/281 KB   
219/246 KB   281/281 KB   
223/246 KB   281/281 KB   
227/246 KB   281/281 KB   
231/246 KB   281/281 KB   
235/246 KB   281/281 KB   
239/246 KB   281/281 KB   
243/246 KB   281/281 KB   
                          
Downloaded: http://repo.maven.apache.org/maven2/org/jamon/jamon-processor/2.4.1/jamon-processor-2.4.1.jar (281 KB at 1594.2 KB/sec)
246/246 KB                
             
Downloaded: http://repo.maven.apache.org/maven2/org/codehaus/plexus/plexus-utils/1.5.5/plexus-utils-1.5.5.jar (246 KB at 1053.2 KB/sec)
[INFO] Translating 10 templates from <https://builds.apache.org/job/HBase-1.3/jdk=latest1.8,label=Hadoop/ws/hbase-server/src/main/jamon> to <https://builds.apache.org/job/HBase-1.3/jdk=latest1.8,label=Hadoop/ws/hbase-server/target/generated-jamon>
[INFO] 
[INFO] --- maven-antrun-plugin:1.6:run (generate) @ hbase-server ---
[INFO] Executing tasks

main:
    [mkdir] Created dir: <https://builds.apache.org/job/HBase-1.3/jdk=latest1.8,label=Hadoop/ws/hbase-server/target/hbase-webapps>
     [copy] Copying 20 files to <https://builds.apache.org/job/HBase-1.3/jdk=latest1.8,label=Hadoop/ws/hbase-server/target/hbase-webapps>
log4j:WARN No appenders could be found for logger (org.mortbay.log).
log4j:WARN Please initialize the log4j system properly.
log4j:WARN See http://logging.apache.org/log4j/1.2/faq.html#noconfig for more info.
    [mkdir] Created dir: <https://builds.apache.org/job/HBase-1.3/jdk=latest1.8,label=Hadoop/ws/hbase-server/target/hbase-webapps/master/WEB-INF>
    [mkdir] Created dir: <https://builds.apache.org/job/HBase-1.3/jdk=latest1.8,label=Hadoop/ws/hbase-server/target/hbase-webapps/regionserver/WEB-INF>
[INFO] Executed tasks
[INFO] 
[INFO] --- maven-remote-resources-plugin:1.5:process (default) @ hbase-server ---
[INFO] 
[INFO] --- maven-resources-plugin:2.6:resources (default-resources) @ hbase-server ---
[INFO] Using 'UTF-8' encoding to copy filtered resources.
[INFO] Copying 22 resources
[INFO] Copying 2 resources
[INFO] 
[INFO] --- maven-compiler-plugin:2.5.1:compile (default-compile) @ hbase-server ---
[INFO] Compiling 801 source files to <https://builds.apache.org/job/HBase-1.3/jdk=latest1.8,label=Hadoop/ws/hbase-server/target/classes>
[WARNING] <https://builds.apache.org/job/HBase-1.3/jdk=latest1.8,label=Hadoop/ws/hbase-server/src/main/java/org/apache/hadoop/hbase/regionserver/HRegionServer.java>:[191,15] Signal is internal proprietary API and may be removed in a future release
[WARNING] <https://builds.apache.org/job/HBase-1.3/jdk=latest1.8,label=Hadoop/ws/hbase-server/src/main/java/org/apache/hadoop/hbase/regionserver/HRegionServer.java>:[192,15] SignalHandler is internal proprietary API and may be removed in a future release
[WARNING] <https://builds.apache.org/job/HBase-1.3/jdk=latest1.8,label=Hadoop/ws/hbase-server/src/main/java/org/apache/hadoop/hbase/regionserver/HRegionServer.java>:[607,24] Signal is internal proprietary API and may be removed in a future release
[WARNING] <https://builds.apache.org/job/HBase-1.3/jdk=latest1.8,label=Hadoop/ws/hbase-server/src/main/java/org/apache/hadoop/hbase/regionserver/HRegionServer.java>:[607,43] SignalHandler is internal proprietary API and may be removed in a future release
[WARNING] <https://builds.apache.org/job/HBase-1.3/jdk=latest1.8,label=Hadoop/ws/hbase-server/src/main/java/org/apache/hadoop/hbase/regionserver/HRegionServer.java>:[608,27] Signal is internal proprietary API and may be removed in a future release
[WARNING] <https://builds.apache.org/job/HBase-1.3/jdk=latest1.8,label=Hadoop/ws/hbase-server/src/main/java/org/apache/hadoop/hbase/regionserver/HRegionServer.java>:[607,6] Signal is internal proprietary API and may be removed in a future release
[INFO] 
[INFO] --- maven-dependency-plugin:2.1:build-classpath (create-mrapp-generated-classpath) @ hbase-server ---
[INFO] Wrote classpath file '<https://builds.apache.org/job/HBase-1.3/jdk=latest1.8,label=Hadoop/ws/hbase-server/target/test-classes/mrapp-generated-classpath'.>
[INFO] 
[INFO] --- maven-resources-plugin:2.6:testResources (default-testResources) @ hbase-server ---
[INFO] Using 'UTF-8' encoding to copy filtered resources.
[INFO] Copying 1 resource to META-INF/
[INFO] Copying 16 resources
[INFO] 
[INFO] --- maven-compiler-plugin:2.5.1:testCompile (default-testCompile) @ hbase-server ---
[INFO] Compiling 741 source files to <https://builds.apache.org/job/HBase-1.3/jdk=latest1.8,label=Hadoop/ws/hbase-server/target/test-classes>
[INFO] -------------------------------------------------------------
[ERROR] COMPILATION ERROR : 
[INFO] -------------------------------------------------------------
[ERROR] <https://builds.apache.org/job/HBase-1.3/jdk=latest1.8,label=Hadoop/ws/hbase-server/src/test/java/org/apache/hadoop/hbase/client/TestMultiRespectsLimits.java>:[78,38] error: cannot find symbol
[ERROR]   symbol:   method getAdmin()
  location: variable TEST_UTIL of type HBaseTestingUtility
<https://builds.apache.org/job/HBase-1.3/jdk=latest1.8,label=Hadoop/ws/hbase-server/src/test/java/org/apache/hadoop/hbase/client/TestMultiRespectsLimits.java>:[142,38] error: cannot find symbol
[INFO] 2 errors 
[INFO] -------------------------------------------------------------
[INFO] ------------------------------------------------------------------------
[INFO] Reactor Summary:
[INFO] 
[INFO] Apache HBase ...................................... SUCCESS [1:31.930s]
[INFO] Apache HBase - Checkstyle ......................... SUCCESS [9.103s]
[INFO] Apache HBase - Resource Bundle .................... SUCCESS [0.918s]
[INFO] Apache HBase - Annotations ........................ SUCCESS [7.017s]
[INFO] Apache HBase - Protocol ........................... SUCCESS [1:21.070s]
[INFO] Apache HBase - Common ............................. SUCCESS [6:47.757s]
[INFO] Apache HBase - Procedure .......................... SUCCESS [8:12.200s]
[INFO] Apache HBase - Client ............................. SUCCESS [4:10.317s]
[INFO] Apache HBase - Hadoop Compatibility ............... SUCCESS [25.101s]
[INFO] Apache HBase - Hadoop Two Compatibility ........... SUCCESS [48.644s]
[INFO] Apache HBase - Prefix Tree ........................ SUCCESS [55.539s]
[INFO] Apache HBase - Server ............................. FAILURE [2:27.060s]
[INFO] Apache HBase - Testing Util ....................... SKIPPED
[INFO] Apache HBase - Thrift ............................. SKIPPED
[INFO] Apache HBase - Rest ............................... SKIPPED
[INFO] Apache HBase - Shell .............................. SKIPPED
[INFO] Apache HBase - Integration Tests .................. SKIPPED
[INFO] Apache HBase - Examples ........................... SKIPPED
[INFO] Apache HBase - External Block Cache ............... SKIPPED
[INFO] Apache HBase - Assembly ........................... SKIPPED
[INFO] Apache HBase - Shaded ............................. SKIPPED
[INFO] Apache HBase - Shaded - Client .................... SKIPPED
[INFO] Apache HBase - Shaded - Server .................... SKIPPED
[INFO] ------------------------------------------------------------------------
[INFO] BUILD FAILURE
[INFO] ------------------------------------------------------------------------
[INFO] Total time: 27:22.749s
[INFO] Finished at: Fri Dec 18 01:36:38 UTC 2015
[INFO] Final Memory: 121M/2659M
[INFO] ------------------------------------------------------------------------
[ERROR] Failed to execute goal org.apache.maven.plugins:maven-compiler-plugin:2.5.1:testCompile (default-testCompile) on project hbase-server: Compilation failure: Compilation failure:
[ERROR] <https://builds.apache.org/job/HBase-1.3/jdk=latest1.8,label=Hadoop/ws/hbase-server/src/test/java/org/apache/hadoop/hbase/client/TestMultiRespectsLimits.java>:[78,38] error: cannot find symbol
[ERROR] symbol:   method getAdmin()
[ERROR] location: variable TEST_UTIL of type HBaseTestingUtility
[ERROR] <https://builds.apache.org/job/HBase-1.3/jdk=latest1.8,label=Hadoop/ws/hbase-server/src/test/java/org/apache/hadoop/hbase/client/TestMultiRespectsLimits.java>:[142,38] error: cannot find symbol
[ERROR] -> [Help 1]
[ERROR] 
[ERROR] To see the full stack trace of the errors, re-run Maven with the -e switch.
[ERROR] Re-run Maven using the -X switch to enable full debug logging.
[ERROR] 
[ERROR] For more information about the errors and possible solutions, please read the following articles:
[ERROR] [Help 1] http://cwiki.apache.org/confluence/display/MAVEN/MojoFailureException
[ERROR] 
[ERROR] After correcting the problems, you can resume the build with the command
[ERROR]   mvn <goals> -rf :hbase-server
Build step 'Invoke top-level Maven targets' marked build as failure
Performing Post build task...
Match found for :.* : True
Logical operation result is TRUE
Running script  : # Post-build task script. TODO: Check this in and have all builds reference check-in.
pwd && ls
# NOTE!!!! The below code has been copied and pasted from ./dev-tools/run-test.sh
# Do not change here without syncing there and vice-versa.
ZOMBIE_TESTS_COUNT=`jps -v | grep surefirebooter | grep -e '-Dhbase.test' | wc -l`
if [[ $ZOMBIE_TESTS_COUNT != 0 ]] ; then
 echo "Suspicious java process found - waiting 30s to see if there are just slow to stop"
 sleep 30
 ZOMBIE_TESTS_COUNT=`jps -v | grep surefirebooter | grep -e '-Dhbase.test' | wc -l`
 if [[ $ZOMBIE_TESTS_COUNT != 0 ]] ; then
   echo " {color:red}There appear to be $ZOMBIE_TESTS_COUNT zombie tests{color}, they should have been killed by surefire but survived"
   jps -v | grep surefirebooter | grep -e '-Dhbase.test'
   jps -v | grep surefirebooter | grep -e '-Dhbase.test' | cut -d ' ' -f 1 | xargs -n 1 jstack
   # Exit with error
   exit 1
 else
   echo "We're ok: there is no zombie test, but some tests took some time to stop"
 fi
else
  echo "We're ok: there is no zombie test"
fi
[Hadoop] $ /bin/bash -xe /tmp/hudson9060262856235786200.sh
+ pwd
<https://builds.apache.org/job/HBase-1.3/jdk=latest1.8,label=Hadoop/ws/>
+ ls
bin
CHANGES.txt
conf
dev-support
hbase-annotations
hbase-assembly
hbase-checkstyle
hbase-client
hbase-common
hbase-examples
hbase-external-blockcache
hbase-hadoop2-compat
hbase-hadoop-compat
hbase-it
hbase-native-client
hbase-prefix-tree
hbase-procedure
hbase-protocol
hbase-resource-bundle
hbase-rest
hbase-server
hbase-shaded
hbase-shell
hbase-testing-util
hbase-thrift
LICENSE.txt
NOTICE.txt
pom.xml
README.txt
src
target
++ wc -l
++ grep -e -Dhbase.test
++ jps -v
++ grep surefirebooter
+ ZOMBIE_TESTS_COUNT=0
+ [[ 0 != 0 ]]
+ echo 'We'\''re ok: there is no zombie test'
We're ok: there is no zombie test
POST BUILD TASK : SUCCESS
END OF POST BUILD TASK : 0
Archiving artifacts
Recording test results

Jenkins build is back to normal : HBase-1.3 » latest1.8,Hadoop #449

Posted by Apache Jenkins Server <je...@builds.apache.org>.
See <https://builds.apache.org/job/HBase-1.3/jdk=latest1.8,label=Hadoop/449/changes>