You are viewing a plain text version of this content. The canonical link for it is here.
Posted to dev@pdfbox.apache.org by Apache Jenkins Server <je...@builds.apache.org> on 2017/08/10 16:17:38 UTC
Build failed in Jenkins: PDFBox-Trunk-jdk9 #4
See <https://builds.apache.org/job/PDFBox-Trunk-jdk9/4/display/redirect>
------------------------------------------
[...truncated 183.92 KB...]
at org.tmatesoft.svn.core.internal.wc2.ng.SvnNgOperationRunner.run(SvnNgOperationRunner.java:20)
at org.tmatesoft.svn.core.internal.wc2.SvnOperationRunner.run(SvnOperationRunner.java:21)
at org.tmatesoft.svn.core.wc2.SvnOperationFactory.run(SvnOperationFactory.java:1235)
at org.tmatesoft.svn.core.wc2.SvnOperation.run(SvnOperation.java:294)
at org.tmatesoft.svn.core.wc.SVNUpdateClient.doUpdate(SVNUpdateClient.java:311)
at org.tmatesoft.svn.core.wc.SVNUpdateClient.doUpdate(SVNUpdateClient.java:291)
at org.tmatesoft.svn.core.wc.SVNUpdateClient.doUpdate(SVNUpdateClient.java:387)
at hudson.scm.subversion.UpdateUpdater$TaskImpl.perform(UpdateUpdater.java:158)
Caused: hudson.scm.subversion.UpdaterException: failed to perform svn update
at hudson.scm.subversion.UpdateUpdater$TaskImpl.perform(UpdateUpdater.java:212)
at hudson.scm.subversion.WorkspaceUpdater$UpdateTask.delegateTo(WorkspaceUpdater.java:162)
at hudson.scm.SubversionSCM$CheckOutTask.perform(SubversionSCM.java:1001)
at hudson.scm.SubversionSCM$CheckOutTask.invoke(SubversionSCM.java:977)
at hudson.scm.SubversionSCM$CheckOutTask.invoke(SubversionSCM.java:953)
at hudson.FilePath$FileCallableWrapper.call(FilePath.java:2739)
at hudson.remoting.UserRequest.perform(UserRequest.java:153)
at hudson.remoting.UserRequest.perform(UserRequest.java:50)
at hudson.remoting.Request$2.run(Request.java:336)
at hudson.remoting.InterceptingExecutorService$1.call(InterceptingExecutorService.java:68)
at java.util.concurrent.FutureTask.run(FutureTask.java:266)
at java.util.concurrent.ThreadPoolExecutor.runWorker(ThreadPoolExecutor.java:1142)
at java.util.concurrent.ThreadPoolExecutor$Worker.run(ThreadPoolExecutor.java:617)
at java.lang.Thread.run(Thread.java:748)
Caused: java.io.IOException
at hudson.scm.subversion.UpdateUpdater$TaskImpl.perform(UpdateUpdater.java:212)
at hudson.scm.subversion.WorkspaceUpdater$UpdateTask.delegateTo(WorkspaceUpdater.java:162)
at hudson.scm.SubversionSCM$CheckOutTask.perform(SubversionSCM.java:1001)
at hudson.scm.SubversionSCM$CheckOutTask.invoke(SubversionSCM.java:977)
at hudson.scm.SubversionSCM$CheckOutTask.invoke(SubversionSCM.java:953)
at hudson.FilePath$FileCallableWrapper.call(FilePath.java:2739)
at hudson.remoting.UserRequest.perform(UserRequest.java:153)
at hudson.remoting.UserRequest.perform(UserRequest.java:50)
at hudson.remoting.Request$2.run(Request.java:336)
at hudson.remoting.InterceptingExecutorService$1.call(InterceptingExecutorService.java:68)
at java.util.concurrent.FutureTask.run(FutureTask.java:266)
at java.util.concurrent.ThreadPoolExecutor.runWorker(ThreadPoolExecutor.java:1142)
at java.util.concurrent.ThreadPoolExecutor$Worker.run(ThreadPoolExecutor.java:617)
at java.lang.Thread.run(Thread.java:748)
at ......remote call to H21(Native Method)
at hudson.remoting.Channel.attachCallSiteStackTrace(Channel.java:1545)
at hudson.remoting.UserResponse.retrieve(UserRequest.java:253)
at hudson.remoting.Channel.call(Channel.java:830)
at hudson.FilePath.act(FilePath.java:986)
Caused: java.io.IOException: remote file operation failed: <https://builds.apache.org/job/PDFBox-Trunk-jdk9/ws/> at hudson.remoting.Channel@4b715ff3:H21
at hudson.FilePath.act(FilePath.java:993)
at hudson.FilePath.act(FilePath.java:975)
at hudson.scm.SubversionSCM.checkout(SubversionSCM.java:902)
at hudson.scm.SubversionSCM.checkout(SubversionSCM.java:838)
at hudson.scm.SCM.checkout(SCM.java:495)
at hudson.model.AbstractProject.checkout(AbstractProject.java:1276)
at hudson.model.AbstractBuild$AbstractBuildExecution.defaultCheckout(AbstractBuild.java:560)
at jenkins.scm.SCMCheckoutStrategy.checkout(SCMCheckoutStrategy.java:86)
at hudson.model.AbstractBuild$AbstractBuildExecution.run(AbstractBuild.java:485)
at hudson.model.Run.execute(Run.java:1735)
at hudson.maven.MavenModuleSetBuild.run(MavenModuleSetBuild.java:542)
at hudson.model.ResourceController.execute(ResourceController.java:97)
at hudson.model.Executor.run(Executor.java:405)
Retrying after 10 seconds
Cleaning up <https://builds.apache.org/job/PDFBox-Trunk-jdk9/ws/trunk>
Updating http://svn.apache.org/repos/asf/pdfbox/trunk at revision '2017-08-10T16:16:56.887 +0000'
ERROR: Failed to update http://svn.apache.org/repos/asf/pdfbox/trunk
org.tmatesoft.svn.core.SVNException: svn: E200030: java.io.IOException: Permission denied
at org.tmatesoft.svn.core.internal.wc.SVNErrorManager.error(SVNErrorManager.java:70)
at org.tmatesoft.svn.core.internal.wc.SVNErrorManager.error(SVNErrorManager.java:57)
at org.tmatesoft.svn.core.internal.io.dav.http.HTTPConnection.request(HTTPConnection.java:798)
at org.tmatesoft.svn.core.internal.io.dav.http.HTTPConnection.request(HTTPConnection.java:391)
at org.tmatesoft.svn.core.internal.io.dav.http.HTTPConnection.request(HTTPConnection.java:379)
at org.tmatesoft.svn.core.internal.io.dav.DAVConnection.performHttpRequest(DAVConnection.java:862)
at org.tmatesoft.svn.core.internal.io.dav.DAVConnection.doReport(DAVConnection.java:359)
at org.tmatesoft.svn.core.internal.io.dav.DAVRepository.runReport(DAVRepository.java:1341)
at org.tmatesoft.svn.core.internal.io.dav.DAVRepository.update(DAVRepository.java:868)
at org.tmatesoft.svn.core.internal.wc2.ng.SvnNgAbstractUpdate.updateInternal(SvnNgAbstractUpdate.java:247)
at org.tmatesoft.svn.core.internal.wc2.ng.SvnNgAbstractUpdate.update(SvnNgAbstractUpdate.java:111)
at org.tmatesoft.svn.core.internal.wc2.ng.SvnNgUpdate.run(SvnNgUpdate.java:40)
at org.tmatesoft.svn.core.internal.wc2.ng.SvnNgUpdate.run(SvnNgUpdate.java:18)
at org.tmatesoft.svn.core.internal.wc2.ng.SvnNgOperationRunner.run(SvnNgOperationRunner.java:20)
at org.tmatesoft.svn.core.internal.wc2.SvnOperationRunner.run(SvnOperationRunner.java:21)
at org.tmatesoft.svn.core.wc2.SvnOperationFactory.run(SvnOperationFactory.java:1235)
at org.tmatesoft.svn.core.wc2.SvnOperation.run(SvnOperation.java:294)
at org.tmatesoft.svn.core.wc.SVNUpdateClient.doUpdate(SVNUpdateClient.java:311)
at org.tmatesoft.svn.core.wc.SVNUpdateClient.doUpdate(SVNUpdateClient.java:291)
at org.tmatesoft.svn.core.wc.SVNUpdateClient.doUpdate(SVNUpdateClient.java:387)
at hudson.scm.subversion.UpdateUpdater$TaskImpl.perform(UpdateUpdater.java:158)
at hudson.scm.subversion.WorkspaceUpdater$UpdateTask.delegateTo(WorkspaceUpdater.java:162)
at hudson.scm.SubversionSCM$CheckOutTask.perform(SubversionSCM.java:1001)
at hudson.scm.SubversionSCM$CheckOutTask.invoke(SubversionSCM.java:977)
at hudson.scm.SubversionSCM$CheckOutTask.invoke(SubversionSCM.java:953)
at hudson.FilePath$FileCallableWrapper.call(FilePath.java:2739)
at hudson.remoting.UserRequest.perform(UserRequest.java:153)
at hudson.remoting.UserRequest.perform(UserRequest.java:50)
at hudson.remoting.Request$2.run(Request.java:336)
at hudson.remoting.InterceptingExecutorService$1.call(InterceptingExecutorService.java:68)
at java.util.concurrent.FutureTask.run(FutureTask.java:266)
at java.util.concurrent.ThreadPoolExecutor.runWorker(ThreadPoolExecutor.java:1142)
at java.util.concurrent.ThreadPoolExecutor$Worker.run(ThreadPoolExecutor.java:617)
at java.lang.Thread.run(Thread.java:748)
Caused by: org.tmatesoft.sqljet.core.SqlJetException: java.io.IOException: Permission denied: error code is CANTOPEN
at org.tmatesoft.sqljet.core.table.SqlJetDb.getTemporaryDatabaseFile(SqlJetDb.java:484)
at org.tmatesoft.sqljet.core.table.SqlJetDb.access$1400(SqlJetDb.java:63)
at org.tmatesoft.sqljet.core.table.SqlJetDb$15.runWithLock(SqlJetDb.java:449)
at org.tmatesoft.sqljet.core.table.SqlJetDb$1.runSynchronized(SqlJetDb.java:172)
at org.tmatesoft.sqljet.core.table.engine.SqlJetEngine.runSynchronized(SqlJetEngine.java:217)
at org.tmatesoft.sqljet.core.table.SqlJetDb.runWithLock(SqlJetDb.java:170)
at org.tmatesoft.sqljet.core.table.SqlJetDb.getTemporaryDatabase(SqlJetDb.java:445)
at org.tmatesoft.svn.core.internal.db.SVNSqlJetDb.getTemporaryDb(SVNSqlJetDb.java:132)
at org.tmatesoft.svn.core.internal.wc17.db.SVNWCDb$BumpRevisionPostUpdate.bumpMovedAway(SVNWCDb.java:5419)
at org.tmatesoft.svn.core.internal.wc17.db.SVNWCDb$BumpRevisionPostUpdate.transaction(SVNWCDb.java:5414)
at org.tmatesoft.svn.core.internal.db.SVNSqlJetDb.runTransaction(SVNSqlJetDb.java:258)
at org.tmatesoft.svn.core.internal.db.SVNSqlJetDb.runTransaction(SVNSqlJetDb.java:252)
at org.tmatesoft.svn.core.internal.wc17.db.SVNWCDb.opBumpRevisionPostUpdate(SVNWCDb.java:5366)
at org.tmatesoft.svn.core.internal.wc17.SVNUpdateEditor17.closeEdit(SVNUpdateEditor17.java:1728)
at org.tmatesoft.svn.core.internal.wc.SVNCancellableEditor.closeEdit(SVNCancellableEditor.java:148)
at org.tmatesoft.svn.core.internal.io.dav.handlers.DAVEditorHandler.endElement(DAVEditorHandler.java:492)
at org.tmatesoft.svn.core.internal.io.dav.handlers.BasicDAVHandler.endElement(BasicDAVHandler.java:103)
at com.sun.org.apache.xerces.internal.parsers.AbstractSAXParser.endElement(AbstractSAXParser.java:609)
at com.sun.org.apache.xerces.internal.impl.XMLDocumentFragmentScannerImpl.scanEndElement(XMLDocumentFragmentScannerImpl.java:1782)
at com.sun.org.apache.xerces.internal.impl.XMLDocumentFragmentScannerImpl$FragmentContentDriver.next(XMLDocumentFragmentScannerImpl.java:2967)
at com.sun.org.apache.xerces.internal.impl.XMLDocumentScannerImpl.next(XMLDocumentScannerImpl.java:602)
at com.sun.org.apache.xerces.internal.impl.XMLNSDocumentScannerImpl.next(XMLNSDocumentScannerImpl.java:112)
at com.sun.org.apache.xerces.internal.impl.XMLDocumentFragmentScannerImpl.scanDocument(XMLDocumentFragmentScannerImpl.java:505)
at com.sun.org.apache.xerces.internal.parsers.XML11Configuration.parse(XML11Configuration.java:841)
at com.sun.org.apache.xerces.internal.parsers.XML11Configuration.parse(XML11Configuration.java:770)
at com.sun.org.apache.xerces.internal.parsers.XMLParser.parse(XMLParser.java:141)
at com.sun.org.apache.xerces.internal.parsers.AbstractSAXParser.parse(AbstractSAXParser.java:1213)
at com.sun.org.apache.xerces.internal.jaxp.SAXParserImpl$JAXPSAXParser.parse(SAXParserImpl.java:643)
at org.tmatesoft.svn.core.internal.io.dav.http.HTTPConnection.readData(HTTPConnection.java:937)
at org.tmatesoft.svn.core.internal.io.dav.http.HTTPConnection.readData(HTTPConnection.java:902)
at org.tmatesoft.svn.core.internal.io.dav.http.HTTPRequest.dispatch(HTTPRequest.java:220)
at org.tmatesoft.svn.core.internal.io.dav.http.HTTPConnection.request(HTTPConnection.java:490)
... 31 more
Caused by: java.io.IOException: Permission denied
at java.io.UnixFileSystem.createFileExclusively(Native Method)
at java.io.File.createTempFile(File.java:2024)
at java.io.File.createTempFile(File.java:2070)
at org.tmatesoft.sqljet.core.internal.fs.SqlJetFileSystem.getTempFile(SqlJetFileSystem.java:202)
at org.tmatesoft.sqljet.core.table.SqlJetDb.getTemporaryDatabaseFile(SqlJetDb.java:482)
... 62 more
ERROR: Subversion update failed
java.io.IOException: Permission denied
at java.io.UnixFileSystem.createFileExclusively(Native Method)
at java.io.File.createTempFile(File.java:2024)
at java.io.File.createTempFile(File.java:2070)
at org.tmatesoft.sqljet.core.internal.fs.SqlJetFileSystem.getTempFile(SqlJetFileSystem.java:202)
at org.tmatesoft.sqljet.core.table.SqlJetDb.getTemporaryDatabaseFile(SqlJetDb.java:482)
Caused: org.tmatesoft.sqljet.core.SqlJetException: java.io.IOException: Permission denied: error code is CANTOPEN
at org.tmatesoft.sqljet.core.table.SqlJetDb.getTemporaryDatabaseFile(SqlJetDb.java:484)
at org.tmatesoft.sqljet.core.table.SqlJetDb.access$1400(SqlJetDb.java:63)
at org.tmatesoft.sqljet.core.table.SqlJetDb$15.runWithLock(SqlJetDb.java:449)
at org.tmatesoft.sqljet.core.table.SqlJetDb$1.runSynchronized(SqlJetDb.java:172)
at org.tmatesoft.sqljet.core.table.engine.SqlJetEngine.runSynchronized(SqlJetEngine.java:217)
at org.tmatesoft.sqljet.core.table.SqlJetDb.runWithLock(SqlJetDb.java:170)
at org.tmatesoft.sqljet.core.table.SqlJetDb.getTemporaryDatabase(SqlJetDb.java:445)
at org.tmatesoft.svn.core.internal.db.SVNSqlJetDb.getTemporaryDb(SVNSqlJetDb.java:132)
at org.tmatesoft.svn.core.internal.wc17.db.SVNWCDb$BumpRevisionPostUpdate.bumpMovedAway(SVNWCDb.java:5419)
at org.tmatesoft.svn.core.internal.wc17.db.SVNWCDb$BumpRevisionPostUpdate.transaction(SVNWCDb.java:5414)
at org.tmatesoft.svn.core.internal.db.SVNSqlJetDb.runTransaction(SVNSqlJetDb.java:258)
at org.tmatesoft.svn.core.internal.db.SVNSqlJetDb.runTransaction(SVNSqlJetDb.java:252)
at org.tmatesoft.svn.core.internal.wc17.db.SVNWCDb.opBumpRevisionPostUpdate(SVNWCDb.java:5366)
at org.tmatesoft.svn.core.internal.wc17.SVNUpdateEditor17.closeEdit(SVNUpdateEditor17.java:1728)
at org.tmatesoft.svn.core.internal.wc.SVNCancellableEditor.closeEdit(SVNCancellableEditor.java:148)
at org.tmatesoft.svn.core.internal.io.dav.handlers.DAVEditorHandler.endElement(DAVEditorHandler.java:492)
at org.tmatesoft.svn.core.internal.io.dav.handlers.BasicDAVHandler.endElement(BasicDAVHandler.java:103)
at com.sun.org.apache.xerces.internal.parsers.AbstractSAXParser.endElement(AbstractSAXParser.java:609)
at com.sun.org.apache.xerces.internal.impl.XMLDocumentFragmentScannerImpl.scanEndElement(XMLDocumentFragmentScannerImpl.java:1782)
at com.sun.org.apache.xerces.internal.impl.XMLDocumentFragmentScannerImpl$FragmentContentDriver.next(XMLDocumentFragmentScannerImpl.java:2967)
at com.sun.org.apache.xerces.internal.impl.XMLDocumentScannerImpl.next(XMLDocumentScannerImpl.java:602)
at com.sun.org.apache.xerces.internal.impl.XMLNSDocumentScannerImpl.next(XMLNSDocumentScannerImpl.java:112)
at com.sun.org.apache.xerces.internal.impl.XMLDocumentFragmentScannerImpl.scanDocument(XMLDocumentFragmentScannerImpl.java:505)
at com.sun.org.apache.xerces.internal.parsers.XML11Configuration.parse(XML11Configuration.java:841)
at com.sun.org.apache.xerces.internal.parsers.XML11Configuration.parse(XML11Configuration.java:770)
at com.sun.org.apache.xerces.internal.parsers.XMLParser.parse(XMLParser.java:141)
at com.sun.org.apache.xerces.internal.parsers.AbstractSAXParser.parse(AbstractSAXParser.java:1213)
at com.sun.org.apache.xerces.internal.jaxp.SAXParserImpl$JAXPSAXParser.parse(SAXParserImpl.java:643)
at org.tmatesoft.svn.core.internal.io.dav.http.HTTPConnection.readData(HTTPConnection.java:937)
at org.tmatesoft.svn.core.internal.io.dav.http.HTTPConnection.readData(HTTPConnection.java:902)
at org.tmatesoft.svn.core.internal.io.dav.http.HTTPRequest.dispatch(HTTPRequest.java:220)
at org.tmatesoft.svn.core.internal.io.dav.http.HTTPConnection.request(HTTPConnection.java:490)
Caused: org.tmatesoft.svn.core.SVNException: svn: E200030: java.io.IOException: Permission denied
at org.tmatesoft.svn.core.internal.wc.SVNErrorManager.error(SVNErrorManager.java:70)
at org.tmatesoft.svn.core.internal.wc.SVNErrorManager.error(SVNErrorManager.java:57)
at org.tmatesoft.svn.core.internal.io.dav.http.HTTPConnection.request(HTTPConnection.java:798)
at org.tmatesoft.svn.core.internal.io.dav.http.HTTPConnection.request(HTTPConnection.java:391)
at org.tmatesoft.svn.core.internal.io.dav.http.HTTPConnection.request(HTTPConnection.java:379)
at org.tmatesoft.svn.core.internal.io.dav.DAVConnection.performHttpRequest(DAVConnection.java:862)
at org.tmatesoft.svn.core.internal.io.dav.DAVConnection.doReport(DAVConnection.java:359)
at org.tmatesoft.svn.core.internal.io.dav.DAVRepository.runReport(DAVRepository.java:1341)
at org.tmatesoft.svn.core.internal.io.dav.DAVRepository.update(DAVRepository.java:868)
at org.tmatesoft.svn.core.internal.wc2.ng.SvnNgAbstractUpdate.updateInternal(SvnNgAbstractUpdate.java:247)
at org.tmatesoft.svn.core.internal.wc2.ng.SvnNgAbstractUpdate.update(SvnNgAbstractUpdate.java:111)
at org.tmatesoft.svn.core.internal.wc2.ng.SvnNgUpdate.run(SvnNgUpdate.java:40)
at org.tmatesoft.svn.core.internal.wc2.ng.SvnNgUpdate.run(SvnNgUpdate.java:18)
at org.tmatesoft.svn.core.internal.wc2.ng.SvnNgOperationRunner.run(SvnNgOperationRunner.java:20)
at org.tmatesoft.svn.core.internal.wc2.SvnOperationRunner.run(SvnOperationRunner.java:21)
at org.tmatesoft.svn.core.wc2.SvnOperationFactory.run(SvnOperationFactory.java:1235)
at org.tmatesoft.svn.core.wc2.SvnOperation.run(SvnOperation.java:294)
at org.tmatesoft.svn.core.wc.SVNUpdateClient.doUpdate(SVNUpdateClient.java:311)
at org.tmatesoft.svn.core.wc.SVNUpdateClient.doUpdate(SVNUpdateClient.java:291)
at org.tmatesoft.svn.core.wc.SVNUpdateClient.doUpdate(SVNUpdateClient.java:387)
at hudson.scm.subversion.UpdateUpdater$TaskImpl.perform(UpdateUpdater.java:158)
Caused: hudson.scm.subversion.UpdaterException: failed to perform svn update
at hudson.scm.subversion.UpdateUpdater$TaskImpl.perform(UpdateUpdater.java:212)
at hudson.scm.subversion.WorkspaceUpdater$UpdateTask.delegateTo(WorkspaceUpdater.java:162)
at hudson.scm.SubversionSCM$CheckOutTask.perform(SubversionSCM.java:1001)
at hudson.scm.SubversionSCM$CheckOutTask.invoke(SubversionSCM.java:977)
at hudson.scm.SubversionSCM$CheckOutTask.invoke(SubversionSCM.java:953)
at hudson.FilePath$FileCallableWrapper.call(FilePath.java:2739)
at hudson.remoting.UserRequest.perform(UserRequest.java:153)
at hudson.remoting.UserRequest.perform(UserRequest.java:50)
at hudson.remoting.Request$2.run(Request.java:336)
at hudson.remoting.InterceptingExecutorService$1.call(InterceptingExecutorService.java:68)
at java.util.concurrent.FutureTask.run(FutureTask.java:266)
at java.util.concurrent.ThreadPoolExecutor.runWorker(ThreadPoolExecutor.java:1142)
at java.util.concurrent.ThreadPoolExecutor$Worker.run(ThreadPoolExecutor.java:617)
at java.lang.Thread.run(Thread.java:748)
Caused: java.io.IOException
at hudson.scm.subversion.UpdateUpdater$TaskImpl.perform(UpdateUpdater.java:212)
at hudson.scm.subversion.WorkspaceUpdater$UpdateTask.delegateTo(WorkspaceUpdater.java:162)
at hudson.scm.SubversionSCM$CheckOutTask.perform(SubversionSCM.java:1001)
at hudson.scm.SubversionSCM$CheckOutTask.invoke(SubversionSCM.java:977)
at hudson.scm.SubversionSCM$CheckOutTask.invoke(SubversionSCM.java:953)
at hudson.FilePath$FileCallableWrapper.call(FilePath.java:2739)
at hudson.remoting.UserRequest.perform(UserRequest.java:153)
at hudson.remoting.UserRequest.perform(UserRequest.java:50)
at hudson.remoting.Request$2.run(Request.java:336)
at hudson.remoting.InterceptingExecutorService$1.call(InterceptingExecutorService.java:68)
at java.util.concurrent.FutureTask.run(FutureTask.java:266)
at java.util.concurrent.ThreadPoolExecutor.runWorker(ThreadPoolExecutor.java:1142)
at java.util.concurrent.ThreadPoolExecutor$Worker.run(ThreadPoolExecutor.java:617)
at java.lang.Thread.run(Thread.java:748)
at ......remote call to H21(Native Method)
at hudson.remoting.Channel.attachCallSiteStackTrace(Channel.java:1545)
at hudson.remoting.UserResponse.retrieve(UserRequest.java:253)
at hudson.remoting.Channel.call(Channel.java:830)
at hudson.FilePath.act(FilePath.java:986)
Caused: java.io.IOException: remote file operation failed: <https://builds.apache.org/job/PDFBox-Trunk-jdk9/ws/> at hudson.remoting.Channel@4b715ff3:H21
at hudson.FilePath.act(FilePath.java:993)
at hudson.FilePath.act(FilePath.java:975)
at hudson.scm.SubversionSCM.checkout(SubversionSCM.java:902)
at hudson.scm.SubversionSCM.checkout(SubversionSCM.java:838)
at hudson.scm.SCM.checkout(SCM.java:495)
at hudson.model.AbstractProject.checkout(AbstractProject.java:1276)
at hudson.model.AbstractBuild$AbstractBuildExecution.defaultCheckout(AbstractBuild.java:560)
at jenkins.scm.SCMCheckoutStrategy.checkout(SCMCheckoutStrategy.java:86)
at hudson.model.AbstractBuild$AbstractBuildExecution.run(AbstractBuild.java:485)
at hudson.model.Run.execute(Run.java:1735)
at hudson.maven.MavenModuleSetBuild.run(MavenModuleSetBuild.java:542)
at hudson.model.ResourceController.execute(ResourceController.java:97)
at hudson.model.Executor.run(Executor.java:405)
Archiving artifacts
---------------------------------------------------------------------
To unsubscribe, e-mail: dev-unsubscribe@pdfbox.apache.org
For additional commands, e-mail: dev-help@pdfbox.apache.org
Build failed in Jenkins: PDFBox-Trunk-jdk9 #14
Posted by Apache Jenkins Server <je...@builds.apache.org>.
See <https://builds.apache.org/job/PDFBox-Trunk-jdk9/14/display/redirect>
------------------------------------------
[...truncated 153.98 KB...]
A tools/src/main/java/org/apache/pdfbox/tools/imageio/TIFFUtil.java
A tools/src/main/java/org/apache/pdfbox/tools/imageio/ImageIOUtil.java
A tools/src/main/java/org/apache/pdfbox/tools/DecompressObjectstreams.java
AU tools/src/main/java/org/apache/pdfbox/tools/ImportFDF.java
A tools/src/test
A tools/src/test/java
A tools/src/test/java/org
A tools/src/test/java/org/apache
A tools/src/test/java/org/apache/pdfbox
A tools/src/test/java/org/apache/pdfbox/tools
A tools/src/test/java/org/apache/pdfbox/tools/TestExtractText.java
A tools/src/test/java/org/apache/pdfbox/tools/TestTextToPdf.java
A tools/src/test/java/org/apache/pdfbox/tools/TestPDFText2HTML.java
A tools/src/test/java/org/apache/pdfbox/tools/imageio
A tools/src/test/java/org/apache/pdfbox/tools/imageio/TestImageIOUtils.java
A tools/src/test/resources
A tools/src/test/resources/input
A tools/src/test/resources/input/ImageIOUtil
AU tools/src/test/resources/input/ImageIOUtil/JPXTestCMYK.pdf
AU tools/src/test/resources/input/ImageIOUtil/JPXTestGrey.pdf
AU tools/src/test/resources/input/ImageIOUtil/png_demo.pdf
AU tools/src/test/resources/input/ImageIOUtil/jpeg_demo.pdf
AU tools/src/test/resources/input/ImageIOUtil/JPXTestRGB.pdf
AU tools/src/test/resources/input/ImageIOUtil/raw_image_demo.pdf
AU tools/src/test/resources/input/ImageIOUtil/JBIG2Image.pdf
AU tools/src/test/resources/input/ImageIOUtil/ccitt4-cib-test.pdf
A tools/src/test/resources/logging.properties
A tools/src/test/resources/org
A tools/src/test/resources/org/apache
A tools/src/test/resources/org/apache/pdfbox
AU tools/src/test/resources/org/apache/pdfbox/testPDFPackage.pdf
AU tools/pom.xml
AU LICENSE.txt
A preflight-app
A preflight-app/src
A preflight-app/src/main
A preflight-app/src/main/appended-resources
A preflight-app/src/main/appended-resources/META-INF
AU preflight-app/src/main/appended-resources/META-INF/NOTICE
AU preflight-app/src/main/appended-resources/META-INF/LICENSE
AU preflight-app/pom.xml
A debugger-app
A debugger-app/src
A debugger-app/src/main
A debugger-app/src/main/appended-resources
A debugger-app/src/main/appended-resources/META-INF
AU debugger-app/src/main/appended-resources/META-INF/NOTICE
AU debugger-app/src/main/appended-resources/META-INF/LICENSE
AU debugger-app/pom.xml
AU pdfbox-eclipse-formatter.xml
A .gitignore
U .
At revision 1804864
Parsing POMs
Established TCP socket on 39159
maven33-agent.jar already up to date
maven33-interceptor.jar already up to date
maven3-interceptor-commons.jar already up to date
[trunk] $ /home/jenkins/tools/java/jdk-9-b181-unlimited-security/bin/java -Xmx1g -XX:MaxPermSize=300m -cp /home/jenkins/jenkins-slave/maven33-agent.jar:/home/jenkins/tools/maven/apache-maven-3.3.3/boot/plexus-classworlds-2.5.2.jar:/home/jenkins/tools/maven/apache-maven-3.3.3/conf/logging jenkins.maven3.agent.Maven33Main /home/jenkins/tools/maven/apache-maven-3.3.3 /home/jenkins/jenkins-slave/slave.jar /home/jenkins/jenkins-slave/maven33-interceptor.jar /home/jenkins/jenkins-slave/maven3-interceptor-commons.jar 39159
Java HotSpot(TM) 64-Bit Server VM warning: Ignoring option MaxPermSize; support was removed in 8.0
<===[JENKINS REMOTING CAPACITY]===> channel started
WARNING: An illegal reflective access operation has occurred
WARNING: Illegal reflective access by hudson.remoting.RemoteClassLoader (file:/home/jenkins/jenkins-slave/slave.jar) to method java.lang.ClassLoader.getClassLoadingLock(java.lang.String)
WARNING: Please consider reporting this to the maintainers of hudson.remoting.RemoteClassLoader
WARNING: Use --illegal-access=warn to enable warnings of further illegal reflective access operations
WARNING: All illegal access operations will be denied in a future release
Executing Maven: -B -f <https://builds.apache.org/job/PDFBox-Trunk-jdk9/ws/trunk/pom.xml> -Dmaven.repo.local=/home/jenkins/jenkins-slave/maven-repositories/0 clean -Ppedantic -Dskip-bavaria=false
[INFO] Scanning for projects...
[INFO] ------------------------------------------------------------------------
[INFO] Reactor Build Order:
[INFO]
[INFO] PDFBox parent
[INFO] Apache FontBox
[INFO] Apache XmpBox
[INFO] Apache PDFBox
[INFO] Apache Preflight
[INFO] Apache Preflight application
[INFO] Apache PDFBox Debugger
[INFO] Apache PDFBox tools
[INFO] Apache PDFBox application
[INFO] Apache PDFBox Debugger application
[INFO] Apache PDFBox examples
[INFO] Apache PDFBox
[INFO]
[INFO] ------------------------------------------------------------------------
[INFO] Building PDFBox parent 3.0.0-SNAPSHOT
[INFO] ------------------------------------------------------------------------
[INFO] Downloading: https://repo.maven.apache.org/maven2/org/owasp/dependency-check-maven/2.1.0/dependency-check-maven-2.1.0.pom
[INFO] Downloaded: https://repo.maven.apache.org/maven2/org/owasp/dependency-check-maven/2.1.0/dependency-check-maven-2.1.0.pom (12 KB at 19.2 KB/sec)
[INFO] Downloading: https://repo.maven.apache.org/maven2/org/owasp/dependency-check-parent/2.1.0/dependency-check-parent-2.1.0.pom
[INFO] Downloaded: https://repo.maven.apache.org/maven2/org/owasp/dependency-check-parent/2.1.0/dependency-check-parent-2.1.0.pom (34 KB at 330.0 KB/sec)
[INFO] Downloading: https://repo.maven.apache.org/maven2/org/owasp/dependency-check-maven/2.1.0/dependency-check-maven-2.1.0.jar
[INFO] Downloaded: https://repo.maven.apache.org/maven2/org/owasp/dependency-check-maven/2.1.0/dependency-check-maven-2.1.0.jar (51 KB at 425.2 KB/sec)
[INFO]
[INFO] --- maven-clean-plugin:2.5:clean (default-clean) @ pdfbox-parent ---
[TASKS] Scanning folder '<https://builds.apache.org/job/PDFBox-Trunk-jdk9/ws/trunk/parent'> for files matching the pattern '**/*.java' - excludes:
[TASKS] Found 0 files to scan for tasks
Found 0 open tasks.
[TASKS] Computing warning deltas based on reference build #10
[INFO]
[INFO] ------------------------------------------------------------------------
[INFO] Building Apache FontBox 3.0.0-SNAPSHOT
[INFO] ------------------------------------------------------------------------
[INFO]
[INFO] --- maven-clean-plugin:2.5:clean (default-clean) @ fontbox ---
[TASKS] Scanning folder '<https://builds.apache.org/job/PDFBox-Trunk-jdk9/ws/trunk/fontbox'> for files matching the pattern '**/*.java' - excludes:
[TASKS] Found 105 files to scan for tasks
Found 12 open tasks.
[TASKS] Computing warning deltas based on reference build #10
[INFO]
[INFO] ------------------------------------------------------------------------
[INFO] Building Apache XmpBox 3.0.0-SNAPSHOT
[INFO] ------------------------------------------------------------------------
[INFO]
[INFO] --- maven-clean-plugin:2.5:clean (default-clean) @ xmpbox ---
[TASKS] Scanning folder '<https://builds.apache.org/job/PDFBox-Trunk-jdk9/ws/trunk/xmpbox'> for files matching the pattern '**/*.java' - excludes:
[TASKS] Found 106 files to scan for tasks
Found 7 open tasks.
[TASKS] Computing warning deltas based on reference build #10
[INFO]
[INFO] ------------------------------------------------------------------------
[INFO] Building Apache PDFBox 3.0.0-SNAPSHOT
[INFO] ------------------------------------------------------------------------
[INFO]
[INFO] --- maven-clean-plugin:2.5:clean (default-clean) @ pdfbox ---
[TASKS] Scanning folder '<https://builds.apache.org/job/PDFBox-Trunk-jdk9/ws/trunk/pdfbox'> for files matching the pattern '**/*.java' - excludes:
[TASKS] Found 656 files to scan for tasks
Found 249 open tasks.
[TASKS] Computing warning deltas based on reference build #10
[INFO]
[INFO] ------------------------------------------------------------------------
[INFO] Building Apache Preflight 3.0.0-SNAPSHOT
[INFO] ------------------------------------------------------------------------
[INFO]
[INFO] --- maven-clean-plugin:2.5:clean (default-clean) @ preflight ---
[TASKS] Scanning folder '<https://builds.apache.org/job/PDFBox-Trunk-jdk9/ws/trunk/preflight'> for files matching the pattern '**/*.java' - excludes:
[TASKS] Found 136 files to scan for tasks
Found 21 open tasks.
[TASKS] Computing warning deltas based on reference build #10
[INFO]
[INFO] ------------------------------------------------------------------------
[INFO] Building Apache Preflight application 3.0.0-SNAPSHOT
[INFO] ------------------------------------------------------------------------
[INFO]
[INFO] --- maven-clean-plugin:2.5:clean (default-clean) @ preflight-app ---
[TASKS] Scanning folder '<https://builds.apache.org/job/PDFBox-Trunk-jdk9/ws/trunk/preflight-app'> for files matching the pattern '**/*.java' - excludes:
[TASKS] Found 0 files to scan for tasks
Found 0 open tasks.
[TASKS] Computing warning deltas based on reference build #10
[INFO]
[INFO] ------------------------------------------------------------------------
[INFO] Building Apache PDFBox Debugger 3.0.0-SNAPSHOT
[INFO] ------------------------------------------------------------------------
[INFO]
[INFO] --- maven-clean-plugin:2.5:clean (default-clean) @ pdfbox-debugger ---
[TASKS] Scanning folder '<https://builds.apache.org/job/PDFBox-Trunk-jdk9/ws/trunk/debugger'> for files matching the pattern '**/*.java' - excludes:
[TASKS] Found 81 files to scan for tasks
Found 3 open tasks.
[TASKS] Computing warning deltas based on reference build #10
[INFO]
[INFO] ------------------------------------------------------------------------
[INFO] Building Apache PDFBox tools 3.0.0-SNAPSHOT
[INFO] ------------------------------------------------------------------------
[INFO]
[INFO] --- maven-clean-plugin:2.5:clean (default-clean) @ pdfbox-tools ---
[TASKS] Scanning folder '<https://builds.apache.org/job/PDFBox-Trunk-jdk9/ws/trunk/tools'> for files matching the pattern '**/*.java' - excludes:
[TASKS] Found 27 files to scan for tasks
Found 6 open tasks.
[TASKS] Computing warning deltas based on reference build #10
[INFO]
[INFO] ------------------------------------------------------------------------
[INFO] Building Apache PDFBox application 3.0.0-SNAPSHOT
[INFO] ------------------------------------------------------------------------
[INFO]
[INFO] --- maven-clean-plugin:2.5:clean (default-clean) @ pdfbox-app ---
[TASKS] Scanning folder '<https://builds.apache.org/job/PDFBox-Trunk-jdk9/ws/trunk/app'> for files matching the pattern '**/*.java' - excludes:
[TASKS] Found 0 files to scan for tasks
Found 0 open tasks.
[TASKS] Computing warning deltas based on reference build #10
[INFO]
[INFO] ------------------------------------------------------------------------
[INFO] Building Apache PDFBox Debugger application 3.0.0-SNAPSHOT
[INFO] ------------------------------------------------------------------------
[INFO]
[INFO] --- maven-clean-plugin:2.5:clean (default-clean) @ debugger-app ---
[TASKS] Scanning folder '<https://builds.apache.org/job/PDFBox-Trunk-jdk9/ws/trunk/debugger-app'> for files matching the pattern '**/*.java' - excludes:
[TASKS] Found 0 files to scan for tasks
Found 0 open tasks.
[TASKS] Computing warning deltas based on reference build #10
[INFO]
[INFO] ------------------------------------------------------------------------
[INFO] Building Apache PDFBox examples 3.0.0-SNAPSHOT
[INFO] ------------------------------------------------------------------------
[INFO]
[INFO] --- maven-clean-plugin:2.5:clean (default-clean) @ pdfbox-examples ---
[TASKS] Scanning folder '<https://builds.apache.org/job/PDFBox-Trunk-jdk9/ws/trunk/examples'> for files matching the pattern '**/*.java' - excludes:
[TASKS] Found 66 files to scan for tasks
Found 15 open tasks.
[TASKS] Computing warning deltas based on reference build #10
[INFO]
[INFO] ------------------------------------------------------------------------
[INFO] Building Apache PDFBox 3.0.0-SNAPSHOT
[INFO] ------------------------------------------------------------------------
[INFO]
[INFO] --- maven-clean-plugin:2.5:clean (default-clean) @ pdfbox-reactor ---
[TASKS] Scanning folder '<https://builds.apache.org/job/PDFBox-Trunk-jdk9/ws/trunk'> for files matching the pattern '**/*.java' - excludes: parent/**/*, fontbox/**/*, xmpbox/**/*, pdfbox/**/*, preflight/**/*, preflight-app/**/*, debugger/**/*, tools/**/*, app/**/*, debugger-app/**/*, examples/**/*
[TASKS] Found 0 files to scan for tasks
Found 0 open tasks.
[TASKS] Computing warning deltas based on reference build #10
[INFO] ------------------------------------------------------------------------
[INFO] Reactor Summary:
[INFO]
[INFO] PDFBox parent ...................................... SUCCESS [ 28.568 s]
[INFO] Apache FontBox ..................................... SUCCESS [ 4.519 s]
[INFO] Apache XmpBox ...................................... SUCCESS [ 2.366 s]
[INFO] Apache PDFBox ...................................... SUCCESS [ 25.133 s]
[INFO] Apache Preflight ................................... SUCCESS [ 3.819 s]
[INFO] Apache Preflight application ....................... SUCCESS [ 0.825 s]
[INFO] Apache PDFBox Debugger ............................. SUCCESS [ 2.256 s]
[INFO] Apache PDFBox tools ................................ SUCCESS [ 1.628 s]
[INFO] Apache PDFBox application .......................... SUCCESS [ 0.819 s]
[INFO] Apache PDFBox Debugger application ................. SUCCESS [ 1.110 s]
[INFO] Apache PDFBox examples ............................. SUCCESS [ 1.777 s]
[INFO] Apache PDFBox ...................................... SUCCESS [ 1.982 s]
[INFO] ------------------------------------------------------------------------
[INFO] BUILD SUCCESS
[INFO] ------------------------------------------------------------------------
[INFO] Total time: 01:35 min
[INFO] Finished at: 2017-08-12T12:13:44+00:00
[INFO] Final Memory: 25M/83M
[INFO] ------------------------------------------------------------------------
[JENKINS] Archiving <https://builds.apache.org/job/PDFBox-Trunk-jdk9/ws/trunk/xmpbox/pom.xml> to org.apache.pdfbox/xmpbox/3.0.0-SNAPSHOT/xmpbox-3.0.0-SNAPSHOT.pom
[JENKINS] Archiving <https://builds.apache.org/job/PDFBox-Trunk-jdk9/ws/trunk/tools/pom.xml> to org.apache.pdfbox/pdfbox-tools/3.0.0-SNAPSHOT/pdfbox-tools-3.0.0-SNAPSHOT.pom
[JENKINS] Archiving <https://builds.apache.org/job/PDFBox-Trunk-jdk9/ws/trunk/debugger/pom.xml> to org.apache.pdfbox/pdfbox-debugger/3.0.0-SNAPSHOT/pdfbox-debugger-3.0.0-SNAPSHOT.pom
[JENKINS] Archiving <https://builds.apache.org/job/PDFBox-Trunk-jdk9/ws/trunk/preflight-app/pom.xml> to org.apache.pdfbox/preflight-app/3.0.0-SNAPSHOT/preflight-app-3.0.0-SNAPSHOT.pom
[JENKINS] Archiving <https://builds.apache.org/job/PDFBox-Trunk-jdk9/ws/trunk/app/pom.xml> to org.apache.pdfbox/pdfbox-app/3.0.0-SNAPSHOT/pdfbox-app-3.0.0-SNAPSHOT.pom
[JENKINS] Archiving <https://builds.apache.org/job/PDFBox-Trunk-jdk9/ws/trunk/examples/pom.xml> to org.apache.pdfbox/pdfbox-examples/3.0.0-SNAPSHOT/pdfbox-examples-3.0.0-SNAPSHOT.pom
[JENKINS] Archiving <https://builds.apache.org/job/PDFBox-Trunk-jdk9/ws/trunk/preflight/pom.xml> to org.apache.pdfbox/preflight/3.0.0-SNAPSHOT/preflight-3.0.0-SNAPSHOT.pom
[JENKINS] Archiving <https://builds.apache.org/job/PDFBox-Trunk-jdk9/ws/trunk/pom.xml> to org.apache.pdfbox/pdfbox-reactor/3.0.0-SNAPSHOT/pdfbox-reactor-3.0.0-SNAPSHOT.pom
[JENKINS] Archiving <https://builds.apache.org/job/PDFBox-Trunk-jdk9/ws/trunk/parent/pom.xml> to org.apache.pdfbox/pdfbox-parent/3.0.0-SNAPSHOT/pdfbox-parent-3.0.0-SNAPSHOT.pom
[JENKINS] Archiving <https://builds.apache.org/job/PDFBox-Trunk-jdk9/ws/trunk/pdfbox/pom.xml> to org.apache.pdfbox/pdfbox/3.0.0-SNAPSHOT/pdfbox-3.0.0-SNAPSHOT.pom
[JENKINS] Archiving <https://builds.apache.org/job/PDFBox-Trunk-jdk9/ws/trunk/debugger-app/pom.xml> to org.apache.pdfbox/debugger-app/3.0.0-SNAPSHOT/debugger-app-3.0.0-SNAPSHOT.pom
[JENKINS] Archiving <https://builds.apache.org/job/PDFBox-Trunk-jdk9/ws/trunk/fontbox/pom.xml> to org.apache.pdfbox/fontbox/3.0.0-SNAPSHOT/fontbox-3.0.0-SNAPSHOT.pom
channel stopped
Archiving artifacts
ERROR: No artifacts found that match the file pattern "trunk/pdfbox/target/pdfbox.log". Configuration error?
ERROR: ‘trunk/pdfbox/target/pdfbox.log’ doesn’t match anything: ‘trunk’ exists but not ‘trunk/pdfbox/target/pdfbox.log’
Build step 'Archive the artifacts' changed build result to FAILURE
---------------------------------------------------------------------
To unsubscribe, e-mail: dev-unsubscribe@pdfbox.apache.org
For additional commands, e-mail: dev-help@pdfbox.apache.org
Build failed in Jenkins: PDFBox-Trunk-jdk9 #13
Posted by Apache Jenkins Server <je...@builds.apache.org>.
See <https://builds.apache.org/job/PDFBox-Trunk-jdk9/13/display/redirect>
------------------------------------------
[...truncated 28.21 KB...]
at org.tmatesoft.svn.core.internal.wc2.ng.SvnNgUpdate.run(SvnNgUpdate.java:18)
at org.tmatesoft.svn.core.internal.wc2.ng.SvnNgOperationRunner.run(SvnNgOperationRunner.java:20)
at org.tmatesoft.svn.core.internal.wc2.SvnOperationRunner.run(SvnOperationRunner.java:21)
at org.tmatesoft.svn.core.wc2.SvnOperationFactory.run(SvnOperationFactory.java:1235)
at org.tmatesoft.svn.core.wc2.SvnOperation.run(SvnOperation.java:294)
at org.tmatesoft.svn.core.wc.SVNUpdateClient.doUpdate(SVNUpdateClient.java:311)
at org.tmatesoft.svn.core.wc.SVNUpdateClient.doUpdate(SVNUpdateClient.java:291)
at org.tmatesoft.svn.core.wc.SVNUpdateClient.doUpdate(SVNUpdateClient.java:387)
at hudson.scm.subversion.UpdateUpdater$TaskImpl.perform(UpdateUpdater.java:158)
Caused: hudson.scm.subversion.UpdaterException: failed to perform svn update
at hudson.scm.subversion.UpdateUpdater$TaskImpl.perform(UpdateUpdater.java:212)
at hudson.scm.subversion.WorkspaceUpdater$UpdateTask.delegateTo(WorkspaceUpdater.java:162)
at hudson.scm.SubversionSCM$CheckOutTask.perform(SubversionSCM.java:1001)
at hudson.scm.SubversionSCM$CheckOutTask.invoke(SubversionSCM.java:977)
at hudson.scm.SubversionSCM$CheckOutTask.invoke(SubversionSCM.java:953)
at hudson.FilePath$FileCallableWrapper.call(FilePath.java:2739)
at hudson.remoting.UserRequest.perform(UserRequest.java:153)
at hudson.remoting.UserRequest.perform(UserRequest.java:50)
at hudson.remoting.Request$2.run(Request.java:336)
at hudson.remoting.InterceptingExecutorService$1.call(InterceptingExecutorService.java:68)
at java.util.concurrent.FutureTask.run(FutureTask.java:266)
at java.util.concurrent.ThreadPoolExecutor.runWorker(ThreadPoolExecutor.java:1142)
at java.util.concurrent.ThreadPoolExecutor$Worker.run(ThreadPoolExecutor.java:617)
at java.lang.Thread.run(Thread.java:748)
Caused: java.io.IOException
at hudson.scm.subversion.UpdateUpdater$TaskImpl.perform(UpdateUpdater.java:212)
at hudson.scm.subversion.WorkspaceUpdater$UpdateTask.delegateTo(WorkspaceUpdater.java:162)
at hudson.scm.SubversionSCM$CheckOutTask.perform(SubversionSCM.java:1001)
at hudson.scm.SubversionSCM$CheckOutTask.invoke(SubversionSCM.java:977)
at hudson.scm.SubversionSCM$CheckOutTask.invoke(SubversionSCM.java:953)
at hudson.FilePath$FileCallableWrapper.call(FilePath.java:2739)
at hudson.remoting.UserRequest.perform(UserRequest.java:153)
at hudson.remoting.UserRequest.perform(UserRequest.java:50)
at hudson.remoting.Request$2.run(Request.java:336)
at hudson.remoting.InterceptingExecutorService$1.call(InterceptingExecutorService.java:68)
at java.util.concurrent.FutureTask.run(FutureTask.java:266)
at java.util.concurrent.ThreadPoolExecutor.runWorker(ThreadPoolExecutor.java:1142)
at java.util.concurrent.ThreadPoolExecutor$Worker.run(ThreadPoolExecutor.java:617)
at java.lang.Thread.run(Thread.java:748)
at ......remote call to H21(Native Method)
at hudson.remoting.Channel.attachCallSiteStackTrace(Channel.java:1545)
at hudson.remoting.UserResponse.retrieve(UserRequest.java:253)
at hudson.remoting.Channel.call(Channel.java:830)
at hudson.FilePath.act(FilePath.java:986)
Caused: java.io.IOException: remote file operation failed: <https://builds.apache.org/job/PDFBox-Trunk-jdk9/ws/> at hudson.remoting.Channel@4b715ff3:H21
at hudson.FilePath.act(FilePath.java:993)
at hudson.FilePath.act(FilePath.java:975)
at hudson.scm.SubversionSCM.checkout(SubversionSCM.java:902)
at hudson.scm.SubversionSCM.checkout(SubversionSCM.java:838)
at hudson.scm.SCM.checkout(SCM.java:495)
at hudson.model.AbstractProject.checkout(AbstractProject.java:1276)
at hudson.model.AbstractBuild$AbstractBuildExecution.defaultCheckout(AbstractBuild.java:560)
at jenkins.scm.SCMCheckoutStrategy.checkout(SCMCheckoutStrategy.java:86)
at hudson.model.AbstractBuild$AbstractBuildExecution.run(AbstractBuild.java:485)
at hudson.model.Run.execute(Run.java:1735)
at hudson.maven.MavenModuleSetBuild.run(MavenModuleSetBuild.java:542)
at hudson.model.ResourceController.execute(ResourceController.java:97)
at hudson.model.Executor.run(Executor.java:405)
Retrying after 10 seconds
Updating http://svn.apache.org/repos/asf/pdfbox/trunk at revision '2017-08-12T11:53:38.719 +0000'
ERROR: Failed to update http://svn.apache.org/repos/asf/pdfbox/trunk
org.tmatesoft.svn.core.SVNException: svn: E200030: java.io.IOException: Permission denied
at org.tmatesoft.svn.core.internal.wc.SVNErrorManager.error(SVNErrorManager.java:70)
at org.tmatesoft.svn.core.internal.wc.SVNErrorManager.error(SVNErrorManager.java:57)
at org.tmatesoft.svn.core.internal.io.dav.http.HTTPConnection.request(HTTPConnection.java:798)
at org.tmatesoft.svn.core.internal.io.dav.http.HTTPConnection.request(HTTPConnection.java:391)
at org.tmatesoft.svn.core.internal.io.dav.http.HTTPConnection.request(HTTPConnection.java:379)
at org.tmatesoft.svn.core.internal.io.dav.DAVConnection.performHttpRequest(DAVConnection.java:862)
at org.tmatesoft.svn.core.internal.io.dav.DAVConnection.doReport(DAVConnection.java:359)
at org.tmatesoft.svn.core.internal.io.dav.DAVRepository.runReport(DAVRepository.java:1341)
at org.tmatesoft.svn.core.internal.io.dav.DAVRepository.update(DAVRepository.java:868)
at org.tmatesoft.svn.core.internal.wc2.ng.SvnNgAbstractUpdate.updateInternal(SvnNgAbstractUpdate.java:247)
at org.tmatesoft.svn.core.internal.wc2.ng.SvnNgAbstractUpdate.update(SvnNgAbstractUpdate.java:111)
at org.tmatesoft.svn.core.internal.wc2.ng.SvnNgUpdate.run(SvnNgUpdate.java:40)
at org.tmatesoft.svn.core.internal.wc2.ng.SvnNgUpdate.run(SvnNgUpdate.java:18)
at org.tmatesoft.svn.core.internal.wc2.ng.SvnNgOperationRunner.run(SvnNgOperationRunner.java:20)
at org.tmatesoft.svn.core.internal.wc2.SvnOperationRunner.run(SvnOperationRunner.java:21)
at org.tmatesoft.svn.core.wc2.SvnOperationFactory.run(SvnOperationFactory.java:1235)
at org.tmatesoft.svn.core.wc2.SvnOperation.run(SvnOperation.java:294)
at org.tmatesoft.svn.core.wc.SVNUpdateClient.doUpdate(SVNUpdateClient.java:311)
at org.tmatesoft.svn.core.wc.SVNUpdateClient.doUpdate(SVNUpdateClient.java:291)
at org.tmatesoft.svn.core.wc.SVNUpdateClient.doUpdate(SVNUpdateClient.java:387)
at hudson.scm.subversion.UpdateUpdater$TaskImpl.perform(UpdateUpdater.java:158)
at hudson.scm.subversion.WorkspaceUpdater$UpdateTask.delegateTo(WorkspaceUpdater.java:162)
at hudson.scm.SubversionSCM$CheckOutTask.perform(SubversionSCM.java:1001)
at hudson.scm.SubversionSCM$CheckOutTask.invoke(SubversionSCM.java:977)
at hudson.scm.SubversionSCM$CheckOutTask.invoke(SubversionSCM.java:953)
at hudson.FilePath$FileCallableWrapper.call(FilePath.java:2739)
at hudson.remoting.UserRequest.perform(UserRequest.java:153)
at hudson.remoting.UserRequest.perform(UserRequest.java:50)
at hudson.remoting.Request$2.run(Request.java:336)
at hudson.remoting.InterceptingExecutorService$1.call(InterceptingExecutorService.java:68)
at java.util.concurrent.FutureTask.run(FutureTask.java:266)
at java.util.concurrent.ThreadPoolExecutor.runWorker(ThreadPoolExecutor.java:1142)
at java.util.concurrent.ThreadPoolExecutor$Worker.run(ThreadPoolExecutor.java:617)
at java.lang.Thread.run(Thread.java:748)
Caused by: org.tmatesoft.sqljet.core.SqlJetException: java.io.IOException: Permission denied: error code is CANTOPEN
at org.tmatesoft.sqljet.core.table.SqlJetDb.getTemporaryDatabaseFile(SqlJetDb.java:484)
at org.tmatesoft.sqljet.core.table.SqlJetDb.access$1400(SqlJetDb.java:63)
at org.tmatesoft.sqljet.core.table.SqlJetDb$15.runWithLock(SqlJetDb.java:449)
at org.tmatesoft.sqljet.core.table.SqlJetDb$1.runSynchronized(SqlJetDb.java:172)
at org.tmatesoft.sqljet.core.table.engine.SqlJetEngine.runSynchronized(SqlJetEngine.java:217)
at org.tmatesoft.sqljet.core.table.SqlJetDb.runWithLock(SqlJetDb.java:170)
at org.tmatesoft.sqljet.core.table.SqlJetDb.getTemporaryDatabase(SqlJetDb.java:445)
at org.tmatesoft.svn.core.internal.db.SVNSqlJetDb.getTemporaryDb(SVNSqlJetDb.java:132)
at org.tmatesoft.svn.core.internal.wc17.db.SVNWCDb$BumpRevisionPostUpdate.bumpMovedAway(SVNWCDb.java:5419)
at org.tmatesoft.svn.core.internal.wc17.db.SVNWCDb$BumpRevisionPostUpdate.transaction(SVNWCDb.java:5414)
at org.tmatesoft.svn.core.internal.db.SVNSqlJetDb.runTransaction(SVNSqlJetDb.java:258)
at org.tmatesoft.svn.core.internal.db.SVNSqlJetDb.runTransaction(SVNSqlJetDb.java:252)
at org.tmatesoft.svn.core.internal.wc17.db.SVNWCDb.opBumpRevisionPostUpdate(SVNWCDb.java:5366)
at org.tmatesoft.svn.core.internal.wc17.SVNUpdateEditor17.closeEdit(SVNUpdateEditor17.java:1728)
at org.tmatesoft.svn.core.internal.wc.SVNCancellableEditor.closeEdit(SVNCancellableEditor.java:148)
at org.tmatesoft.svn.core.internal.io.dav.handlers.DAVEditorHandler.endElement(DAVEditorHandler.java:492)
at org.tmatesoft.svn.core.internal.io.dav.handlers.BasicDAVHandler.endElement(BasicDAVHandler.java:103)
at com.sun.org.apache.xerces.internal.parsers.AbstractSAXParser.endElement(AbstractSAXParser.java:609)
at com.sun.org.apache.xerces.internal.impl.XMLDocumentFragmentScannerImpl.scanEndElement(XMLDocumentFragmentScannerImpl.java:1782)
at com.sun.org.apache.xerces.internal.impl.XMLDocumentFragmentScannerImpl$FragmentContentDriver.next(XMLDocumentFragmentScannerImpl.java:2967)
at com.sun.org.apache.xerces.internal.impl.XMLDocumentScannerImpl.next(XMLDocumentScannerImpl.java:602)
at com.sun.org.apache.xerces.internal.impl.XMLNSDocumentScannerImpl.next(XMLNSDocumentScannerImpl.java:112)
at com.sun.org.apache.xerces.internal.impl.XMLDocumentFragmentScannerImpl.scanDocument(XMLDocumentFragmentScannerImpl.java:505)
at com.sun.org.apache.xerces.internal.parsers.XML11Configuration.parse(XML11Configuration.java:841)
at com.sun.org.apache.xerces.internal.parsers.XML11Configuration.parse(XML11Configuration.java:770)
at com.sun.org.apache.xerces.internal.parsers.XMLParser.parse(XMLParser.java:141)
at com.sun.org.apache.xerces.internal.parsers.AbstractSAXParser.parse(AbstractSAXParser.java:1213)
at com.sun.org.apache.xerces.internal.jaxp.SAXParserImpl$JAXPSAXParser.parse(SAXParserImpl.java:643)
at org.tmatesoft.svn.core.internal.io.dav.http.HTTPConnection.readData(HTTPConnection.java:937)
at org.tmatesoft.svn.core.internal.io.dav.http.HTTPConnection.readData(HTTPConnection.java:902)
at org.tmatesoft.svn.core.internal.io.dav.http.HTTPRequest.dispatch(HTTPRequest.java:220)
at org.tmatesoft.svn.core.internal.io.dav.http.HTTPConnection.request(HTTPConnection.java:490)
... 31 more
Caused by: java.io.IOException: Permission denied
at java.io.UnixFileSystem.createFileExclusively(Native Method)
at java.io.File.createTempFile(File.java:2024)
at java.io.File.createTempFile(File.java:2070)
at org.tmatesoft.sqljet.core.internal.fs.SqlJetFileSystem.getTempFile(SqlJetFileSystem.java:202)
at org.tmatesoft.sqljet.core.table.SqlJetDb.getTemporaryDatabaseFile(SqlJetDb.java:482)
... 62 more
ERROR: Subversion update failed
java.io.IOException: Permission denied
at java.io.UnixFileSystem.createFileExclusively(Native Method)
at java.io.File.createTempFile(File.java:2024)
at java.io.File.createTempFile(File.java:2070)
at org.tmatesoft.sqljet.core.internal.fs.SqlJetFileSystem.getTempFile(SqlJetFileSystem.java:202)
at org.tmatesoft.sqljet.core.table.SqlJetDb.getTemporaryDatabaseFile(SqlJetDb.java:482)
Caused: org.tmatesoft.sqljet.core.SqlJetException: java.io.IOException: Permission denied: error code is CANTOPEN
at org.tmatesoft.sqljet.core.table.SqlJetDb.getTemporaryDatabaseFile(SqlJetDb.java:484)
at org.tmatesoft.sqljet.core.table.SqlJetDb.access$1400(SqlJetDb.java:63)
at org.tmatesoft.sqljet.core.table.SqlJetDb$15.runWithLock(SqlJetDb.java:449)
at org.tmatesoft.sqljet.core.table.SqlJetDb$1.runSynchronized(SqlJetDb.java:172)
at org.tmatesoft.sqljet.core.table.engine.SqlJetEngine.runSynchronized(SqlJetEngine.java:217)
at org.tmatesoft.sqljet.core.table.SqlJetDb.runWithLock(SqlJetDb.java:170)
at org.tmatesoft.sqljet.core.table.SqlJetDb.getTemporaryDatabase(SqlJetDb.java:445)
at org.tmatesoft.svn.core.internal.db.SVNSqlJetDb.getTemporaryDb(SVNSqlJetDb.java:132)
at org.tmatesoft.svn.core.internal.wc17.db.SVNWCDb$BumpRevisionPostUpdate.bumpMovedAway(SVNWCDb.java:5419)
at org.tmatesoft.svn.core.internal.wc17.db.SVNWCDb$BumpRevisionPostUpdate.transaction(SVNWCDb.java:5414)
at org.tmatesoft.svn.core.internal.db.SVNSqlJetDb.runTransaction(SVNSqlJetDb.java:258)
at org.tmatesoft.svn.core.internal.db.SVNSqlJetDb.runTransaction(SVNSqlJetDb.java:252)
at org.tmatesoft.svn.core.internal.wc17.db.SVNWCDb.opBumpRevisionPostUpdate(SVNWCDb.java:5366)
at org.tmatesoft.svn.core.internal.wc17.SVNUpdateEditor17.closeEdit(SVNUpdateEditor17.java:1728)
at org.tmatesoft.svn.core.internal.wc.SVNCancellableEditor.closeEdit(SVNCancellableEditor.java:148)
at org.tmatesoft.svn.core.internal.io.dav.handlers.DAVEditorHandler.endElement(DAVEditorHandler.java:492)
at org.tmatesoft.svn.core.internal.io.dav.handlers.BasicDAVHandler.endElement(BasicDAVHandler.java:103)
at com.sun.org.apache.xerces.internal.parsers.AbstractSAXParser.endElement(AbstractSAXParser.java:609)
at com.sun.org.apache.xerces.internal.impl.XMLDocumentFragmentScannerImpl.scanEndElement(XMLDocumentFragmentScannerImpl.java:1782)
at com.sun.org.apache.xerces.internal.impl.XMLDocumentFragmentScannerImpl$FragmentContentDriver.next(XMLDocumentFragmentScannerImpl.java:2967)
at com.sun.org.apache.xerces.internal.impl.XMLDocumentScannerImpl.next(XMLDocumentScannerImpl.java:602)
at com.sun.org.apache.xerces.internal.impl.XMLNSDocumentScannerImpl.next(XMLNSDocumentScannerImpl.java:112)
at com.sun.org.apache.xerces.internal.impl.XMLDocumentFragmentScannerImpl.scanDocument(XMLDocumentFragmentScannerImpl.java:505)
at com.sun.org.apache.xerces.internal.parsers.XML11Configuration.parse(XML11Configuration.java:841)
at com.sun.org.apache.xerces.internal.parsers.XML11Configuration.parse(XML11Configuration.java:770)
at com.sun.org.apache.xerces.internal.parsers.XMLParser.parse(XMLParser.java:141)
at com.sun.org.apache.xerces.internal.parsers.AbstractSAXParser.parse(AbstractSAXParser.java:1213)
at com.sun.org.apache.xerces.internal.jaxp.SAXParserImpl$JAXPSAXParser.parse(SAXParserImpl.java:643)
at org.tmatesoft.svn.core.internal.io.dav.http.HTTPConnection.readData(HTTPConnection.java:937)
at org.tmatesoft.svn.core.internal.io.dav.http.HTTPConnection.readData(HTTPConnection.java:902)
at org.tmatesoft.svn.core.internal.io.dav.http.HTTPRequest.dispatch(HTTPRequest.java:220)
at org.tmatesoft.svn.core.internal.io.dav.http.HTTPConnection.request(HTTPConnection.java:490)
Caused: org.tmatesoft.svn.core.SVNException: svn: E200030: java.io.IOException: Permission denied
at org.tmatesoft.svn.core.internal.wc.SVNErrorManager.error(SVNErrorManager.java:70)
at org.tmatesoft.svn.core.internal.wc.SVNErrorManager.error(SVNErrorManager.java:57)
at org.tmatesoft.svn.core.internal.io.dav.http.HTTPConnection.request(HTTPConnection.java:798)
at org.tmatesoft.svn.core.internal.io.dav.http.HTTPConnection.request(HTTPConnection.java:391)
at org.tmatesoft.svn.core.internal.io.dav.http.HTTPConnection.request(HTTPConnection.java:379)
at org.tmatesoft.svn.core.internal.io.dav.DAVConnection.performHttpRequest(DAVConnection.java:862)
at org.tmatesoft.svn.core.internal.io.dav.DAVConnection.doReport(DAVConnection.java:359)
at org.tmatesoft.svn.core.internal.io.dav.DAVRepository.runReport(DAVRepository.java:1341)
at org.tmatesoft.svn.core.internal.io.dav.DAVRepository.update(DAVRepository.java:868)
at org.tmatesoft.svn.core.internal.wc2.ng.SvnNgAbstractUpdate.updateInternal(SvnNgAbstractUpdate.java:247)
at org.tmatesoft.svn.core.internal.wc2.ng.SvnNgAbstractUpdate.update(SvnNgAbstractUpdate.java:111)
at org.tmatesoft.svn.core.internal.wc2.ng.SvnNgUpdate.run(SvnNgUpdate.java:40)
at org.tmatesoft.svn.core.internal.wc2.ng.SvnNgUpdate.run(SvnNgUpdate.java:18)
at org.tmatesoft.svn.core.internal.wc2.ng.SvnNgOperationRunner.run(SvnNgOperationRunner.java:20)
at org.tmatesoft.svn.core.internal.wc2.SvnOperationRunner.run(SvnOperationRunner.java:21)
at org.tmatesoft.svn.core.wc2.SvnOperationFactory.run(SvnOperationFactory.java:1235)
at org.tmatesoft.svn.core.wc2.SvnOperation.run(SvnOperation.java:294)
at org.tmatesoft.svn.core.wc.SVNUpdateClient.doUpdate(SVNUpdateClient.java:311)
at org.tmatesoft.svn.core.wc.SVNUpdateClient.doUpdate(SVNUpdateClient.java:291)
at org.tmatesoft.svn.core.wc.SVNUpdateClient.doUpdate(SVNUpdateClient.java:387)
at hudson.scm.subversion.UpdateUpdater$TaskImpl.perform(UpdateUpdater.java:158)
Caused: hudson.scm.subversion.UpdaterException: failed to perform svn update
at hudson.scm.subversion.UpdateUpdater$TaskImpl.perform(UpdateUpdater.java:212)
at hudson.scm.subversion.WorkspaceUpdater$UpdateTask.delegateTo(WorkspaceUpdater.java:162)
at hudson.scm.SubversionSCM$CheckOutTask.perform(SubversionSCM.java:1001)
at hudson.scm.SubversionSCM$CheckOutTask.invoke(SubversionSCM.java:977)
at hudson.scm.SubversionSCM$CheckOutTask.invoke(SubversionSCM.java:953)
at hudson.FilePath$FileCallableWrapper.call(FilePath.java:2739)
at hudson.remoting.UserRequest.perform(UserRequest.java:153)
at hudson.remoting.UserRequest.perform(UserRequest.java:50)
at hudson.remoting.Request$2.run(Request.java:336)
at hudson.remoting.InterceptingExecutorService$1.call(InterceptingExecutorService.java:68)
at java.util.concurrent.FutureTask.run(FutureTask.java:266)
at java.util.concurrent.ThreadPoolExecutor.runWorker(ThreadPoolExecutor.java:1142)
at java.util.concurrent.ThreadPoolExecutor$Worker.run(ThreadPoolExecutor.java:617)
at java.lang.Thread.run(Thread.java:748)
Caused: java.io.IOException
at hudson.scm.subversion.UpdateUpdater$TaskImpl.perform(UpdateUpdater.java:212)
at hudson.scm.subversion.WorkspaceUpdater$UpdateTask.delegateTo(WorkspaceUpdater.java:162)
at hudson.scm.SubversionSCM$CheckOutTask.perform(SubversionSCM.java:1001)
at hudson.scm.SubversionSCM$CheckOutTask.invoke(SubversionSCM.java:977)
at hudson.scm.SubversionSCM$CheckOutTask.invoke(SubversionSCM.java:953)
at hudson.FilePath$FileCallableWrapper.call(FilePath.java:2739)
at hudson.remoting.UserRequest.perform(UserRequest.java:153)
at hudson.remoting.UserRequest.perform(UserRequest.java:50)
at hudson.remoting.Request$2.run(Request.java:336)
at hudson.remoting.InterceptingExecutorService$1.call(InterceptingExecutorService.java:68)
at java.util.concurrent.FutureTask.run(FutureTask.java:266)
at java.util.concurrent.ThreadPoolExecutor.runWorker(ThreadPoolExecutor.java:1142)
at java.util.concurrent.ThreadPoolExecutor$Worker.run(ThreadPoolExecutor.java:617)
at java.lang.Thread.run(Thread.java:748)
at ......remote call to H21(Native Method)
at hudson.remoting.Channel.attachCallSiteStackTrace(Channel.java:1545)
at hudson.remoting.UserResponse.retrieve(UserRequest.java:253)
at hudson.remoting.Channel.call(Channel.java:830)
at hudson.FilePath.act(FilePath.java:986)
Caused: java.io.IOException: remote file operation failed: <https://builds.apache.org/job/PDFBox-Trunk-jdk9/ws/> at hudson.remoting.Channel@4b715ff3:H21
at hudson.FilePath.act(FilePath.java:993)
at hudson.FilePath.act(FilePath.java:975)
at hudson.scm.SubversionSCM.checkout(SubversionSCM.java:902)
at hudson.scm.SubversionSCM.checkout(SubversionSCM.java:838)
at hudson.scm.SCM.checkout(SCM.java:495)
at hudson.model.AbstractProject.checkout(AbstractProject.java:1276)
at hudson.model.AbstractBuild$AbstractBuildExecution.defaultCheckout(AbstractBuild.java:560)
at jenkins.scm.SCMCheckoutStrategy.checkout(SCMCheckoutStrategy.java:86)
at hudson.model.AbstractBuild$AbstractBuildExecution.run(AbstractBuild.java:485)
at hudson.model.Run.execute(Run.java:1735)
at hudson.maven.MavenModuleSetBuild.run(MavenModuleSetBuild.java:542)
at hudson.model.ResourceController.execute(ResourceController.java:97)
at hudson.model.Executor.run(Executor.java:405)
Archiving artifacts
---------------------------------------------------------------------
To unsubscribe, e-mail: dev-unsubscribe@pdfbox.apache.org
For additional commands, e-mail: dev-help@pdfbox.apache.org
Build failed in Jenkins: PDFBox-Trunk-jdk9 #12
Posted by Apache Jenkins Server <je...@builds.apache.org>.
See <https://builds.apache.org/job/PDFBox-Trunk-jdk9/12/display/redirect>
------------------------------------------
[...truncated 28.43 KB...]
at org.tmatesoft.svn.core.internal.wc2.ng.SvnNgOperationRunner.run(SvnNgOperationRunner.java:20)
at org.tmatesoft.svn.core.internal.wc2.SvnOperationRunner.run(SvnOperationRunner.java:21)
at org.tmatesoft.svn.core.wc2.SvnOperationFactory.run(SvnOperationFactory.java:1235)
at org.tmatesoft.svn.core.wc2.SvnOperation.run(SvnOperation.java:294)
at org.tmatesoft.svn.core.wc.SVNUpdateClient.doUpdate(SVNUpdateClient.java:311)
at org.tmatesoft.svn.core.wc.SVNUpdateClient.doUpdate(SVNUpdateClient.java:291)
at org.tmatesoft.svn.core.wc.SVNUpdateClient.doUpdate(SVNUpdateClient.java:387)
at hudson.scm.subversion.UpdateUpdater$TaskImpl.perform(UpdateUpdater.java:158)
Caused: hudson.scm.subversion.UpdaterException: failed to perform svn update
at hudson.scm.subversion.UpdateUpdater$TaskImpl.perform(UpdateUpdater.java:212)
at hudson.scm.subversion.WorkspaceUpdater$UpdateTask.delegateTo(WorkspaceUpdater.java:162)
at hudson.scm.SubversionSCM$CheckOutTask.perform(SubversionSCM.java:1001)
at hudson.scm.SubversionSCM$CheckOutTask.invoke(SubversionSCM.java:977)
at hudson.scm.SubversionSCM$CheckOutTask.invoke(SubversionSCM.java:953)
at hudson.FilePath$FileCallableWrapper.call(FilePath.java:2739)
at hudson.remoting.UserRequest.perform(UserRequest.java:153)
at hudson.remoting.UserRequest.perform(UserRequest.java:50)
at hudson.remoting.Request$2.run(Request.java:336)
at hudson.remoting.InterceptingExecutorService$1.call(InterceptingExecutorService.java:68)
at java.util.concurrent.FutureTask.run(FutureTask.java:266)
at java.util.concurrent.ThreadPoolExecutor.runWorker(ThreadPoolExecutor.java:1142)
at java.util.concurrent.ThreadPoolExecutor$Worker.run(ThreadPoolExecutor.java:617)
at java.lang.Thread.run(Thread.java:748)
Caused: java.io.IOException
at hudson.scm.subversion.UpdateUpdater$TaskImpl.perform(UpdateUpdater.java:212)
at hudson.scm.subversion.WorkspaceUpdater$UpdateTask.delegateTo(WorkspaceUpdater.java:162)
at hudson.scm.SubversionSCM$CheckOutTask.perform(SubversionSCM.java:1001)
at hudson.scm.SubversionSCM$CheckOutTask.invoke(SubversionSCM.java:977)
at hudson.scm.SubversionSCM$CheckOutTask.invoke(SubversionSCM.java:953)
at hudson.FilePath$FileCallableWrapper.call(FilePath.java:2739)
at hudson.remoting.UserRequest.perform(UserRequest.java:153)
at hudson.remoting.UserRequest.perform(UserRequest.java:50)
at hudson.remoting.Request$2.run(Request.java:336)
at hudson.remoting.InterceptingExecutorService$1.call(InterceptingExecutorService.java:68)
at java.util.concurrent.FutureTask.run(FutureTask.java:266)
at java.util.concurrent.ThreadPoolExecutor.runWorker(ThreadPoolExecutor.java:1142)
at java.util.concurrent.ThreadPoolExecutor$Worker.run(ThreadPoolExecutor.java:617)
at java.lang.Thread.run(Thread.java:748)
at ......remote call to H21(Native Method)
at hudson.remoting.Channel.attachCallSiteStackTrace(Channel.java:1545)
at hudson.remoting.UserResponse.retrieve(UserRequest.java:253)
at hudson.remoting.Channel.call(Channel.java:830)
at hudson.FilePath.act(FilePath.java:986)
Caused: java.io.IOException: remote file operation failed: <https://builds.apache.org/job/PDFBox-Trunk-jdk9/ws/> at hudson.remoting.Channel@4b715ff3:H21
at hudson.FilePath.act(FilePath.java:993)
at hudson.FilePath.act(FilePath.java:975)
at hudson.scm.SubversionSCM.checkout(SubversionSCM.java:902)
at hudson.scm.SubversionSCM.checkout(SubversionSCM.java:838)
at hudson.scm.SCM.checkout(SCM.java:495)
at hudson.model.AbstractProject.checkout(AbstractProject.java:1276)
at hudson.model.AbstractBuild$AbstractBuildExecution.defaultCheckout(AbstractBuild.java:560)
at jenkins.scm.SCMCheckoutStrategy.checkout(SCMCheckoutStrategy.java:86)
at hudson.model.AbstractBuild$AbstractBuildExecution.run(AbstractBuild.java:485)
at hudson.model.Run.execute(Run.java:1735)
at hudson.maven.MavenModuleSetBuild.run(MavenModuleSetBuild.java:542)
at hudson.model.ResourceController.execute(ResourceController.java:97)
at hudson.model.Executor.run(Executor.java:405)
Retrying after 10 seconds
Cleaning up <https://builds.apache.org/job/PDFBox-Trunk-jdk9/ws/trunk>
Updating http://svn.apache.org/repos/asf/pdfbox/trunk at revision '2017-08-12T11:43:29.206 +0000'
ERROR: Failed to update http://svn.apache.org/repos/asf/pdfbox/trunk
org.tmatesoft.svn.core.SVNException: svn: E200030: java.io.IOException: Permission denied
at org.tmatesoft.svn.core.internal.wc.SVNErrorManager.error(SVNErrorManager.java:70)
at org.tmatesoft.svn.core.internal.wc.SVNErrorManager.error(SVNErrorManager.java:57)
at org.tmatesoft.svn.core.internal.io.dav.http.HTTPConnection.request(HTTPConnection.java:798)
at org.tmatesoft.svn.core.internal.io.dav.http.HTTPConnection.request(HTTPConnection.java:391)
at org.tmatesoft.svn.core.internal.io.dav.http.HTTPConnection.request(HTTPConnection.java:379)
at org.tmatesoft.svn.core.internal.io.dav.DAVConnection.performHttpRequest(DAVConnection.java:862)
at org.tmatesoft.svn.core.internal.io.dav.DAVConnection.doReport(DAVConnection.java:359)
at org.tmatesoft.svn.core.internal.io.dav.DAVRepository.runReport(DAVRepository.java:1341)
at org.tmatesoft.svn.core.internal.io.dav.DAVRepository.update(DAVRepository.java:868)
at org.tmatesoft.svn.core.internal.wc2.ng.SvnNgAbstractUpdate.updateInternal(SvnNgAbstractUpdate.java:247)
at org.tmatesoft.svn.core.internal.wc2.ng.SvnNgAbstractUpdate.update(SvnNgAbstractUpdate.java:111)
at org.tmatesoft.svn.core.internal.wc2.ng.SvnNgUpdate.run(SvnNgUpdate.java:40)
at org.tmatesoft.svn.core.internal.wc2.ng.SvnNgUpdate.run(SvnNgUpdate.java:18)
at org.tmatesoft.svn.core.internal.wc2.ng.SvnNgOperationRunner.run(SvnNgOperationRunner.java:20)
at org.tmatesoft.svn.core.internal.wc2.SvnOperationRunner.run(SvnOperationRunner.java:21)
at org.tmatesoft.svn.core.wc2.SvnOperationFactory.run(SvnOperationFactory.java:1235)
at org.tmatesoft.svn.core.wc2.SvnOperation.run(SvnOperation.java:294)
at org.tmatesoft.svn.core.wc.SVNUpdateClient.doUpdate(SVNUpdateClient.java:311)
at org.tmatesoft.svn.core.wc.SVNUpdateClient.doUpdate(SVNUpdateClient.java:291)
at org.tmatesoft.svn.core.wc.SVNUpdateClient.doUpdate(SVNUpdateClient.java:387)
at hudson.scm.subversion.UpdateUpdater$TaskImpl.perform(UpdateUpdater.java:158)
at hudson.scm.subversion.WorkspaceUpdater$UpdateTask.delegateTo(WorkspaceUpdater.java:162)
at hudson.scm.SubversionSCM$CheckOutTask.perform(SubversionSCM.java:1001)
at hudson.scm.SubversionSCM$CheckOutTask.invoke(SubversionSCM.java:977)
at hudson.scm.SubversionSCM$CheckOutTask.invoke(SubversionSCM.java:953)
at hudson.FilePath$FileCallableWrapper.call(FilePath.java:2739)
at hudson.remoting.UserRequest.perform(UserRequest.java:153)
at hudson.remoting.UserRequest.perform(UserRequest.java:50)
at hudson.remoting.Request$2.run(Request.java:336)
at hudson.remoting.InterceptingExecutorService$1.call(InterceptingExecutorService.java:68)
at java.util.concurrent.FutureTask.run(FutureTask.java:266)
at java.util.concurrent.ThreadPoolExecutor.runWorker(ThreadPoolExecutor.java:1142)
at java.util.concurrent.ThreadPoolExecutor$Worker.run(ThreadPoolExecutor.java:617)
at java.lang.Thread.run(Thread.java:748)
Caused by: org.tmatesoft.sqljet.core.SqlJetException: java.io.IOException: Permission denied: error code is CANTOPEN
at org.tmatesoft.sqljet.core.table.SqlJetDb.getTemporaryDatabaseFile(SqlJetDb.java:484)
at org.tmatesoft.sqljet.core.table.SqlJetDb.access$1400(SqlJetDb.java:63)
at org.tmatesoft.sqljet.core.table.SqlJetDb$15.runWithLock(SqlJetDb.java:449)
at org.tmatesoft.sqljet.core.table.SqlJetDb$1.runSynchronized(SqlJetDb.java:172)
at org.tmatesoft.sqljet.core.table.engine.SqlJetEngine.runSynchronized(SqlJetEngine.java:217)
at org.tmatesoft.sqljet.core.table.SqlJetDb.runWithLock(SqlJetDb.java:170)
at org.tmatesoft.sqljet.core.table.SqlJetDb.getTemporaryDatabase(SqlJetDb.java:445)
at org.tmatesoft.svn.core.internal.db.SVNSqlJetDb.getTemporaryDb(SVNSqlJetDb.java:132)
at org.tmatesoft.svn.core.internal.wc17.db.SVNWCDb$BumpRevisionPostUpdate.bumpMovedAway(SVNWCDb.java:5419)
at org.tmatesoft.svn.core.internal.wc17.db.SVNWCDb$BumpRevisionPostUpdate.transaction(SVNWCDb.java:5414)
at org.tmatesoft.svn.core.internal.db.SVNSqlJetDb.runTransaction(SVNSqlJetDb.java:258)
at org.tmatesoft.svn.core.internal.db.SVNSqlJetDb.runTransaction(SVNSqlJetDb.java:252)
at org.tmatesoft.svn.core.internal.wc17.db.SVNWCDb.opBumpRevisionPostUpdate(SVNWCDb.java:5366)
at org.tmatesoft.svn.core.internal.wc17.SVNUpdateEditor17.closeEdit(SVNUpdateEditor17.java:1728)
at org.tmatesoft.svn.core.internal.wc.SVNCancellableEditor.closeEdit(SVNCancellableEditor.java:148)
at org.tmatesoft.svn.core.internal.io.dav.handlers.DAVEditorHandler.endElement(DAVEditorHandler.java:492)
at org.tmatesoft.svn.core.internal.io.dav.handlers.BasicDAVHandler.endElement(BasicDAVHandler.java:103)
at com.sun.org.apache.xerces.internal.parsers.AbstractSAXParser.endElement(AbstractSAXParser.java:609)
at com.sun.org.apache.xerces.internal.impl.XMLDocumentFragmentScannerImpl.scanEndElement(XMLDocumentFragmentScannerImpl.java:1782)
at com.sun.org.apache.xerces.internal.impl.XMLDocumentFragmentScannerImpl$FragmentContentDriver.next(XMLDocumentFragmentScannerImpl.java:2967)
at com.sun.org.apache.xerces.internal.impl.XMLDocumentScannerImpl.next(XMLDocumentScannerImpl.java:602)
at com.sun.org.apache.xerces.internal.impl.XMLNSDocumentScannerImpl.next(XMLNSDocumentScannerImpl.java:112)
at com.sun.org.apache.xerces.internal.impl.XMLDocumentFragmentScannerImpl.scanDocument(XMLDocumentFragmentScannerImpl.java:505)
at com.sun.org.apache.xerces.internal.parsers.XML11Configuration.parse(XML11Configuration.java:841)
at com.sun.org.apache.xerces.internal.parsers.XML11Configuration.parse(XML11Configuration.java:770)
at com.sun.org.apache.xerces.internal.parsers.XMLParser.parse(XMLParser.java:141)
at com.sun.org.apache.xerces.internal.parsers.AbstractSAXParser.parse(AbstractSAXParser.java:1213)
at com.sun.org.apache.xerces.internal.jaxp.SAXParserImpl$JAXPSAXParser.parse(SAXParserImpl.java:643)
at org.tmatesoft.svn.core.internal.io.dav.http.HTTPConnection.readData(HTTPConnection.java:937)
at org.tmatesoft.svn.core.internal.io.dav.http.HTTPConnection.readData(HTTPConnection.java:902)
at org.tmatesoft.svn.core.internal.io.dav.http.HTTPRequest.dispatch(HTTPRequest.java:220)
at org.tmatesoft.svn.core.internal.io.dav.http.HTTPConnection.request(HTTPConnection.java:490)
... 31 more
Caused by: java.io.IOException: Permission denied
at java.io.UnixFileSystem.createFileExclusively(Native Method)
at java.io.File.createTempFile(File.java:2024)
at java.io.File.createTempFile(File.java:2070)
at org.tmatesoft.sqljet.core.internal.fs.SqlJetFileSystem.getTempFile(SqlJetFileSystem.java:202)
at org.tmatesoft.sqljet.core.table.SqlJetDb.getTemporaryDatabaseFile(SqlJetDb.java:482)
... 62 more
ERROR: Subversion update failed
java.io.IOException: Permission denied
at java.io.UnixFileSystem.createFileExclusively(Native Method)
at java.io.File.createTempFile(File.java:2024)
at java.io.File.createTempFile(File.java:2070)
at org.tmatesoft.sqljet.core.internal.fs.SqlJetFileSystem.getTempFile(SqlJetFileSystem.java:202)
at org.tmatesoft.sqljet.core.table.SqlJetDb.getTemporaryDatabaseFile(SqlJetDb.java:482)
Caused: org.tmatesoft.sqljet.core.SqlJetException: java.io.IOException: Permission denied: error code is CANTOPEN
at org.tmatesoft.sqljet.core.table.SqlJetDb.getTemporaryDatabaseFile(SqlJetDb.java:484)
at org.tmatesoft.sqljet.core.table.SqlJetDb.access$1400(SqlJetDb.java:63)
at org.tmatesoft.sqljet.core.table.SqlJetDb$15.runWithLock(SqlJetDb.java:449)
at org.tmatesoft.sqljet.core.table.SqlJetDb$1.runSynchronized(SqlJetDb.java:172)
at org.tmatesoft.sqljet.core.table.engine.SqlJetEngine.runSynchronized(SqlJetEngine.java:217)
at org.tmatesoft.sqljet.core.table.SqlJetDb.runWithLock(SqlJetDb.java:170)
at org.tmatesoft.sqljet.core.table.SqlJetDb.getTemporaryDatabase(SqlJetDb.java:445)
at org.tmatesoft.svn.core.internal.db.SVNSqlJetDb.getTemporaryDb(SVNSqlJetDb.java:132)
at org.tmatesoft.svn.core.internal.wc17.db.SVNWCDb$BumpRevisionPostUpdate.bumpMovedAway(SVNWCDb.java:5419)
at org.tmatesoft.svn.core.internal.wc17.db.SVNWCDb$BumpRevisionPostUpdate.transaction(SVNWCDb.java:5414)
at org.tmatesoft.svn.core.internal.db.SVNSqlJetDb.runTransaction(SVNSqlJetDb.java:258)
at org.tmatesoft.svn.core.internal.db.SVNSqlJetDb.runTransaction(SVNSqlJetDb.java:252)
at org.tmatesoft.svn.core.internal.wc17.db.SVNWCDb.opBumpRevisionPostUpdate(SVNWCDb.java:5366)
at org.tmatesoft.svn.core.internal.wc17.SVNUpdateEditor17.closeEdit(SVNUpdateEditor17.java:1728)
at org.tmatesoft.svn.core.internal.wc.SVNCancellableEditor.closeEdit(SVNCancellableEditor.java:148)
at org.tmatesoft.svn.core.internal.io.dav.handlers.DAVEditorHandler.endElement(DAVEditorHandler.java:492)
at org.tmatesoft.svn.core.internal.io.dav.handlers.BasicDAVHandler.endElement(BasicDAVHandler.java:103)
at com.sun.org.apache.xerces.internal.parsers.AbstractSAXParser.endElement(AbstractSAXParser.java:609)
at com.sun.org.apache.xerces.internal.impl.XMLDocumentFragmentScannerImpl.scanEndElement(XMLDocumentFragmentScannerImpl.java:1782)
at com.sun.org.apache.xerces.internal.impl.XMLDocumentFragmentScannerImpl$FragmentContentDriver.next(XMLDocumentFragmentScannerImpl.java:2967)
at com.sun.org.apache.xerces.internal.impl.XMLDocumentScannerImpl.next(XMLDocumentScannerImpl.java:602)
at com.sun.org.apache.xerces.internal.impl.XMLNSDocumentScannerImpl.next(XMLNSDocumentScannerImpl.java:112)
at com.sun.org.apache.xerces.internal.impl.XMLDocumentFragmentScannerImpl.scanDocument(XMLDocumentFragmentScannerImpl.java:505)
at com.sun.org.apache.xerces.internal.parsers.XML11Configuration.parse(XML11Configuration.java:841)
at com.sun.org.apache.xerces.internal.parsers.XML11Configuration.parse(XML11Configuration.java:770)
at com.sun.org.apache.xerces.internal.parsers.XMLParser.parse(XMLParser.java:141)
at com.sun.org.apache.xerces.internal.parsers.AbstractSAXParser.parse(AbstractSAXParser.java:1213)
at com.sun.org.apache.xerces.internal.jaxp.SAXParserImpl$JAXPSAXParser.parse(SAXParserImpl.java:643)
at org.tmatesoft.svn.core.internal.io.dav.http.HTTPConnection.readData(HTTPConnection.java:937)
at org.tmatesoft.svn.core.internal.io.dav.http.HTTPConnection.readData(HTTPConnection.java:902)
at org.tmatesoft.svn.core.internal.io.dav.http.HTTPRequest.dispatch(HTTPRequest.java:220)
at org.tmatesoft.svn.core.internal.io.dav.http.HTTPConnection.request(HTTPConnection.java:490)
Caused: org.tmatesoft.svn.core.SVNException: svn: E200030: java.io.IOException: Permission denied
at org.tmatesoft.svn.core.internal.wc.SVNErrorManager.error(SVNErrorManager.java:70)
at org.tmatesoft.svn.core.internal.wc.SVNErrorManager.error(SVNErrorManager.java:57)
at org.tmatesoft.svn.core.internal.io.dav.http.HTTPConnection.request(HTTPConnection.java:798)
at org.tmatesoft.svn.core.internal.io.dav.http.HTTPConnection.request(HTTPConnection.java:391)
at org.tmatesoft.svn.core.internal.io.dav.http.HTTPConnection.request(HTTPConnection.java:379)
at org.tmatesoft.svn.core.internal.io.dav.DAVConnection.performHttpRequest(DAVConnection.java:862)
at org.tmatesoft.svn.core.internal.io.dav.DAVConnection.doReport(DAVConnection.java:359)
at org.tmatesoft.svn.core.internal.io.dav.DAVRepository.runReport(DAVRepository.java:1341)
at org.tmatesoft.svn.core.internal.io.dav.DAVRepository.update(DAVRepository.java:868)
at org.tmatesoft.svn.core.internal.wc2.ng.SvnNgAbstractUpdate.updateInternal(SvnNgAbstractUpdate.java:247)
at org.tmatesoft.svn.core.internal.wc2.ng.SvnNgAbstractUpdate.update(SvnNgAbstractUpdate.java:111)
at org.tmatesoft.svn.core.internal.wc2.ng.SvnNgUpdate.run(SvnNgUpdate.java:40)
at org.tmatesoft.svn.core.internal.wc2.ng.SvnNgUpdate.run(SvnNgUpdate.java:18)
at org.tmatesoft.svn.core.internal.wc2.ng.SvnNgOperationRunner.run(SvnNgOperationRunner.java:20)
at org.tmatesoft.svn.core.internal.wc2.SvnOperationRunner.run(SvnOperationRunner.java:21)
at org.tmatesoft.svn.core.wc2.SvnOperationFactory.run(SvnOperationFactory.java:1235)
at org.tmatesoft.svn.core.wc2.SvnOperation.run(SvnOperation.java:294)
at org.tmatesoft.svn.core.wc.SVNUpdateClient.doUpdate(SVNUpdateClient.java:311)
at org.tmatesoft.svn.core.wc.SVNUpdateClient.doUpdate(SVNUpdateClient.java:291)
at org.tmatesoft.svn.core.wc.SVNUpdateClient.doUpdate(SVNUpdateClient.java:387)
at hudson.scm.subversion.UpdateUpdater$TaskImpl.perform(UpdateUpdater.java:158)
Caused: hudson.scm.subversion.UpdaterException: failed to perform svn update
at hudson.scm.subversion.UpdateUpdater$TaskImpl.perform(UpdateUpdater.java:212)
at hudson.scm.subversion.WorkspaceUpdater$UpdateTask.delegateTo(WorkspaceUpdater.java:162)
at hudson.scm.SubversionSCM$CheckOutTask.perform(SubversionSCM.java:1001)
at hudson.scm.SubversionSCM$CheckOutTask.invoke(SubversionSCM.java:977)
at hudson.scm.SubversionSCM$CheckOutTask.invoke(SubversionSCM.java:953)
at hudson.FilePath$FileCallableWrapper.call(FilePath.java:2739)
at hudson.remoting.UserRequest.perform(UserRequest.java:153)
at hudson.remoting.UserRequest.perform(UserRequest.java:50)
at hudson.remoting.Request$2.run(Request.java:336)
at hudson.remoting.InterceptingExecutorService$1.call(InterceptingExecutorService.java:68)
at java.util.concurrent.FutureTask.run(FutureTask.java:266)
at java.util.concurrent.ThreadPoolExecutor.runWorker(ThreadPoolExecutor.java:1142)
at java.util.concurrent.ThreadPoolExecutor$Worker.run(ThreadPoolExecutor.java:617)
at java.lang.Thread.run(Thread.java:748)
Caused: java.io.IOException
at hudson.scm.subversion.UpdateUpdater$TaskImpl.perform(UpdateUpdater.java:212)
at hudson.scm.subversion.WorkspaceUpdater$UpdateTask.delegateTo(WorkspaceUpdater.java:162)
at hudson.scm.SubversionSCM$CheckOutTask.perform(SubversionSCM.java:1001)
at hudson.scm.SubversionSCM$CheckOutTask.invoke(SubversionSCM.java:977)
at hudson.scm.SubversionSCM$CheckOutTask.invoke(SubversionSCM.java:953)
at hudson.FilePath$FileCallableWrapper.call(FilePath.java:2739)
at hudson.remoting.UserRequest.perform(UserRequest.java:153)
at hudson.remoting.UserRequest.perform(UserRequest.java:50)
at hudson.remoting.Request$2.run(Request.java:336)
at hudson.remoting.InterceptingExecutorService$1.call(InterceptingExecutorService.java:68)
at java.util.concurrent.FutureTask.run(FutureTask.java:266)
at java.util.concurrent.ThreadPoolExecutor.runWorker(ThreadPoolExecutor.java:1142)
at java.util.concurrent.ThreadPoolExecutor$Worker.run(ThreadPoolExecutor.java:617)
at java.lang.Thread.run(Thread.java:748)
at ......remote call to H21(Native Method)
at hudson.remoting.Channel.attachCallSiteStackTrace(Channel.java:1545)
at hudson.remoting.UserResponse.retrieve(UserRequest.java:253)
at hudson.remoting.Channel.call(Channel.java:830)
at hudson.FilePath.act(FilePath.java:986)
Caused: java.io.IOException: remote file operation failed: <https://builds.apache.org/job/PDFBox-Trunk-jdk9/ws/> at hudson.remoting.Channel@4b715ff3:H21
at hudson.FilePath.act(FilePath.java:993)
at hudson.FilePath.act(FilePath.java:975)
at hudson.scm.SubversionSCM.checkout(SubversionSCM.java:902)
at hudson.scm.SubversionSCM.checkout(SubversionSCM.java:838)
at hudson.scm.SCM.checkout(SCM.java:495)
at hudson.model.AbstractProject.checkout(AbstractProject.java:1276)
at hudson.model.AbstractBuild$AbstractBuildExecution.defaultCheckout(AbstractBuild.java:560)
at jenkins.scm.SCMCheckoutStrategy.checkout(SCMCheckoutStrategy.java:86)
at hudson.model.AbstractBuild$AbstractBuildExecution.run(AbstractBuild.java:485)
at hudson.model.Run.execute(Run.java:1735)
at hudson.maven.MavenModuleSetBuild.run(MavenModuleSetBuild.java:542)
at hudson.model.ResourceController.execute(ResourceController.java:97)
at hudson.model.Executor.run(Executor.java:405)
Archiving artifacts
---------------------------------------------------------------------
To unsubscribe, e-mail: dev-unsubscribe@pdfbox.apache.org
For additional commands, e-mail: dev-help@pdfbox.apache.org
Build failed in Jenkins: PDFBox-Trunk-jdk9 #11
Posted by Apache Jenkins Server <je...@builds.apache.org>.
See <https://builds.apache.org/job/PDFBox-Trunk-jdk9/11/display/redirect>
------------------------------------------
[...truncated 28.10 KB...]
at org.tmatesoft.svn.core.internal.wc2.ng.SvnNgOperationRunner.run(SvnNgOperationRunner.java:20)
at org.tmatesoft.svn.core.internal.wc2.SvnOperationRunner.run(SvnOperationRunner.java:21)
at org.tmatesoft.svn.core.wc2.SvnOperationFactory.run(SvnOperationFactory.java:1235)
at org.tmatesoft.svn.core.wc2.SvnOperation.run(SvnOperation.java:294)
at org.tmatesoft.svn.core.wc.SVNUpdateClient.doUpdate(SVNUpdateClient.java:311)
at org.tmatesoft.svn.core.wc.SVNUpdateClient.doUpdate(SVNUpdateClient.java:291)
at org.tmatesoft.svn.core.wc.SVNUpdateClient.doUpdate(SVNUpdateClient.java:387)
at hudson.scm.subversion.UpdateUpdater$TaskImpl.perform(UpdateUpdater.java:158)
Caused: hudson.scm.subversion.UpdaterException: failed to perform svn update
at hudson.scm.subversion.UpdateUpdater$TaskImpl.perform(UpdateUpdater.java:212)
at hudson.scm.subversion.WorkspaceUpdater$UpdateTask.delegateTo(WorkspaceUpdater.java:162)
at hudson.scm.SubversionSCM$CheckOutTask.perform(SubversionSCM.java:1001)
at hudson.scm.SubversionSCM$CheckOutTask.invoke(SubversionSCM.java:977)
at hudson.scm.SubversionSCM$CheckOutTask.invoke(SubversionSCM.java:953)
at hudson.FilePath$FileCallableWrapper.call(FilePath.java:2739)
at hudson.remoting.UserRequest.perform(UserRequest.java:153)
at hudson.remoting.UserRequest.perform(UserRequest.java:50)
at hudson.remoting.Request$2.run(Request.java:336)
at hudson.remoting.InterceptingExecutorService$1.call(InterceptingExecutorService.java:68)
at java.util.concurrent.FutureTask.run(FutureTask.java:266)
at java.util.concurrent.ThreadPoolExecutor.runWorker(ThreadPoolExecutor.java:1142)
at java.util.concurrent.ThreadPoolExecutor$Worker.run(ThreadPoolExecutor.java:617)
at java.lang.Thread.run(Thread.java:748)
Caused: java.io.IOException
at hudson.scm.subversion.UpdateUpdater$TaskImpl.perform(UpdateUpdater.java:212)
at hudson.scm.subversion.WorkspaceUpdater$UpdateTask.delegateTo(WorkspaceUpdater.java:162)
at hudson.scm.SubversionSCM$CheckOutTask.perform(SubversionSCM.java:1001)
at hudson.scm.SubversionSCM$CheckOutTask.invoke(SubversionSCM.java:977)
at hudson.scm.SubversionSCM$CheckOutTask.invoke(SubversionSCM.java:953)
at hudson.FilePath$FileCallableWrapper.call(FilePath.java:2739)
at hudson.remoting.UserRequest.perform(UserRequest.java:153)
at hudson.remoting.UserRequest.perform(UserRequest.java:50)
at hudson.remoting.Request$2.run(Request.java:336)
at hudson.remoting.InterceptingExecutorService$1.call(InterceptingExecutorService.java:68)
at java.util.concurrent.FutureTask.run(FutureTask.java:266)
at java.util.concurrent.ThreadPoolExecutor.runWorker(ThreadPoolExecutor.java:1142)
at java.util.concurrent.ThreadPoolExecutor$Worker.run(ThreadPoolExecutor.java:617)
at java.lang.Thread.run(Thread.java:748)
at ......remote call to H21(Native Method)
at hudson.remoting.Channel.attachCallSiteStackTrace(Channel.java:1545)
at hudson.remoting.UserResponse.retrieve(UserRequest.java:253)
at hudson.remoting.Channel.call(Channel.java:830)
at hudson.FilePath.act(FilePath.java:986)
Caused: java.io.IOException: remote file operation failed: <https://builds.apache.org/job/PDFBox-Trunk-jdk9/ws/> at hudson.remoting.Channel@4b715ff3:H21
at hudson.FilePath.act(FilePath.java:993)
at hudson.FilePath.act(FilePath.java:975)
at hudson.scm.SubversionSCM.checkout(SubversionSCM.java:902)
at hudson.scm.SubversionSCM.checkout(SubversionSCM.java:838)
at hudson.scm.SCM.checkout(SCM.java:495)
at hudson.model.AbstractProject.checkout(AbstractProject.java:1276)
at hudson.model.AbstractBuild$AbstractBuildExecution.defaultCheckout(AbstractBuild.java:560)
at jenkins.scm.SCMCheckoutStrategy.checkout(SCMCheckoutStrategy.java:86)
at hudson.model.AbstractBuild$AbstractBuildExecution.run(AbstractBuild.java:485)
at hudson.model.Run.execute(Run.java:1735)
at hudson.maven.MavenModuleSetBuild.run(MavenModuleSetBuild.java:542)
at hudson.model.ResourceController.execute(ResourceController.java:97)
at hudson.model.Executor.run(Executor.java:405)
Retrying after 10 seconds
Cleaning up <https://builds.apache.org/job/PDFBox-Trunk-jdk9/ws/trunk>
Updating http://svn.apache.org/repos/asf/pdfbox/trunk at revision '2017-08-11T17:29:02.935 +0000'
ERROR: Failed to update http://svn.apache.org/repos/asf/pdfbox/trunk
org.tmatesoft.svn.core.SVNException: svn: E200030: java.io.IOException: Permission denied
at org.tmatesoft.svn.core.internal.wc.SVNErrorManager.error(SVNErrorManager.java:70)
at org.tmatesoft.svn.core.internal.wc.SVNErrorManager.error(SVNErrorManager.java:57)
at org.tmatesoft.svn.core.internal.io.dav.http.HTTPConnection.request(HTTPConnection.java:798)
at org.tmatesoft.svn.core.internal.io.dav.http.HTTPConnection.request(HTTPConnection.java:391)
at org.tmatesoft.svn.core.internal.io.dav.http.HTTPConnection.request(HTTPConnection.java:379)
at org.tmatesoft.svn.core.internal.io.dav.DAVConnection.performHttpRequest(DAVConnection.java:862)
at org.tmatesoft.svn.core.internal.io.dav.DAVConnection.doReport(DAVConnection.java:359)
at org.tmatesoft.svn.core.internal.io.dav.DAVRepository.runReport(DAVRepository.java:1341)
at org.tmatesoft.svn.core.internal.io.dav.DAVRepository.update(DAVRepository.java:868)
at org.tmatesoft.svn.core.internal.wc2.ng.SvnNgAbstractUpdate.updateInternal(SvnNgAbstractUpdate.java:247)
at org.tmatesoft.svn.core.internal.wc2.ng.SvnNgAbstractUpdate.update(SvnNgAbstractUpdate.java:111)
at org.tmatesoft.svn.core.internal.wc2.ng.SvnNgUpdate.run(SvnNgUpdate.java:40)
at org.tmatesoft.svn.core.internal.wc2.ng.SvnNgUpdate.run(SvnNgUpdate.java:18)
at org.tmatesoft.svn.core.internal.wc2.ng.SvnNgOperationRunner.run(SvnNgOperationRunner.java:20)
at org.tmatesoft.svn.core.internal.wc2.SvnOperationRunner.run(SvnOperationRunner.java:21)
at org.tmatesoft.svn.core.wc2.SvnOperationFactory.run(SvnOperationFactory.java:1235)
at org.tmatesoft.svn.core.wc2.SvnOperation.run(SvnOperation.java:294)
at org.tmatesoft.svn.core.wc.SVNUpdateClient.doUpdate(SVNUpdateClient.java:311)
at org.tmatesoft.svn.core.wc.SVNUpdateClient.doUpdate(SVNUpdateClient.java:291)
at org.tmatesoft.svn.core.wc.SVNUpdateClient.doUpdate(SVNUpdateClient.java:387)
at hudson.scm.subversion.UpdateUpdater$TaskImpl.perform(UpdateUpdater.java:158)
at hudson.scm.subversion.WorkspaceUpdater$UpdateTask.delegateTo(WorkspaceUpdater.java:162)
at hudson.scm.SubversionSCM$CheckOutTask.perform(SubversionSCM.java:1001)
at hudson.scm.SubversionSCM$CheckOutTask.invoke(SubversionSCM.java:977)
at hudson.scm.SubversionSCM$CheckOutTask.invoke(SubversionSCM.java:953)
at hudson.FilePath$FileCallableWrapper.call(FilePath.java:2739)
at hudson.remoting.UserRequest.perform(UserRequest.java:153)
at hudson.remoting.UserRequest.perform(UserRequest.java:50)
at hudson.remoting.Request$2.run(Request.java:336)
at hudson.remoting.InterceptingExecutorService$1.call(InterceptingExecutorService.java:68)
at java.util.concurrent.FutureTask.run(FutureTask.java:266)
at java.util.concurrent.ThreadPoolExecutor.runWorker(ThreadPoolExecutor.java:1142)
at java.util.concurrent.ThreadPoolExecutor$Worker.run(ThreadPoolExecutor.java:617)
at java.lang.Thread.run(Thread.java:748)
Caused by: org.tmatesoft.sqljet.core.SqlJetException: java.io.IOException: Permission denied: error code is CANTOPEN
at org.tmatesoft.sqljet.core.table.SqlJetDb.getTemporaryDatabaseFile(SqlJetDb.java:484)
at org.tmatesoft.sqljet.core.table.SqlJetDb.access$1400(SqlJetDb.java:63)
at org.tmatesoft.sqljet.core.table.SqlJetDb$15.runWithLock(SqlJetDb.java:449)
at org.tmatesoft.sqljet.core.table.SqlJetDb$1.runSynchronized(SqlJetDb.java:172)
at org.tmatesoft.sqljet.core.table.engine.SqlJetEngine.runSynchronized(SqlJetEngine.java:217)
at org.tmatesoft.sqljet.core.table.SqlJetDb.runWithLock(SqlJetDb.java:170)
at org.tmatesoft.sqljet.core.table.SqlJetDb.getTemporaryDatabase(SqlJetDb.java:445)
at org.tmatesoft.svn.core.internal.db.SVNSqlJetDb.getTemporaryDb(SVNSqlJetDb.java:132)
at org.tmatesoft.svn.core.internal.wc17.db.SVNWCDb$BumpRevisionPostUpdate.bumpMovedAway(SVNWCDb.java:5419)
at org.tmatesoft.svn.core.internal.wc17.db.SVNWCDb$BumpRevisionPostUpdate.transaction(SVNWCDb.java:5414)
at org.tmatesoft.svn.core.internal.db.SVNSqlJetDb.runTransaction(SVNSqlJetDb.java:258)
at org.tmatesoft.svn.core.internal.db.SVNSqlJetDb.runTransaction(SVNSqlJetDb.java:252)
at org.tmatesoft.svn.core.internal.wc17.db.SVNWCDb.opBumpRevisionPostUpdate(SVNWCDb.java:5366)
at org.tmatesoft.svn.core.internal.wc17.SVNUpdateEditor17.closeEdit(SVNUpdateEditor17.java:1728)
at org.tmatesoft.svn.core.internal.wc.SVNCancellableEditor.closeEdit(SVNCancellableEditor.java:148)
at org.tmatesoft.svn.core.internal.io.dav.handlers.DAVEditorHandler.endElement(DAVEditorHandler.java:492)
at org.tmatesoft.svn.core.internal.io.dav.handlers.BasicDAVHandler.endElement(BasicDAVHandler.java:103)
at com.sun.org.apache.xerces.internal.parsers.AbstractSAXParser.endElement(AbstractSAXParser.java:609)
at com.sun.org.apache.xerces.internal.impl.XMLDocumentFragmentScannerImpl.scanEndElement(XMLDocumentFragmentScannerImpl.java:1782)
at com.sun.org.apache.xerces.internal.impl.XMLDocumentFragmentScannerImpl$FragmentContentDriver.next(XMLDocumentFragmentScannerImpl.java:2967)
at com.sun.org.apache.xerces.internal.impl.XMLDocumentScannerImpl.next(XMLDocumentScannerImpl.java:602)
at com.sun.org.apache.xerces.internal.impl.XMLNSDocumentScannerImpl.next(XMLNSDocumentScannerImpl.java:112)
at com.sun.org.apache.xerces.internal.impl.XMLDocumentFragmentScannerImpl.scanDocument(XMLDocumentFragmentScannerImpl.java:505)
at com.sun.org.apache.xerces.internal.parsers.XML11Configuration.parse(XML11Configuration.java:841)
at com.sun.org.apache.xerces.internal.parsers.XML11Configuration.parse(XML11Configuration.java:770)
at com.sun.org.apache.xerces.internal.parsers.XMLParser.parse(XMLParser.java:141)
at com.sun.org.apache.xerces.internal.parsers.AbstractSAXParser.parse(AbstractSAXParser.java:1213)
at com.sun.org.apache.xerces.internal.jaxp.SAXParserImpl$JAXPSAXParser.parse(SAXParserImpl.java:643)
at org.tmatesoft.svn.core.internal.io.dav.http.HTTPConnection.readData(HTTPConnection.java:937)
at org.tmatesoft.svn.core.internal.io.dav.http.HTTPConnection.readData(HTTPConnection.java:902)
at org.tmatesoft.svn.core.internal.io.dav.http.HTTPRequest.dispatch(HTTPRequest.java:220)
at org.tmatesoft.svn.core.internal.io.dav.http.HTTPConnection.request(HTTPConnection.java:490)
... 31 more
Caused by: java.io.IOException: Permission denied
at java.io.UnixFileSystem.createFileExclusively(Native Method)
at java.io.File.createTempFile(File.java:2024)
at java.io.File.createTempFile(File.java:2070)
at org.tmatesoft.sqljet.core.internal.fs.SqlJetFileSystem.getTempFile(SqlJetFileSystem.java:202)
at org.tmatesoft.sqljet.core.table.SqlJetDb.getTemporaryDatabaseFile(SqlJetDb.java:482)
... 62 more
ERROR: Subversion update failed
java.io.IOException: Permission denied
at java.io.UnixFileSystem.createFileExclusively(Native Method)
at java.io.File.createTempFile(File.java:2024)
at java.io.File.createTempFile(File.java:2070)
at org.tmatesoft.sqljet.core.internal.fs.SqlJetFileSystem.getTempFile(SqlJetFileSystem.java:202)
at org.tmatesoft.sqljet.core.table.SqlJetDb.getTemporaryDatabaseFile(SqlJetDb.java:482)
Caused: org.tmatesoft.sqljet.core.SqlJetException: java.io.IOException: Permission denied: error code is CANTOPEN
at org.tmatesoft.sqljet.core.table.SqlJetDb.getTemporaryDatabaseFile(SqlJetDb.java:484)
at org.tmatesoft.sqljet.core.table.SqlJetDb.access$1400(SqlJetDb.java:63)
at org.tmatesoft.sqljet.core.table.SqlJetDb$15.runWithLock(SqlJetDb.java:449)
at org.tmatesoft.sqljet.core.table.SqlJetDb$1.runSynchronized(SqlJetDb.java:172)
at org.tmatesoft.sqljet.core.table.engine.SqlJetEngine.runSynchronized(SqlJetEngine.java:217)
at org.tmatesoft.sqljet.core.table.SqlJetDb.runWithLock(SqlJetDb.java:170)
at org.tmatesoft.sqljet.core.table.SqlJetDb.getTemporaryDatabase(SqlJetDb.java:445)
at org.tmatesoft.svn.core.internal.db.SVNSqlJetDb.getTemporaryDb(SVNSqlJetDb.java:132)
at org.tmatesoft.svn.core.internal.wc17.db.SVNWCDb$BumpRevisionPostUpdate.bumpMovedAway(SVNWCDb.java:5419)
at org.tmatesoft.svn.core.internal.wc17.db.SVNWCDb$BumpRevisionPostUpdate.transaction(SVNWCDb.java:5414)
at org.tmatesoft.svn.core.internal.db.SVNSqlJetDb.runTransaction(SVNSqlJetDb.java:258)
at org.tmatesoft.svn.core.internal.db.SVNSqlJetDb.runTransaction(SVNSqlJetDb.java:252)
at org.tmatesoft.svn.core.internal.wc17.db.SVNWCDb.opBumpRevisionPostUpdate(SVNWCDb.java:5366)
at org.tmatesoft.svn.core.internal.wc17.SVNUpdateEditor17.closeEdit(SVNUpdateEditor17.java:1728)
at org.tmatesoft.svn.core.internal.wc.SVNCancellableEditor.closeEdit(SVNCancellableEditor.java:148)
at org.tmatesoft.svn.core.internal.io.dav.handlers.DAVEditorHandler.endElement(DAVEditorHandler.java:492)
at org.tmatesoft.svn.core.internal.io.dav.handlers.BasicDAVHandler.endElement(BasicDAVHandler.java:103)
at com.sun.org.apache.xerces.internal.parsers.AbstractSAXParser.endElement(AbstractSAXParser.java:609)
at com.sun.org.apache.xerces.internal.impl.XMLDocumentFragmentScannerImpl.scanEndElement(XMLDocumentFragmentScannerImpl.java:1782)
at com.sun.org.apache.xerces.internal.impl.XMLDocumentFragmentScannerImpl$FragmentContentDriver.next(XMLDocumentFragmentScannerImpl.java:2967)
at com.sun.org.apache.xerces.internal.impl.XMLDocumentScannerImpl.next(XMLDocumentScannerImpl.java:602)
at com.sun.org.apache.xerces.internal.impl.XMLNSDocumentScannerImpl.next(XMLNSDocumentScannerImpl.java:112)
at com.sun.org.apache.xerces.internal.impl.XMLDocumentFragmentScannerImpl.scanDocument(XMLDocumentFragmentScannerImpl.java:505)
at com.sun.org.apache.xerces.internal.parsers.XML11Configuration.parse(XML11Configuration.java:841)
at com.sun.org.apache.xerces.internal.parsers.XML11Configuration.parse(XML11Configuration.java:770)
at com.sun.org.apache.xerces.internal.parsers.XMLParser.parse(XMLParser.java:141)
at com.sun.org.apache.xerces.internal.parsers.AbstractSAXParser.parse(AbstractSAXParser.java:1213)
at com.sun.org.apache.xerces.internal.jaxp.SAXParserImpl$JAXPSAXParser.parse(SAXParserImpl.java:643)
at org.tmatesoft.svn.core.internal.io.dav.http.HTTPConnection.readData(HTTPConnection.java:937)
at org.tmatesoft.svn.core.internal.io.dav.http.HTTPConnection.readData(HTTPConnection.java:902)
at org.tmatesoft.svn.core.internal.io.dav.http.HTTPRequest.dispatch(HTTPRequest.java:220)
at org.tmatesoft.svn.core.internal.io.dav.http.HTTPConnection.request(HTTPConnection.java:490)
Caused: org.tmatesoft.svn.core.SVNException: svn: E200030: java.io.IOException: Permission denied
at org.tmatesoft.svn.core.internal.wc.SVNErrorManager.error(SVNErrorManager.java:70)
at org.tmatesoft.svn.core.internal.wc.SVNErrorManager.error(SVNErrorManager.java:57)
at org.tmatesoft.svn.core.internal.io.dav.http.HTTPConnection.request(HTTPConnection.java:798)
at org.tmatesoft.svn.core.internal.io.dav.http.HTTPConnection.request(HTTPConnection.java:391)
at org.tmatesoft.svn.core.internal.io.dav.http.HTTPConnection.request(HTTPConnection.java:379)
at org.tmatesoft.svn.core.internal.io.dav.DAVConnection.performHttpRequest(DAVConnection.java:862)
at org.tmatesoft.svn.core.internal.io.dav.DAVConnection.doReport(DAVConnection.java:359)
at org.tmatesoft.svn.core.internal.io.dav.DAVRepository.runReport(DAVRepository.java:1341)
at org.tmatesoft.svn.core.internal.io.dav.DAVRepository.update(DAVRepository.java:868)
at org.tmatesoft.svn.core.internal.wc2.ng.SvnNgAbstractUpdate.updateInternal(SvnNgAbstractUpdate.java:247)
at org.tmatesoft.svn.core.internal.wc2.ng.SvnNgAbstractUpdate.update(SvnNgAbstractUpdate.java:111)
at org.tmatesoft.svn.core.internal.wc2.ng.SvnNgUpdate.run(SvnNgUpdate.java:40)
at org.tmatesoft.svn.core.internal.wc2.ng.SvnNgUpdate.run(SvnNgUpdate.java:18)
at org.tmatesoft.svn.core.internal.wc2.ng.SvnNgOperationRunner.run(SvnNgOperationRunner.java:20)
at org.tmatesoft.svn.core.internal.wc2.SvnOperationRunner.run(SvnOperationRunner.java:21)
at org.tmatesoft.svn.core.wc2.SvnOperationFactory.run(SvnOperationFactory.java:1235)
at org.tmatesoft.svn.core.wc2.SvnOperation.run(SvnOperation.java:294)
at org.tmatesoft.svn.core.wc.SVNUpdateClient.doUpdate(SVNUpdateClient.java:311)
at org.tmatesoft.svn.core.wc.SVNUpdateClient.doUpdate(SVNUpdateClient.java:291)
at org.tmatesoft.svn.core.wc.SVNUpdateClient.doUpdate(SVNUpdateClient.java:387)
at hudson.scm.subversion.UpdateUpdater$TaskImpl.perform(UpdateUpdater.java:158)
Caused: hudson.scm.subversion.UpdaterException: failed to perform svn update
at hudson.scm.subversion.UpdateUpdater$TaskImpl.perform(UpdateUpdater.java:212)
at hudson.scm.subversion.WorkspaceUpdater$UpdateTask.delegateTo(WorkspaceUpdater.java:162)
at hudson.scm.SubversionSCM$CheckOutTask.perform(SubversionSCM.java:1001)
at hudson.scm.SubversionSCM$CheckOutTask.invoke(SubversionSCM.java:977)
at hudson.scm.SubversionSCM$CheckOutTask.invoke(SubversionSCM.java:953)
at hudson.FilePath$FileCallableWrapper.call(FilePath.java:2739)
at hudson.remoting.UserRequest.perform(UserRequest.java:153)
at hudson.remoting.UserRequest.perform(UserRequest.java:50)
at hudson.remoting.Request$2.run(Request.java:336)
at hudson.remoting.InterceptingExecutorService$1.call(InterceptingExecutorService.java:68)
at java.util.concurrent.FutureTask.run(FutureTask.java:266)
at java.util.concurrent.ThreadPoolExecutor.runWorker(ThreadPoolExecutor.java:1142)
at java.util.concurrent.ThreadPoolExecutor$Worker.run(ThreadPoolExecutor.java:617)
at java.lang.Thread.run(Thread.java:748)
Caused: java.io.IOException
at hudson.scm.subversion.UpdateUpdater$TaskImpl.perform(UpdateUpdater.java:212)
at hudson.scm.subversion.WorkspaceUpdater$UpdateTask.delegateTo(WorkspaceUpdater.java:162)
at hudson.scm.SubversionSCM$CheckOutTask.perform(SubversionSCM.java:1001)
at hudson.scm.SubversionSCM$CheckOutTask.invoke(SubversionSCM.java:977)
at hudson.scm.SubversionSCM$CheckOutTask.invoke(SubversionSCM.java:953)
at hudson.FilePath$FileCallableWrapper.call(FilePath.java:2739)
at hudson.remoting.UserRequest.perform(UserRequest.java:153)
at hudson.remoting.UserRequest.perform(UserRequest.java:50)
at hudson.remoting.Request$2.run(Request.java:336)
at hudson.remoting.InterceptingExecutorService$1.call(InterceptingExecutorService.java:68)
at java.util.concurrent.FutureTask.run(FutureTask.java:266)
at java.util.concurrent.ThreadPoolExecutor.runWorker(ThreadPoolExecutor.java:1142)
at java.util.concurrent.ThreadPoolExecutor$Worker.run(ThreadPoolExecutor.java:617)
at java.lang.Thread.run(Thread.java:748)
at ......remote call to H21(Native Method)
at hudson.remoting.Channel.attachCallSiteStackTrace(Channel.java:1545)
at hudson.remoting.UserResponse.retrieve(UserRequest.java:253)
at hudson.remoting.Channel.call(Channel.java:830)
at hudson.FilePath.act(FilePath.java:986)
Caused: java.io.IOException: remote file operation failed: <https://builds.apache.org/job/PDFBox-Trunk-jdk9/ws/> at hudson.remoting.Channel@4b715ff3:H21
at hudson.FilePath.act(FilePath.java:993)
at hudson.FilePath.act(FilePath.java:975)
at hudson.scm.SubversionSCM.checkout(SubversionSCM.java:902)
at hudson.scm.SubversionSCM.checkout(SubversionSCM.java:838)
at hudson.scm.SCM.checkout(SCM.java:495)
at hudson.model.AbstractProject.checkout(AbstractProject.java:1276)
at hudson.model.AbstractBuild$AbstractBuildExecution.defaultCheckout(AbstractBuild.java:560)
at jenkins.scm.SCMCheckoutStrategy.checkout(SCMCheckoutStrategy.java:86)
at hudson.model.AbstractBuild$AbstractBuildExecution.run(AbstractBuild.java:485)
at hudson.model.Run.execute(Run.java:1735)
at hudson.maven.MavenModuleSetBuild.run(MavenModuleSetBuild.java:542)
at hudson.model.ResourceController.execute(ResourceController.java:97)
at hudson.model.Executor.run(Executor.java:405)
Archiving artifacts
---------------------------------------------------------------------
To unsubscribe, e-mail: dev-unsubscribe@pdfbox.apache.org
For additional commands, e-mail: dev-help@pdfbox.apache.org
Build failed in Jenkins: PDFBox-Trunk-jdk9 #10
Posted by Apache Jenkins Server <je...@builds.apache.org>.
See <https://builds.apache.org/job/PDFBox-Trunk-jdk9/10/display/redirect>
------------------------------------------
[...truncated 153.89 KB...]
A tools/src/test/java/org/apache/pdfbox
A tools/src/test/java/org/apache/pdfbox/tools
A tools/src/test/java/org/apache/pdfbox/tools/TestTextToPdf.java
A tools/src/test/java/org/apache/pdfbox/tools/TestPDFText2HTML.java
A tools/src/test/java/org/apache/pdfbox/tools/imageio
A tools/src/test/java/org/apache/pdfbox/tools/imageio/TestImageIOUtils.java
A tools/src/test/java/org/apache/pdfbox/tools/TestExtractText.java
A tools/src/test/resources
A tools/src/test/resources/org
A tools/src/test/resources/org/apache
A tools/src/test/resources/org/apache/pdfbox
AU tools/src/test/resources/org/apache/pdfbox/testPDFPackage.pdf
A tools/src/test/resources/input
A tools/src/test/resources/input/ImageIOUtil
AU tools/src/test/resources/input/ImageIOUtil/raw_image_demo.pdf
AU tools/src/test/resources/input/ImageIOUtil/JBIG2Image.pdf
AU tools/src/test/resources/input/ImageIOUtil/ccitt4-cib-test.pdf
AU tools/src/test/resources/input/ImageIOUtil/JPXTestCMYK.pdf
AU tools/src/test/resources/input/ImageIOUtil/JPXTestGrey.pdf
AU tools/src/test/resources/input/ImageIOUtil/png_demo.pdf
AU tools/src/test/resources/input/ImageIOUtil/jpeg_demo.pdf
AU tools/src/test/resources/input/ImageIOUtil/JPXTestRGB.pdf
A tools/src/test/resources/logging.properties
AU tools/pom.xml
AU LICENSE.txt
A preflight-app
A preflight-app/src
A preflight-app/src/main
A preflight-app/src/main/appended-resources
A preflight-app/src/main/appended-resources/META-INF
AU preflight-app/src/main/appended-resources/META-INF/NOTICE
AU preflight-app/src/main/appended-resources/META-INF/LICENSE
AU preflight-app/pom.xml
A debugger-app
A debugger-app/src
A debugger-app/src/main
A debugger-app/src/main/appended-resources
A debugger-app/src/main/appended-resources/META-INF
AU debugger-app/src/main/appended-resources/META-INF/NOTICE
AU debugger-app/src/main/appended-resources/META-INF/LICENSE
AU debugger-app/pom.xml
AU pdfbox-eclipse-formatter.xml
A .gitignore
AU KEYS
U .
At revision 1804710
Parsing POMs
Discovered a new module org.apache.pdfbox:pdfbox-reactor Apache PDFBox
Discovered a new module org.apache.pdfbox:pdfbox-parent PDFBox parent
Discovered a new module org.apache.pdfbox:fontbox Apache FontBox
Discovered a new module org.apache.pdfbox:xmpbox Apache XmpBox
Discovered a new module org.apache.pdfbox:pdfbox Apache PDFBox
Discovered a new module org.apache.pdfbox:preflight Apache Preflight
Discovered a new module org.apache.pdfbox:preflight-app Apache Preflight application
Discovered a new module org.apache.pdfbox:pdfbox-debugger Apache PDFBox Debugger
Discovered a new module org.apache.pdfbox:pdfbox-tools Apache PDFBox tools
Discovered a new module org.apache.pdfbox:pdfbox-app Apache PDFBox application
Discovered a new module org.apache.pdfbox:debugger-app Apache PDFBox Debugger application
Discovered a new module org.apache.pdfbox:pdfbox-examples Apache PDFBox examples
Modules changed, recalculating dependency graph
Established TCP socket on 34324
maven33-agent.jar already up to date
maven33-interceptor.jar already up to date
maven3-interceptor-commons.jar already up to date
[trunk] $ /home/jenkins/tools/java/jdk-9-b181-unlimited-security/bin/java -Xmx1g -XX:MaxPermSize=300m -cp /home/jenkins/jenkins-slave/maven33-agent.jar:/home/jenkins/tools/maven/apache-maven-3.3.3/boot/plexus-classworlds-2.5.2.jar:/home/jenkins/tools/maven/apache-maven-3.3.3/conf/logging jenkins.maven3.agent.Maven33Main /home/jenkins/tools/maven/apache-maven-3.3.3 /home/jenkins/jenkins-slave/slave.jar /home/jenkins/jenkins-slave/maven33-interceptor.jar /home/jenkins/jenkins-slave/maven3-interceptor-commons.jar 34324
Java HotSpot(TM) 64-Bit Server VM warning: Ignoring option MaxPermSize; support was removed in 8.0
<===[JENKINS REMOTING CAPACITY]===> channel started
WARNING: An illegal reflective access operation has occurred
WARNING: Illegal reflective access by hudson.remoting.RemoteClassLoader (file:/home/jenkins/jenkins-slave/slave.jar) to method java.lang.ClassLoader.getClassLoadingLock(java.lang.String)
WARNING: Please consider reporting this to the maintainers of hudson.remoting.RemoteClassLoader
WARNING: Use --illegal-access=warn to enable warnings of further illegal reflective access operations
WARNING: All illegal access operations will be denied in a future release
Executing Maven: -B -f <https://builds.apache.org/job/PDFBox-Trunk-jdk9/ws/trunk/pom.xml> -Dmaven.repo.local=/home/jenkins/jenkins-slave/maven-repositories/0 clean -Ppedantic -Dskip-bavaria=false
[INFO] Scanning for projects...
[INFO] ------------------------------------------------------------------------
[INFO] Reactor Build Order:
[INFO]
[INFO] PDFBox parent
[INFO] Apache FontBox
[INFO] Apache XmpBox
[INFO] Apache PDFBox
[INFO] Apache Preflight
[INFO] Apache Preflight application
[INFO] Apache PDFBox Debugger
[INFO] Apache PDFBox tools
[INFO] Apache PDFBox application
[INFO] Apache PDFBox Debugger application
[INFO] Apache PDFBox examples
[INFO] Apache PDFBox
[INFO]
[INFO] ------------------------------------------------------------------------
[INFO] Building PDFBox parent 3.0.0-SNAPSHOT
[INFO] ------------------------------------------------------------------------
[INFO]
[INFO] --- maven-clean-plugin:2.5:clean (default-clean) @ pdfbox-parent ---
[TASKS] Scanning folder '<https://builds.apache.org/job/PDFBox-Trunk-jdk9/ws/trunk/parent'> for files matching the pattern '**/*.java' - excludes:
[TASKS] Found 0 files to scan for tasks
Found 0 open tasks.
[INFO]
[INFO] ------------------------------------------------------------------------
[INFO] Building Apache FontBox 3.0.0-SNAPSHOT
[INFO] ------------------------------------------------------------------------
[INFO]
[INFO] --- maven-clean-plugin:2.5:clean (default-clean) @ fontbox ---
[TASKS] Scanning folder '<https://builds.apache.org/job/PDFBox-Trunk-jdk9/ws/trunk/fontbox'> for files matching the pattern '**/*.java' - excludes:
[TASKS] Found 105 files to scan for tasks
Found 12 open tasks.
[INFO]
[INFO] ------------------------------------------------------------------------
[INFO] Building Apache XmpBox 3.0.0-SNAPSHOT
[INFO] ------------------------------------------------------------------------
[INFO]
[INFO] --- maven-clean-plugin:2.5:clean (default-clean) @ xmpbox ---
[TASKS] Scanning folder '<https://builds.apache.org/job/PDFBox-Trunk-jdk9/ws/trunk/xmpbox'> for files matching the pattern '**/*.java' - excludes:
[TASKS] Found 106 files to scan for tasks
Found 7 open tasks.
[INFO]
[INFO] ------------------------------------------------------------------------
[INFO] Building Apache PDFBox 3.0.0-SNAPSHOT
[INFO] ------------------------------------------------------------------------
[INFO]
[INFO] --- maven-clean-plugin:2.5:clean (default-clean) @ pdfbox ---
[TASKS] Scanning folder '<https://builds.apache.org/job/PDFBox-Trunk-jdk9/ws/trunk/pdfbox'> for files matching the pattern '**/*.java' - excludes:
[TASKS] Found 656 files to scan for tasks
Found 248 open tasks.
[INFO]
[INFO] ------------------------------------------------------------------------
[INFO] Building Apache Preflight 3.0.0-SNAPSHOT
[INFO] ------------------------------------------------------------------------
[INFO]
[INFO] --- maven-clean-plugin:2.5:clean (default-clean) @ preflight ---
[TASKS] Scanning folder '<https://builds.apache.org/job/PDFBox-Trunk-jdk9/ws/trunk/preflight'> for files matching the pattern '**/*.java' - excludes:
[TASKS] Found 136 files to scan for tasks
Found 21 open tasks.
[INFO]
[INFO] ------------------------------------------------------------------------
[INFO] Building Apache Preflight application 3.0.0-SNAPSHOT
[INFO] ------------------------------------------------------------------------
[INFO]
[INFO] --- maven-clean-plugin:2.5:clean (default-clean) @ preflight-app ---
[TASKS] Scanning folder '<https://builds.apache.org/job/PDFBox-Trunk-jdk9/ws/trunk/preflight-app'> for files matching the pattern '**/*.java' - excludes:
[TASKS] Found 0 files to scan for tasks
Found 0 open tasks.
[INFO]
[INFO] ------------------------------------------------------------------------
[INFO] Building Apache PDFBox Debugger 3.0.0-SNAPSHOT
[INFO] ------------------------------------------------------------------------
[INFO]
[INFO] --- maven-clean-plugin:2.5:clean (default-clean) @ pdfbox-debugger ---
[TASKS] Scanning folder '<https://builds.apache.org/job/PDFBox-Trunk-jdk9/ws/trunk/debugger'> for files matching the pattern '**/*.java' - excludes:
[TASKS] Found 81 files to scan for tasks
Found 3 open tasks.
[INFO]
[INFO] ------------------------------------------------------------------------
[INFO] Building Apache PDFBox tools 3.0.0-SNAPSHOT
[INFO] ------------------------------------------------------------------------
[INFO]
[INFO] --- maven-clean-plugin:2.5:clean (default-clean) @ pdfbox-tools ---
[TASKS] Scanning folder '<https://builds.apache.org/job/PDFBox-Trunk-jdk9/ws/trunk/tools'> for files matching the pattern '**/*.java' - excludes:
[TASKS] Found 27 files to scan for tasks
Found 6 open tasks.
[INFO]
[INFO] ------------------------------------------------------------------------
[INFO] Building Apache PDFBox application 3.0.0-SNAPSHOT
[INFO] ------------------------------------------------------------------------
[INFO]
[INFO] --- maven-clean-plugin:2.5:clean (default-clean) @ pdfbox-app ---
[TASKS] Scanning folder '<https://builds.apache.org/job/PDFBox-Trunk-jdk9/ws/trunk/app'> for files matching the pattern '**/*.java' - excludes:
[TASKS] Found 0 files to scan for tasks
Found 0 open tasks.
[INFO]
[INFO] ------------------------------------------------------------------------
[INFO] Building Apache PDFBox Debugger application 3.0.0-SNAPSHOT
[INFO] ------------------------------------------------------------------------
[INFO]
[INFO] --- maven-clean-plugin:2.5:clean (default-clean) @ debugger-app ---
[TASKS] Scanning folder '<https://builds.apache.org/job/PDFBox-Trunk-jdk9/ws/trunk/debugger-app'> for files matching the pattern '**/*.java' - excludes:
[TASKS] Found 0 files to scan for tasks
Found 0 open tasks.
[INFO]
[INFO] ------------------------------------------------------------------------
[INFO] Building Apache PDFBox examples 3.0.0-SNAPSHOT
[INFO] ------------------------------------------------------------------------
[INFO]
[INFO] --- maven-clean-plugin:2.5:clean (default-clean) @ pdfbox-examples ---
[TASKS] Scanning folder '<https://builds.apache.org/job/PDFBox-Trunk-jdk9/ws/trunk/examples'> for files matching the pattern '**/*.java' - excludes:
[TASKS] Found 66 files to scan for tasks
Found 15 open tasks.
[INFO]
[INFO] ------------------------------------------------------------------------
[INFO] Building Apache PDFBox 3.0.0-SNAPSHOT
[INFO] ------------------------------------------------------------------------
[INFO]
[INFO] --- maven-clean-plugin:2.5:clean (default-clean) @ pdfbox-reactor ---
[TASKS] Scanning folder '<https://builds.apache.org/job/PDFBox-Trunk-jdk9/ws/trunk'> for files matching the pattern '**/*.java' - excludes: parent/**/*, fontbox/**/*, xmpbox/**/*, pdfbox/**/*, preflight/**/*, preflight-app/**/*, debugger/**/*, tools/**/*, app/**/*, debugger-app/**/*, examples/**/*
[TASKS] Found 0 files to scan for tasks
Found 0 open tasks.
[INFO] ------------------------------------------------------------------------
[INFO] Reactor Summary:
[INFO]
[INFO] PDFBox parent ...................................... SUCCESS [ 52.858 s]
[INFO] Apache FontBox ..................................... SUCCESS [ 8.083 s]
[INFO] Apache XmpBox ...................................... SUCCESS [ 2.805 s]
[INFO] Apache PDFBox ...................................... SUCCESS [ 35.782 s]
[INFO] Apache Preflight ................................... SUCCESS [ 5.141 s]
[INFO] Apache Preflight application ....................... SUCCESS [ 1.620 s]
[INFO] Apache PDFBox Debugger ............................. SUCCESS [ 2.741 s]
[INFO] Apache PDFBox tools ................................ SUCCESS [ 3.329 s]
[INFO] Apache PDFBox application .......................... SUCCESS [ 1.592 s]
[INFO] Apache PDFBox Debugger application ................. SUCCESS [ 1.582 s]
[INFO] Apache PDFBox examples ............................. SUCCESS [ 4.070 s]
[INFO] Apache PDFBox ...................................... SUCCESS [ 1.613 s]
[INFO] ------------------------------------------------------------------------
[INFO] BUILD SUCCESS
[INFO] ------------------------------------------------------------------------
[INFO] Total time: 02:26 min
[INFO] Finished at: 2017-08-10T19:31:08+00:00
[INFO] Final Memory: 32M/108M
[INFO] ------------------------------------------------------------------------
[JENKINS] Archiving <https://builds.apache.org/job/PDFBox-Trunk-jdk9/ws/trunk/xmpbox/pom.xml> to org.apache.pdfbox/xmpbox/3.0.0-SNAPSHOT/xmpbox-3.0.0-SNAPSHOT.pom
[Fast Archiver] No prior successful build to compare, so performing full copy of artifacts
[JENKINS] Archiving <https://builds.apache.org/job/PDFBox-Trunk-jdk9/ws/trunk/tools/pom.xml> to org.apache.pdfbox/pdfbox-tools/3.0.0-SNAPSHOT/pdfbox-tools-3.0.0-SNAPSHOT.pom
[Fast Archiver] No prior successful build to compare, so performing full copy of artifacts
[JENKINS] Archiving <https://builds.apache.org/job/PDFBox-Trunk-jdk9/ws/trunk/debugger/pom.xml> to org.apache.pdfbox/pdfbox-debugger/3.0.0-SNAPSHOT/pdfbox-debugger-3.0.0-SNAPSHOT.pom
[Fast Archiver] No prior successful build to compare, so performing full copy of artifacts
[JENKINS] Archiving <https://builds.apache.org/job/PDFBox-Trunk-jdk9/ws/trunk/preflight-app/pom.xml> to org.apache.pdfbox/preflight-app/3.0.0-SNAPSHOT/preflight-app-3.0.0-SNAPSHOT.pom
[Fast Archiver] No prior successful build to compare, so performing full copy of artifacts
[JENKINS] Archiving <https://builds.apache.org/job/PDFBox-Trunk-jdk9/ws/trunk/app/pom.xml> to org.apache.pdfbox/pdfbox-app/3.0.0-SNAPSHOT/pdfbox-app-3.0.0-SNAPSHOT.pom
[Fast Archiver] No prior successful build to compare, so performing full copy of artifacts
[JENKINS] Archiving <https://builds.apache.org/job/PDFBox-Trunk-jdk9/ws/trunk/examples/pom.xml> to org.apache.pdfbox/pdfbox-examples/3.0.0-SNAPSHOT/pdfbox-examples-3.0.0-SNAPSHOT.pom
[Fast Archiver] No prior successful build to compare, so performing full copy of artifacts
[JENKINS] Archiving <https://builds.apache.org/job/PDFBox-Trunk-jdk9/ws/trunk/preflight/pom.xml> to org.apache.pdfbox/preflight/3.0.0-SNAPSHOT/preflight-3.0.0-SNAPSHOT.pom
[Fast Archiver] No prior successful build to compare, so performing full copy of artifacts
[JENKINS] Archiving <https://builds.apache.org/job/PDFBox-Trunk-jdk9/ws/trunk/pom.xml> to org.apache.pdfbox/pdfbox-reactor/3.0.0-SNAPSHOT/pdfbox-reactor-3.0.0-SNAPSHOT.pom
[Fast Archiver] No prior successful build to compare, so performing full copy of artifacts
[JENKINS] Archiving <https://builds.apache.org/job/PDFBox-Trunk-jdk9/ws/trunk/parent/pom.xml> to org.apache.pdfbox/pdfbox-parent/3.0.0-SNAPSHOT/pdfbox-parent-3.0.0-SNAPSHOT.pom
[Fast Archiver] No prior successful build to compare, so performing full copy of artifacts
[JENKINS] Archiving <https://builds.apache.org/job/PDFBox-Trunk-jdk9/ws/trunk/pdfbox/pom.xml> to org.apache.pdfbox/pdfbox/3.0.0-SNAPSHOT/pdfbox-3.0.0-SNAPSHOT.pom
[Fast Archiver] No prior successful build to compare, so performing full copy of artifacts
[JENKINS] Archiving <https://builds.apache.org/job/PDFBox-Trunk-jdk9/ws/trunk/debugger-app/pom.xml> to org.apache.pdfbox/debugger-app/3.0.0-SNAPSHOT/debugger-app-3.0.0-SNAPSHOT.pom
[Fast Archiver] No prior successful build to compare, so performing full copy of artifacts
[JENKINS] Archiving <https://builds.apache.org/job/PDFBox-Trunk-jdk9/ws/trunk/fontbox/pom.xml> to org.apache.pdfbox/fontbox/3.0.0-SNAPSHOT/fontbox-3.0.0-SNAPSHOT.pom
[Fast Archiver] No prior successful build to compare, so performing full copy of artifacts
channel stopped
Archiving artifacts
ERROR: No artifacts found that match the file pattern "trunk/pdfbox/target/pdfbox.log". Configuration error?
ERROR: ?trunk/pdfbox/target/pdfbox.log? doesn?t match anything: ?trunk? exists but not ?trunk/pdfbox/target/pdfbox.log?
Build step 'Archive the artifacts' changed build result to FAILURE
---------------------------------------------------------------------
To unsubscribe, e-mail: dev-unsubscribe@pdfbox.apache.org
For additional commands, e-mail: dev-help@pdfbox.apache.org
Build failed in Jenkins: PDFBox-Trunk-jdk9 #9
Posted by Apache Jenkins Server <je...@builds.apache.org>.
See <https://builds.apache.org/job/PDFBox-Trunk-jdk9/9/display/redirect>
------------------------------------------
[...truncated 27.88 KB...]
at org.tmatesoft.svn.core.internal.wc2.ng.SvnNgOperationRunner.run(SvnNgOperationRunner.java:20)
at org.tmatesoft.svn.core.internal.wc2.SvnOperationRunner.run(SvnOperationRunner.java:21)
at org.tmatesoft.svn.core.wc2.SvnOperationFactory.run(SvnOperationFactory.java:1235)
at org.tmatesoft.svn.core.wc2.SvnOperation.run(SvnOperation.java:294)
at org.tmatesoft.svn.core.wc.SVNUpdateClient.doUpdate(SVNUpdateClient.java:311)
at org.tmatesoft.svn.core.wc.SVNUpdateClient.doUpdate(SVNUpdateClient.java:291)
at org.tmatesoft.svn.core.wc.SVNUpdateClient.doUpdate(SVNUpdateClient.java:387)
at hudson.scm.subversion.UpdateUpdater$TaskImpl.perform(UpdateUpdater.java:158)
Caused: hudson.scm.subversion.UpdaterException: failed to perform svn update
at hudson.scm.subversion.UpdateUpdater$TaskImpl.perform(UpdateUpdater.java:212)
at hudson.scm.subversion.WorkspaceUpdater$UpdateTask.delegateTo(WorkspaceUpdater.java:162)
at hudson.scm.SubversionSCM$CheckOutTask.perform(SubversionSCM.java:1001)
at hudson.scm.SubversionSCM$CheckOutTask.invoke(SubversionSCM.java:977)
at hudson.scm.SubversionSCM$CheckOutTask.invoke(SubversionSCM.java:953)
at hudson.FilePath$FileCallableWrapper.call(FilePath.java:2739)
at hudson.remoting.UserRequest.perform(UserRequest.java:153)
at hudson.remoting.UserRequest.perform(UserRequest.java:50)
at hudson.remoting.Request$2.run(Request.java:336)
at hudson.remoting.InterceptingExecutorService$1.call(InterceptingExecutorService.java:68)
at java.util.concurrent.FutureTask.run(FutureTask.java:266)
at java.util.concurrent.ThreadPoolExecutor.runWorker(ThreadPoolExecutor.java:1142)
at java.util.concurrent.ThreadPoolExecutor$Worker.run(ThreadPoolExecutor.java:617)
at java.lang.Thread.run(Thread.java:748)
Caused: java.io.IOException
at hudson.scm.subversion.UpdateUpdater$TaskImpl.perform(UpdateUpdater.java:212)
at hudson.scm.subversion.WorkspaceUpdater$UpdateTask.delegateTo(WorkspaceUpdater.java:162)
at hudson.scm.SubversionSCM$CheckOutTask.perform(SubversionSCM.java:1001)
at hudson.scm.SubversionSCM$CheckOutTask.invoke(SubversionSCM.java:977)
at hudson.scm.SubversionSCM$CheckOutTask.invoke(SubversionSCM.java:953)
at hudson.FilePath$FileCallableWrapper.call(FilePath.java:2739)
at hudson.remoting.UserRequest.perform(UserRequest.java:153)
at hudson.remoting.UserRequest.perform(UserRequest.java:50)
at hudson.remoting.Request$2.run(Request.java:336)
at hudson.remoting.InterceptingExecutorService$1.call(InterceptingExecutorService.java:68)
at java.util.concurrent.FutureTask.run(FutureTask.java:266)
at java.util.concurrent.ThreadPoolExecutor.runWorker(ThreadPoolExecutor.java:1142)
at java.util.concurrent.ThreadPoolExecutor$Worker.run(ThreadPoolExecutor.java:617)
at java.lang.Thread.run(Thread.java:748)
at ......remote call to H21(Native Method)
at hudson.remoting.Channel.attachCallSiteStackTrace(Channel.java:1545)
at hudson.remoting.UserResponse.retrieve(UserRequest.java:253)
at hudson.remoting.Channel.call(Channel.java:830)
at hudson.FilePath.act(FilePath.java:986)
Caused: java.io.IOException: remote file operation failed: <https://builds.apache.org/job/PDFBox-Trunk-jdk9/ws/> at hudson.remoting.Channel@4b715ff3:H21
at hudson.FilePath.act(FilePath.java:993)
at hudson.FilePath.act(FilePath.java:975)
at hudson.scm.SubversionSCM.checkout(SubversionSCM.java:902)
at hudson.scm.SubversionSCM.checkout(SubversionSCM.java:838)
at hudson.scm.SCM.checkout(SCM.java:495)
at hudson.model.AbstractProject.checkout(AbstractProject.java:1276)
at hudson.model.AbstractBuild$AbstractBuildExecution.defaultCheckout(AbstractBuild.java:560)
at jenkins.scm.SCMCheckoutStrategy.checkout(SCMCheckoutStrategy.java:86)
at hudson.model.AbstractBuild$AbstractBuildExecution.run(AbstractBuild.java:485)
at hudson.model.Run.execute(Run.java:1735)
at hudson.maven.MavenModuleSetBuild.run(MavenModuleSetBuild.java:542)
at hudson.model.ResourceController.execute(ResourceController.java:97)
at hudson.model.Executor.run(Executor.java:405)
Retrying after 10 seconds
Cleaning up <https://builds.apache.org/job/PDFBox-Trunk-jdk9/ws/trunk>
Updating http://svn.apache.org/repos/asf/pdfbox/trunk at revision '2017-08-10T18:27:08.612 +0000'
ERROR: Failed to update http://svn.apache.org/repos/asf/pdfbox/trunk
org.tmatesoft.svn.core.SVNException: svn: E200030: java.io.IOException: Permission denied
at org.tmatesoft.svn.core.internal.wc.SVNErrorManager.error(SVNErrorManager.java:70)
at org.tmatesoft.svn.core.internal.wc.SVNErrorManager.error(SVNErrorManager.java:57)
at org.tmatesoft.svn.core.internal.io.dav.http.HTTPConnection.request(HTTPConnection.java:798)
at org.tmatesoft.svn.core.internal.io.dav.http.HTTPConnection.request(HTTPConnection.java:391)
at org.tmatesoft.svn.core.internal.io.dav.http.HTTPConnection.request(HTTPConnection.java:379)
at org.tmatesoft.svn.core.internal.io.dav.DAVConnection.performHttpRequest(DAVConnection.java:862)
at org.tmatesoft.svn.core.internal.io.dav.DAVConnection.doReport(DAVConnection.java:359)
at org.tmatesoft.svn.core.internal.io.dav.DAVRepository.runReport(DAVRepository.java:1341)
at org.tmatesoft.svn.core.internal.io.dav.DAVRepository.update(DAVRepository.java:868)
at org.tmatesoft.svn.core.internal.wc2.ng.SvnNgAbstractUpdate.updateInternal(SvnNgAbstractUpdate.java:247)
at org.tmatesoft.svn.core.internal.wc2.ng.SvnNgAbstractUpdate.update(SvnNgAbstractUpdate.java:111)
at org.tmatesoft.svn.core.internal.wc2.ng.SvnNgUpdate.run(SvnNgUpdate.java:40)
at org.tmatesoft.svn.core.internal.wc2.ng.SvnNgUpdate.run(SvnNgUpdate.java:18)
at org.tmatesoft.svn.core.internal.wc2.ng.SvnNgOperationRunner.run(SvnNgOperationRunner.java:20)
at org.tmatesoft.svn.core.internal.wc2.SvnOperationRunner.run(SvnOperationRunner.java:21)
at org.tmatesoft.svn.core.wc2.SvnOperationFactory.run(SvnOperationFactory.java:1235)
at org.tmatesoft.svn.core.wc2.SvnOperation.run(SvnOperation.java:294)
at org.tmatesoft.svn.core.wc.SVNUpdateClient.doUpdate(SVNUpdateClient.java:311)
at org.tmatesoft.svn.core.wc.SVNUpdateClient.doUpdate(SVNUpdateClient.java:291)
at org.tmatesoft.svn.core.wc.SVNUpdateClient.doUpdate(SVNUpdateClient.java:387)
at hudson.scm.subversion.UpdateUpdater$TaskImpl.perform(UpdateUpdater.java:158)
at hudson.scm.subversion.WorkspaceUpdater$UpdateTask.delegateTo(WorkspaceUpdater.java:162)
at hudson.scm.SubversionSCM$CheckOutTask.perform(SubversionSCM.java:1001)
at hudson.scm.SubversionSCM$CheckOutTask.invoke(SubversionSCM.java:977)
at hudson.scm.SubversionSCM$CheckOutTask.invoke(SubversionSCM.java:953)
at hudson.FilePath$FileCallableWrapper.call(FilePath.java:2739)
at hudson.remoting.UserRequest.perform(UserRequest.java:153)
at hudson.remoting.UserRequest.perform(UserRequest.java:50)
at hudson.remoting.Request$2.run(Request.java:336)
at hudson.remoting.InterceptingExecutorService$1.call(InterceptingExecutorService.java:68)
at java.util.concurrent.FutureTask.run(FutureTask.java:266)
at java.util.concurrent.ThreadPoolExecutor.runWorker(ThreadPoolExecutor.java:1142)
at java.util.concurrent.ThreadPoolExecutor$Worker.run(ThreadPoolExecutor.java:617)
at java.lang.Thread.run(Thread.java:748)
Caused by: org.tmatesoft.sqljet.core.SqlJetException: java.io.IOException: Permission denied: error code is CANTOPEN
at org.tmatesoft.sqljet.core.table.SqlJetDb.getTemporaryDatabaseFile(SqlJetDb.java:484)
at org.tmatesoft.sqljet.core.table.SqlJetDb.access$1400(SqlJetDb.java:63)
at org.tmatesoft.sqljet.core.table.SqlJetDb$15.runWithLock(SqlJetDb.java:449)
at org.tmatesoft.sqljet.core.table.SqlJetDb$1.runSynchronized(SqlJetDb.java:172)
at org.tmatesoft.sqljet.core.table.engine.SqlJetEngine.runSynchronized(SqlJetEngine.java:217)
at org.tmatesoft.sqljet.core.table.SqlJetDb.runWithLock(SqlJetDb.java:170)
at org.tmatesoft.sqljet.core.table.SqlJetDb.getTemporaryDatabase(SqlJetDb.java:445)
at org.tmatesoft.svn.core.internal.db.SVNSqlJetDb.getTemporaryDb(SVNSqlJetDb.java:132)
at org.tmatesoft.svn.core.internal.wc17.db.SVNWCDb$BumpRevisionPostUpdate.bumpMovedAway(SVNWCDb.java:5419)
at org.tmatesoft.svn.core.internal.wc17.db.SVNWCDb$BumpRevisionPostUpdate.transaction(SVNWCDb.java:5414)
at org.tmatesoft.svn.core.internal.db.SVNSqlJetDb.runTransaction(SVNSqlJetDb.java:258)
at org.tmatesoft.svn.core.internal.db.SVNSqlJetDb.runTransaction(SVNSqlJetDb.java:252)
at org.tmatesoft.svn.core.internal.wc17.db.SVNWCDb.opBumpRevisionPostUpdate(SVNWCDb.java:5366)
at org.tmatesoft.svn.core.internal.wc17.SVNUpdateEditor17.closeEdit(SVNUpdateEditor17.java:1728)
at org.tmatesoft.svn.core.internal.wc.SVNCancellableEditor.closeEdit(SVNCancellableEditor.java:148)
at org.tmatesoft.svn.core.internal.io.dav.handlers.DAVEditorHandler.endElement(DAVEditorHandler.java:492)
at org.tmatesoft.svn.core.internal.io.dav.handlers.BasicDAVHandler.endElement(BasicDAVHandler.java:103)
at com.sun.org.apache.xerces.internal.parsers.AbstractSAXParser.endElement(AbstractSAXParser.java:609)
at com.sun.org.apache.xerces.internal.impl.XMLDocumentFragmentScannerImpl.scanEndElement(XMLDocumentFragmentScannerImpl.java:1782)
at com.sun.org.apache.xerces.internal.impl.XMLDocumentFragmentScannerImpl$FragmentContentDriver.next(XMLDocumentFragmentScannerImpl.java:2967)
at com.sun.org.apache.xerces.internal.impl.XMLDocumentScannerImpl.next(XMLDocumentScannerImpl.java:602)
at com.sun.org.apache.xerces.internal.impl.XMLNSDocumentScannerImpl.next(XMLNSDocumentScannerImpl.java:112)
at com.sun.org.apache.xerces.internal.impl.XMLDocumentFragmentScannerImpl.scanDocument(XMLDocumentFragmentScannerImpl.java:505)
at com.sun.org.apache.xerces.internal.parsers.XML11Configuration.parse(XML11Configuration.java:841)
at com.sun.org.apache.xerces.internal.parsers.XML11Configuration.parse(XML11Configuration.java:770)
at com.sun.org.apache.xerces.internal.parsers.XMLParser.parse(XMLParser.java:141)
at com.sun.org.apache.xerces.internal.parsers.AbstractSAXParser.parse(AbstractSAXParser.java:1213)
at com.sun.org.apache.xerces.internal.jaxp.SAXParserImpl$JAXPSAXParser.parse(SAXParserImpl.java:643)
at org.tmatesoft.svn.core.internal.io.dav.http.HTTPConnection.readData(HTTPConnection.java:937)
at org.tmatesoft.svn.core.internal.io.dav.http.HTTPConnection.readData(HTTPConnection.java:902)
at org.tmatesoft.svn.core.internal.io.dav.http.HTTPRequest.dispatch(HTTPRequest.java:220)
at org.tmatesoft.svn.core.internal.io.dav.http.HTTPConnection.request(HTTPConnection.java:490)
... 31 more
Caused by: java.io.IOException: Permission denied
at java.io.UnixFileSystem.createFileExclusively(Native Method)
at java.io.File.createTempFile(File.java:2024)
at java.io.File.createTempFile(File.java:2070)
at org.tmatesoft.sqljet.core.internal.fs.SqlJetFileSystem.getTempFile(SqlJetFileSystem.java:202)
at org.tmatesoft.sqljet.core.table.SqlJetDb.getTemporaryDatabaseFile(SqlJetDb.java:482)
... 62 more
ERROR: Subversion update failed
java.io.IOException: Permission denied
at java.io.UnixFileSystem.createFileExclusively(Native Method)
at java.io.File.createTempFile(File.java:2024)
at java.io.File.createTempFile(File.java:2070)
at org.tmatesoft.sqljet.core.internal.fs.SqlJetFileSystem.getTempFile(SqlJetFileSystem.java:202)
at org.tmatesoft.sqljet.core.table.SqlJetDb.getTemporaryDatabaseFile(SqlJetDb.java:482)
Caused: org.tmatesoft.sqljet.core.SqlJetException: java.io.IOException: Permission denied: error code is CANTOPEN
at org.tmatesoft.sqljet.core.table.SqlJetDb.getTemporaryDatabaseFile(SqlJetDb.java:484)
at org.tmatesoft.sqljet.core.table.SqlJetDb.access$1400(SqlJetDb.java:63)
at org.tmatesoft.sqljet.core.table.SqlJetDb$15.runWithLock(SqlJetDb.java:449)
at org.tmatesoft.sqljet.core.table.SqlJetDb$1.runSynchronized(SqlJetDb.java:172)
at org.tmatesoft.sqljet.core.table.engine.SqlJetEngine.runSynchronized(SqlJetEngine.java:217)
at org.tmatesoft.sqljet.core.table.SqlJetDb.runWithLock(SqlJetDb.java:170)
at org.tmatesoft.sqljet.core.table.SqlJetDb.getTemporaryDatabase(SqlJetDb.java:445)
at org.tmatesoft.svn.core.internal.db.SVNSqlJetDb.getTemporaryDb(SVNSqlJetDb.java:132)
at org.tmatesoft.svn.core.internal.wc17.db.SVNWCDb$BumpRevisionPostUpdate.bumpMovedAway(SVNWCDb.java:5419)
at org.tmatesoft.svn.core.internal.wc17.db.SVNWCDb$BumpRevisionPostUpdate.transaction(SVNWCDb.java:5414)
at org.tmatesoft.svn.core.internal.db.SVNSqlJetDb.runTransaction(SVNSqlJetDb.java:258)
at org.tmatesoft.svn.core.internal.db.SVNSqlJetDb.runTransaction(SVNSqlJetDb.java:252)
at org.tmatesoft.svn.core.internal.wc17.db.SVNWCDb.opBumpRevisionPostUpdate(SVNWCDb.java:5366)
at org.tmatesoft.svn.core.internal.wc17.SVNUpdateEditor17.closeEdit(SVNUpdateEditor17.java:1728)
at org.tmatesoft.svn.core.internal.wc.SVNCancellableEditor.closeEdit(SVNCancellableEditor.java:148)
at org.tmatesoft.svn.core.internal.io.dav.handlers.DAVEditorHandler.endElement(DAVEditorHandler.java:492)
at org.tmatesoft.svn.core.internal.io.dav.handlers.BasicDAVHandler.endElement(BasicDAVHandler.java:103)
at com.sun.org.apache.xerces.internal.parsers.AbstractSAXParser.endElement(AbstractSAXParser.java:609)
at com.sun.org.apache.xerces.internal.impl.XMLDocumentFragmentScannerImpl.scanEndElement(XMLDocumentFragmentScannerImpl.java:1782)
at com.sun.org.apache.xerces.internal.impl.XMLDocumentFragmentScannerImpl$FragmentContentDriver.next(XMLDocumentFragmentScannerImpl.java:2967)
at com.sun.org.apache.xerces.internal.impl.XMLDocumentScannerImpl.next(XMLDocumentScannerImpl.java:602)
at com.sun.org.apache.xerces.internal.impl.XMLNSDocumentScannerImpl.next(XMLNSDocumentScannerImpl.java:112)
at com.sun.org.apache.xerces.internal.impl.XMLDocumentFragmentScannerImpl.scanDocument(XMLDocumentFragmentScannerImpl.java:505)
at com.sun.org.apache.xerces.internal.parsers.XML11Configuration.parse(XML11Configuration.java:841)
at com.sun.org.apache.xerces.internal.parsers.XML11Configuration.parse(XML11Configuration.java:770)
at com.sun.org.apache.xerces.internal.parsers.XMLParser.parse(XMLParser.java:141)
at com.sun.org.apache.xerces.internal.parsers.AbstractSAXParser.parse(AbstractSAXParser.java:1213)
at com.sun.org.apache.xerces.internal.jaxp.SAXParserImpl$JAXPSAXParser.parse(SAXParserImpl.java:643)
at org.tmatesoft.svn.core.internal.io.dav.http.HTTPConnection.readData(HTTPConnection.java:937)
at org.tmatesoft.svn.core.internal.io.dav.http.HTTPConnection.readData(HTTPConnection.java:902)
at org.tmatesoft.svn.core.internal.io.dav.http.HTTPRequest.dispatch(HTTPRequest.java:220)
at org.tmatesoft.svn.core.internal.io.dav.http.HTTPConnection.request(HTTPConnection.java:490)
Caused: org.tmatesoft.svn.core.SVNException: svn: E200030: java.io.IOException: Permission denied
at org.tmatesoft.svn.core.internal.wc.SVNErrorManager.error(SVNErrorManager.java:70)
at org.tmatesoft.svn.core.internal.wc.SVNErrorManager.error(SVNErrorManager.java:57)
at org.tmatesoft.svn.core.internal.io.dav.http.HTTPConnection.request(HTTPConnection.java:798)
at org.tmatesoft.svn.core.internal.io.dav.http.HTTPConnection.request(HTTPConnection.java:391)
at org.tmatesoft.svn.core.internal.io.dav.http.HTTPConnection.request(HTTPConnection.java:379)
at org.tmatesoft.svn.core.internal.io.dav.DAVConnection.performHttpRequest(DAVConnection.java:862)
at org.tmatesoft.svn.core.internal.io.dav.DAVConnection.doReport(DAVConnection.java:359)
at org.tmatesoft.svn.core.internal.io.dav.DAVRepository.runReport(DAVRepository.java:1341)
at org.tmatesoft.svn.core.internal.io.dav.DAVRepository.update(DAVRepository.java:868)
at org.tmatesoft.svn.core.internal.wc2.ng.SvnNgAbstractUpdate.updateInternal(SvnNgAbstractUpdate.java:247)
at org.tmatesoft.svn.core.internal.wc2.ng.SvnNgAbstractUpdate.update(SvnNgAbstractUpdate.java:111)
at org.tmatesoft.svn.core.internal.wc2.ng.SvnNgUpdate.run(SvnNgUpdate.java:40)
at org.tmatesoft.svn.core.internal.wc2.ng.SvnNgUpdate.run(SvnNgUpdate.java:18)
at org.tmatesoft.svn.core.internal.wc2.ng.SvnNgOperationRunner.run(SvnNgOperationRunner.java:20)
at org.tmatesoft.svn.core.internal.wc2.SvnOperationRunner.run(SvnOperationRunner.java:21)
at org.tmatesoft.svn.core.wc2.SvnOperationFactory.run(SvnOperationFactory.java:1235)
at org.tmatesoft.svn.core.wc2.SvnOperation.run(SvnOperation.java:294)
at org.tmatesoft.svn.core.wc.SVNUpdateClient.doUpdate(SVNUpdateClient.java:311)
at org.tmatesoft.svn.core.wc.SVNUpdateClient.doUpdate(SVNUpdateClient.java:291)
at org.tmatesoft.svn.core.wc.SVNUpdateClient.doUpdate(SVNUpdateClient.java:387)
at hudson.scm.subversion.UpdateUpdater$TaskImpl.perform(UpdateUpdater.java:158)
Caused: hudson.scm.subversion.UpdaterException: failed to perform svn update
at hudson.scm.subversion.UpdateUpdater$TaskImpl.perform(UpdateUpdater.java:212)
at hudson.scm.subversion.WorkspaceUpdater$UpdateTask.delegateTo(WorkspaceUpdater.java:162)
at hudson.scm.SubversionSCM$CheckOutTask.perform(SubversionSCM.java:1001)
at hudson.scm.SubversionSCM$CheckOutTask.invoke(SubversionSCM.java:977)
at hudson.scm.SubversionSCM$CheckOutTask.invoke(SubversionSCM.java:953)
at hudson.FilePath$FileCallableWrapper.call(FilePath.java:2739)
at hudson.remoting.UserRequest.perform(UserRequest.java:153)
at hudson.remoting.UserRequest.perform(UserRequest.java:50)
at hudson.remoting.Request$2.run(Request.java:336)
at hudson.remoting.InterceptingExecutorService$1.call(InterceptingExecutorService.java:68)
at java.util.concurrent.FutureTask.run(FutureTask.java:266)
at java.util.concurrent.ThreadPoolExecutor.runWorker(ThreadPoolExecutor.java:1142)
at java.util.concurrent.ThreadPoolExecutor$Worker.run(ThreadPoolExecutor.java:617)
at java.lang.Thread.run(Thread.java:748)
Caused: java.io.IOException
at hudson.scm.subversion.UpdateUpdater$TaskImpl.perform(UpdateUpdater.java:212)
at hudson.scm.subversion.WorkspaceUpdater$UpdateTask.delegateTo(WorkspaceUpdater.java:162)
at hudson.scm.SubversionSCM$CheckOutTask.perform(SubversionSCM.java:1001)
at hudson.scm.SubversionSCM$CheckOutTask.invoke(SubversionSCM.java:977)
at hudson.scm.SubversionSCM$CheckOutTask.invoke(SubversionSCM.java:953)
at hudson.FilePath$FileCallableWrapper.call(FilePath.java:2739)
at hudson.remoting.UserRequest.perform(UserRequest.java:153)
at hudson.remoting.UserRequest.perform(UserRequest.java:50)
at hudson.remoting.Request$2.run(Request.java:336)
at hudson.remoting.InterceptingExecutorService$1.call(InterceptingExecutorService.java:68)
at java.util.concurrent.FutureTask.run(FutureTask.java:266)
at java.util.concurrent.ThreadPoolExecutor.runWorker(ThreadPoolExecutor.java:1142)
at java.util.concurrent.ThreadPoolExecutor$Worker.run(ThreadPoolExecutor.java:617)
at java.lang.Thread.run(Thread.java:748)
at ......remote call to H21(Native Method)
at hudson.remoting.Channel.attachCallSiteStackTrace(Channel.java:1545)
at hudson.remoting.UserResponse.retrieve(UserRequest.java:253)
at hudson.remoting.Channel.call(Channel.java:830)
at hudson.FilePath.act(FilePath.java:986)
Caused: java.io.IOException: remote file operation failed: <https://builds.apache.org/job/PDFBox-Trunk-jdk9/ws/> at hudson.remoting.Channel@4b715ff3:H21
at hudson.FilePath.act(FilePath.java:993)
at hudson.FilePath.act(FilePath.java:975)
at hudson.scm.SubversionSCM.checkout(SubversionSCM.java:902)
at hudson.scm.SubversionSCM.checkout(SubversionSCM.java:838)
at hudson.scm.SCM.checkout(SCM.java:495)
at hudson.model.AbstractProject.checkout(AbstractProject.java:1276)
at hudson.model.AbstractBuild$AbstractBuildExecution.defaultCheckout(AbstractBuild.java:560)
at jenkins.scm.SCMCheckoutStrategy.checkout(SCMCheckoutStrategy.java:86)
at hudson.model.AbstractBuild$AbstractBuildExecution.run(AbstractBuild.java:485)
at hudson.model.Run.execute(Run.java:1735)
at hudson.maven.MavenModuleSetBuild.run(MavenModuleSetBuild.java:542)
at hudson.model.ResourceController.execute(ResourceController.java:97)
at hudson.model.Executor.run(Executor.java:405)
Archiving artifacts
---------------------------------------------------------------------
To unsubscribe, e-mail: dev-unsubscribe@pdfbox.apache.org
For additional commands, e-mail: dev-help@pdfbox.apache.org
Build failed in Jenkins: PDFBox-Trunk-jdk9 #8
Posted by Apache Jenkins Server <je...@builds.apache.org>.
See <https://builds.apache.org/job/PDFBox-Trunk-jdk9/8/display/redirect>
------------------------------------------
[...truncated 27.88 KB...]
at org.tmatesoft.svn.core.internal.wc2.ng.SvnNgOperationRunner.run(SvnNgOperationRunner.java:20)
at org.tmatesoft.svn.core.internal.wc2.SvnOperationRunner.run(SvnOperationRunner.java:21)
at org.tmatesoft.svn.core.wc2.SvnOperationFactory.run(SvnOperationFactory.java:1235)
at org.tmatesoft.svn.core.wc2.SvnOperation.run(SvnOperation.java:294)
at org.tmatesoft.svn.core.wc.SVNUpdateClient.doUpdate(SVNUpdateClient.java:311)
at org.tmatesoft.svn.core.wc.SVNUpdateClient.doUpdate(SVNUpdateClient.java:291)
at org.tmatesoft.svn.core.wc.SVNUpdateClient.doUpdate(SVNUpdateClient.java:387)
at hudson.scm.subversion.UpdateUpdater$TaskImpl.perform(UpdateUpdater.java:158)
Caused: hudson.scm.subversion.UpdaterException: failed to perform svn update
at hudson.scm.subversion.UpdateUpdater$TaskImpl.perform(UpdateUpdater.java:212)
at hudson.scm.subversion.WorkspaceUpdater$UpdateTask.delegateTo(WorkspaceUpdater.java:162)
at hudson.scm.SubversionSCM$CheckOutTask.perform(SubversionSCM.java:1001)
at hudson.scm.SubversionSCM$CheckOutTask.invoke(SubversionSCM.java:977)
at hudson.scm.SubversionSCM$CheckOutTask.invoke(SubversionSCM.java:953)
at hudson.FilePath$FileCallableWrapper.call(FilePath.java:2739)
at hudson.remoting.UserRequest.perform(UserRequest.java:153)
at hudson.remoting.UserRequest.perform(UserRequest.java:50)
at hudson.remoting.Request$2.run(Request.java:336)
at hudson.remoting.InterceptingExecutorService$1.call(InterceptingExecutorService.java:68)
at java.util.concurrent.FutureTask.run(FutureTask.java:266)
at java.util.concurrent.ThreadPoolExecutor.runWorker(ThreadPoolExecutor.java:1142)
at java.util.concurrent.ThreadPoolExecutor$Worker.run(ThreadPoolExecutor.java:617)
at java.lang.Thread.run(Thread.java:748)
Caused: java.io.IOException
at hudson.scm.subversion.UpdateUpdater$TaskImpl.perform(UpdateUpdater.java:212)
at hudson.scm.subversion.WorkspaceUpdater$UpdateTask.delegateTo(WorkspaceUpdater.java:162)
at hudson.scm.SubversionSCM$CheckOutTask.perform(SubversionSCM.java:1001)
at hudson.scm.SubversionSCM$CheckOutTask.invoke(SubversionSCM.java:977)
at hudson.scm.SubversionSCM$CheckOutTask.invoke(SubversionSCM.java:953)
at hudson.FilePath$FileCallableWrapper.call(FilePath.java:2739)
at hudson.remoting.UserRequest.perform(UserRequest.java:153)
at hudson.remoting.UserRequest.perform(UserRequest.java:50)
at hudson.remoting.Request$2.run(Request.java:336)
at hudson.remoting.InterceptingExecutorService$1.call(InterceptingExecutorService.java:68)
at java.util.concurrent.FutureTask.run(FutureTask.java:266)
at java.util.concurrent.ThreadPoolExecutor.runWorker(ThreadPoolExecutor.java:1142)
at java.util.concurrent.ThreadPoolExecutor$Worker.run(ThreadPoolExecutor.java:617)
at java.lang.Thread.run(Thread.java:748)
at ......remote call to H21(Native Method)
at hudson.remoting.Channel.attachCallSiteStackTrace(Channel.java:1545)
at hudson.remoting.UserResponse.retrieve(UserRequest.java:253)
at hudson.remoting.Channel.call(Channel.java:830)
at hudson.FilePath.act(FilePath.java:986)
Caused: java.io.IOException: remote file operation failed: <https://builds.apache.org/job/PDFBox-Trunk-jdk9/ws/> at hudson.remoting.Channel@4b715ff3:H21
at hudson.FilePath.act(FilePath.java:993)
at hudson.FilePath.act(FilePath.java:975)
at hudson.scm.SubversionSCM.checkout(SubversionSCM.java:902)
at hudson.scm.SubversionSCM.checkout(SubversionSCM.java:838)
at hudson.scm.SCM.checkout(SCM.java:495)
at hudson.model.AbstractProject.checkout(AbstractProject.java:1276)
at hudson.model.AbstractBuild$AbstractBuildExecution.defaultCheckout(AbstractBuild.java:560)
at jenkins.scm.SCMCheckoutStrategy.checkout(SCMCheckoutStrategy.java:86)
at hudson.model.AbstractBuild$AbstractBuildExecution.run(AbstractBuild.java:485)
at hudson.model.Run.execute(Run.java:1735)
at hudson.maven.MavenModuleSetBuild.run(MavenModuleSetBuild.java:542)
at hudson.model.ResourceController.execute(ResourceController.java:97)
at hudson.model.Executor.run(Executor.java:405)
Retrying after 10 seconds
Cleaning up <https://builds.apache.org/job/PDFBox-Trunk-jdk9/ws/trunk>
Updating http://svn.apache.org/repos/asf/pdfbox/trunk at revision '2017-08-10T17:27:08.816 +0000'
ERROR: Failed to update http://svn.apache.org/repos/asf/pdfbox/trunk
org.tmatesoft.svn.core.SVNException: svn: E200030: java.io.IOException: Permission denied
at org.tmatesoft.svn.core.internal.wc.SVNErrorManager.error(SVNErrorManager.java:70)
at org.tmatesoft.svn.core.internal.wc.SVNErrorManager.error(SVNErrorManager.java:57)
at org.tmatesoft.svn.core.internal.io.dav.http.HTTPConnection.request(HTTPConnection.java:798)
at org.tmatesoft.svn.core.internal.io.dav.http.HTTPConnection.request(HTTPConnection.java:391)
at org.tmatesoft.svn.core.internal.io.dav.http.HTTPConnection.request(HTTPConnection.java:379)
at org.tmatesoft.svn.core.internal.io.dav.DAVConnection.performHttpRequest(DAVConnection.java:862)
at org.tmatesoft.svn.core.internal.io.dav.DAVConnection.doReport(DAVConnection.java:359)
at org.tmatesoft.svn.core.internal.io.dav.DAVRepository.runReport(DAVRepository.java:1341)
at org.tmatesoft.svn.core.internal.io.dav.DAVRepository.update(DAVRepository.java:868)
at org.tmatesoft.svn.core.internal.wc2.ng.SvnNgAbstractUpdate.updateInternal(SvnNgAbstractUpdate.java:247)
at org.tmatesoft.svn.core.internal.wc2.ng.SvnNgAbstractUpdate.update(SvnNgAbstractUpdate.java:111)
at org.tmatesoft.svn.core.internal.wc2.ng.SvnNgUpdate.run(SvnNgUpdate.java:40)
at org.tmatesoft.svn.core.internal.wc2.ng.SvnNgUpdate.run(SvnNgUpdate.java:18)
at org.tmatesoft.svn.core.internal.wc2.ng.SvnNgOperationRunner.run(SvnNgOperationRunner.java:20)
at org.tmatesoft.svn.core.internal.wc2.SvnOperationRunner.run(SvnOperationRunner.java:21)
at org.tmatesoft.svn.core.wc2.SvnOperationFactory.run(SvnOperationFactory.java:1235)
at org.tmatesoft.svn.core.wc2.SvnOperation.run(SvnOperation.java:294)
at org.tmatesoft.svn.core.wc.SVNUpdateClient.doUpdate(SVNUpdateClient.java:311)
at org.tmatesoft.svn.core.wc.SVNUpdateClient.doUpdate(SVNUpdateClient.java:291)
at org.tmatesoft.svn.core.wc.SVNUpdateClient.doUpdate(SVNUpdateClient.java:387)
at hudson.scm.subversion.UpdateUpdater$TaskImpl.perform(UpdateUpdater.java:158)
at hudson.scm.subversion.WorkspaceUpdater$UpdateTask.delegateTo(WorkspaceUpdater.java:162)
at hudson.scm.SubversionSCM$CheckOutTask.perform(SubversionSCM.java:1001)
at hudson.scm.SubversionSCM$CheckOutTask.invoke(SubversionSCM.java:977)
at hudson.scm.SubversionSCM$CheckOutTask.invoke(SubversionSCM.java:953)
at hudson.FilePath$FileCallableWrapper.call(FilePath.java:2739)
at hudson.remoting.UserRequest.perform(UserRequest.java:153)
at hudson.remoting.UserRequest.perform(UserRequest.java:50)
at hudson.remoting.Request$2.run(Request.java:336)
at hudson.remoting.InterceptingExecutorService$1.call(InterceptingExecutorService.java:68)
at java.util.concurrent.FutureTask.run(FutureTask.java:266)
at java.util.concurrent.ThreadPoolExecutor.runWorker(ThreadPoolExecutor.java:1142)
at java.util.concurrent.ThreadPoolExecutor$Worker.run(ThreadPoolExecutor.java:617)
at java.lang.Thread.run(Thread.java:748)
Caused by: org.tmatesoft.sqljet.core.SqlJetException: java.io.IOException: Permission denied: error code is CANTOPEN
at org.tmatesoft.sqljet.core.table.SqlJetDb.getTemporaryDatabaseFile(SqlJetDb.java:484)
at org.tmatesoft.sqljet.core.table.SqlJetDb.access$1400(SqlJetDb.java:63)
at org.tmatesoft.sqljet.core.table.SqlJetDb$15.runWithLock(SqlJetDb.java:449)
at org.tmatesoft.sqljet.core.table.SqlJetDb$1.runSynchronized(SqlJetDb.java:172)
at org.tmatesoft.sqljet.core.table.engine.SqlJetEngine.runSynchronized(SqlJetEngine.java:217)
at org.tmatesoft.sqljet.core.table.SqlJetDb.runWithLock(SqlJetDb.java:170)
at org.tmatesoft.sqljet.core.table.SqlJetDb.getTemporaryDatabase(SqlJetDb.java:445)
at org.tmatesoft.svn.core.internal.db.SVNSqlJetDb.getTemporaryDb(SVNSqlJetDb.java:132)
at org.tmatesoft.svn.core.internal.wc17.db.SVNWCDb$BumpRevisionPostUpdate.bumpMovedAway(SVNWCDb.java:5419)
at org.tmatesoft.svn.core.internal.wc17.db.SVNWCDb$BumpRevisionPostUpdate.transaction(SVNWCDb.java:5414)
at org.tmatesoft.svn.core.internal.db.SVNSqlJetDb.runTransaction(SVNSqlJetDb.java:258)
at org.tmatesoft.svn.core.internal.db.SVNSqlJetDb.runTransaction(SVNSqlJetDb.java:252)
at org.tmatesoft.svn.core.internal.wc17.db.SVNWCDb.opBumpRevisionPostUpdate(SVNWCDb.java:5366)
at org.tmatesoft.svn.core.internal.wc17.SVNUpdateEditor17.closeEdit(SVNUpdateEditor17.java:1728)
at org.tmatesoft.svn.core.internal.wc.SVNCancellableEditor.closeEdit(SVNCancellableEditor.java:148)
at org.tmatesoft.svn.core.internal.io.dav.handlers.DAVEditorHandler.endElement(DAVEditorHandler.java:492)
at org.tmatesoft.svn.core.internal.io.dav.handlers.BasicDAVHandler.endElement(BasicDAVHandler.java:103)
at com.sun.org.apache.xerces.internal.parsers.AbstractSAXParser.endElement(AbstractSAXParser.java:609)
at com.sun.org.apache.xerces.internal.impl.XMLDocumentFragmentScannerImpl.scanEndElement(XMLDocumentFragmentScannerImpl.java:1782)
at com.sun.org.apache.xerces.internal.impl.XMLDocumentFragmentScannerImpl$FragmentContentDriver.next(XMLDocumentFragmentScannerImpl.java:2967)
at com.sun.org.apache.xerces.internal.impl.XMLDocumentScannerImpl.next(XMLDocumentScannerImpl.java:602)
at com.sun.org.apache.xerces.internal.impl.XMLNSDocumentScannerImpl.next(XMLNSDocumentScannerImpl.java:112)
at com.sun.org.apache.xerces.internal.impl.XMLDocumentFragmentScannerImpl.scanDocument(XMLDocumentFragmentScannerImpl.java:505)
at com.sun.org.apache.xerces.internal.parsers.XML11Configuration.parse(XML11Configuration.java:841)
at com.sun.org.apache.xerces.internal.parsers.XML11Configuration.parse(XML11Configuration.java:770)
at com.sun.org.apache.xerces.internal.parsers.XMLParser.parse(XMLParser.java:141)
at com.sun.org.apache.xerces.internal.parsers.AbstractSAXParser.parse(AbstractSAXParser.java:1213)
at com.sun.org.apache.xerces.internal.jaxp.SAXParserImpl$JAXPSAXParser.parse(SAXParserImpl.java:643)
at org.tmatesoft.svn.core.internal.io.dav.http.HTTPConnection.readData(HTTPConnection.java:937)
at org.tmatesoft.svn.core.internal.io.dav.http.HTTPConnection.readData(HTTPConnection.java:902)
at org.tmatesoft.svn.core.internal.io.dav.http.HTTPRequest.dispatch(HTTPRequest.java:220)
at org.tmatesoft.svn.core.internal.io.dav.http.HTTPConnection.request(HTTPConnection.java:490)
... 31 more
Caused by: java.io.IOException: Permission denied
at java.io.UnixFileSystem.createFileExclusively(Native Method)
at java.io.File.createTempFile(File.java:2024)
at java.io.File.createTempFile(File.java:2070)
at org.tmatesoft.sqljet.core.internal.fs.SqlJetFileSystem.getTempFile(SqlJetFileSystem.java:202)
at org.tmatesoft.sqljet.core.table.SqlJetDb.getTemporaryDatabaseFile(SqlJetDb.java:482)
... 62 more
ERROR: Subversion update failed
java.io.IOException: Permission denied
at java.io.UnixFileSystem.createFileExclusively(Native Method)
at java.io.File.createTempFile(File.java:2024)
at java.io.File.createTempFile(File.java:2070)
at org.tmatesoft.sqljet.core.internal.fs.SqlJetFileSystem.getTempFile(SqlJetFileSystem.java:202)
at org.tmatesoft.sqljet.core.table.SqlJetDb.getTemporaryDatabaseFile(SqlJetDb.java:482)
Caused: org.tmatesoft.sqljet.core.SqlJetException: java.io.IOException: Permission denied: error code is CANTOPEN
at org.tmatesoft.sqljet.core.table.SqlJetDb.getTemporaryDatabaseFile(SqlJetDb.java:484)
at org.tmatesoft.sqljet.core.table.SqlJetDb.access$1400(SqlJetDb.java:63)
at org.tmatesoft.sqljet.core.table.SqlJetDb$15.runWithLock(SqlJetDb.java:449)
at org.tmatesoft.sqljet.core.table.SqlJetDb$1.runSynchronized(SqlJetDb.java:172)
at org.tmatesoft.sqljet.core.table.engine.SqlJetEngine.runSynchronized(SqlJetEngine.java:217)
at org.tmatesoft.sqljet.core.table.SqlJetDb.runWithLock(SqlJetDb.java:170)
at org.tmatesoft.sqljet.core.table.SqlJetDb.getTemporaryDatabase(SqlJetDb.java:445)
at org.tmatesoft.svn.core.internal.db.SVNSqlJetDb.getTemporaryDb(SVNSqlJetDb.java:132)
at org.tmatesoft.svn.core.internal.wc17.db.SVNWCDb$BumpRevisionPostUpdate.bumpMovedAway(SVNWCDb.java:5419)
at org.tmatesoft.svn.core.internal.wc17.db.SVNWCDb$BumpRevisionPostUpdate.transaction(SVNWCDb.java:5414)
at org.tmatesoft.svn.core.internal.db.SVNSqlJetDb.runTransaction(SVNSqlJetDb.java:258)
at org.tmatesoft.svn.core.internal.db.SVNSqlJetDb.runTransaction(SVNSqlJetDb.java:252)
at org.tmatesoft.svn.core.internal.wc17.db.SVNWCDb.opBumpRevisionPostUpdate(SVNWCDb.java:5366)
at org.tmatesoft.svn.core.internal.wc17.SVNUpdateEditor17.closeEdit(SVNUpdateEditor17.java:1728)
at org.tmatesoft.svn.core.internal.wc.SVNCancellableEditor.closeEdit(SVNCancellableEditor.java:148)
at org.tmatesoft.svn.core.internal.io.dav.handlers.DAVEditorHandler.endElement(DAVEditorHandler.java:492)
at org.tmatesoft.svn.core.internal.io.dav.handlers.BasicDAVHandler.endElement(BasicDAVHandler.java:103)
at com.sun.org.apache.xerces.internal.parsers.AbstractSAXParser.endElement(AbstractSAXParser.java:609)
at com.sun.org.apache.xerces.internal.impl.XMLDocumentFragmentScannerImpl.scanEndElement(XMLDocumentFragmentScannerImpl.java:1782)
at com.sun.org.apache.xerces.internal.impl.XMLDocumentFragmentScannerImpl$FragmentContentDriver.next(XMLDocumentFragmentScannerImpl.java:2967)
at com.sun.org.apache.xerces.internal.impl.XMLDocumentScannerImpl.next(XMLDocumentScannerImpl.java:602)
at com.sun.org.apache.xerces.internal.impl.XMLNSDocumentScannerImpl.next(XMLNSDocumentScannerImpl.java:112)
at com.sun.org.apache.xerces.internal.impl.XMLDocumentFragmentScannerImpl.scanDocument(XMLDocumentFragmentScannerImpl.java:505)
at com.sun.org.apache.xerces.internal.parsers.XML11Configuration.parse(XML11Configuration.java:841)
at com.sun.org.apache.xerces.internal.parsers.XML11Configuration.parse(XML11Configuration.java:770)
at com.sun.org.apache.xerces.internal.parsers.XMLParser.parse(XMLParser.java:141)
at com.sun.org.apache.xerces.internal.parsers.AbstractSAXParser.parse(AbstractSAXParser.java:1213)
at com.sun.org.apache.xerces.internal.jaxp.SAXParserImpl$JAXPSAXParser.parse(SAXParserImpl.java:643)
at org.tmatesoft.svn.core.internal.io.dav.http.HTTPConnection.readData(HTTPConnection.java:937)
at org.tmatesoft.svn.core.internal.io.dav.http.HTTPConnection.readData(HTTPConnection.java:902)
at org.tmatesoft.svn.core.internal.io.dav.http.HTTPRequest.dispatch(HTTPRequest.java:220)
at org.tmatesoft.svn.core.internal.io.dav.http.HTTPConnection.request(HTTPConnection.java:490)
Caused: org.tmatesoft.svn.core.SVNException: svn: E200030: java.io.IOException: Permission denied
at org.tmatesoft.svn.core.internal.wc.SVNErrorManager.error(SVNErrorManager.java:70)
at org.tmatesoft.svn.core.internal.wc.SVNErrorManager.error(SVNErrorManager.java:57)
at org.tmatesoft.svn.core.internal.io.dav.http.HTTPConnection.request(HTTPConnection.java:798)
at org.tmatesoft.svn.core.internal.io.dav.http.HTTPConnection.request(HTTPConnection.java:391)
at org.tmatesoft.svn.core.internal.io.dav.http.HTTPConnection.request(HTTPConnection.java:379)
at org.tmatesoft.svn.core.internal.io.dav.DAVConnection.performHttpRequest(DAVConnection.java:862)
at org.tmatesoft.svn.core.internal.io.dav.DAVConnection.doReport(DAVConnection.java:359)
at org.tmatesoft.svn.core.internal.io.dav.DAVRepository.runReport(DAVRepository.java:1341)
at org.tmatesoft.svn.core.internal.io.dav.DAVRepository.update(DAVRepository.java:868)
at org.tmatesoft.svn.core.internal.wc2.ng.SvnNgAbstractUpdate.updateInternal(SvnNgAbstractUpdate.java:247)
at org.tmatesoft.svn.core.internal.wc2.ng.SvnNgAbstractUpdate.update(SvnNgAbstractUpdate.java:111)
at org.tmatesoft.svn.core.internal.wc2.ng.SvnNgUpdate.run(SvnNgUpdate.java:40)
at org.tmatesoft.svn.core.internal.wc2.ng.SvnNgUpdate.run(SvnNgUpdate.java:18)
at org.tmatesoft.svn.core.internal.wc2.ng.SvnNgOperationRunner.run(SvnNgOperationRunner.java:20)
at org.tmatesoft.svn.core.internal.wc2.SvnOperationRunner.run(SvnOperationRunner.java:21)
at org.tmatesoft.svn.core.wc2.SvnOperationFactory.run(SvnOperationFactory.java:1235)
at org.tmatesoft.svn.core.wc2.SvnOperation.run(SvnOperation.java:294)
at org.tmatesoft.svn.core.wc.SVNUpdateClient.doUpdate(SVNUpdateClient.java:311)
at org.tmatesoft.svn.core.wc.SVNUpdateClient.doUpdate(SVNUpdateClient.java:291)
at org.tmatesoft.svn.core.wc.SVNUpdateClient.doUpdate(SVNUpdateClient.java:387)
at hudson.scm.subversion.UpdateUpdater$TaskImpl.perform(UpdateUpdater.java:158)
Caused: hudson.scm.subversion.UpdaterException: failed to perform svn update
at hudson.scm.subversion.UpdateUpdater$TaskImpl.perform(UpdateUpdater.java:212)
at hudson.scm.subversion.WorkspaceUpdater$UpdateTask.delegateTo(WorkspaceUpdater.java:162)
at hudson.scm.SubversionSCM$CheckOutTask.perform(SubversionSCM.java:1001)
at hudson.scm.SubversionSCM$CheckOutTask.invoke(SubversionSCM.java:977)
at hudson.scm.SubversionSCM$CheckOutTask.invoke(SubversionSCM.java:953)
at hudson.FilePath$FileCallableWrapper.call(FilePath.java:2739)
at hudson.remoting.UserRequest.perform(UserRequest.java:153)
at hudson.remoting.UserRequest.perform(UserRequest.java:50)
at hudson.remoting.Request$2.run(Request.java:336)
at hudson.remoting.InterceptingExecutorService$1.call(InterceptingExecutorService.java:68)
at java.util.concurrent.FutureTask.run(FutureTask.java:266)
at java.util.concurrent.ThreadPoolExecutor.runWorker(ThreadPoolExecutor.java:1142)
at java.util.concurrent.ThreadPoolExecutor$Worker.run(ThreadPoolExecutor.java:617)
at java.lang.Thread.run(Thread.java:748)
Caused: java.io.IOException
at hudson.scm.subversion.UpdateUpdater$TaskImpl.perform(UpdateUpdater.java:212)
at hudson.scm.subversion.WorkspaceUpdater$UpdateTask.delegateTo(WorkspaceUpdater.java:162)
at hudson.scm.SubversionSCM$CheckOutTask.perform(SubversionSCM.java:1001)
at hudson.scm.SubversionSCM$CheckOutTask.invoke(SubversionSCM.java:977)
at hudson.scm.SubversionSCM$CheckOutTask.invoke(SubversionSCM.java:953)
at hudson.FilePath$FileCallableWrapper.call(FilePath.java:2739)
at hudson.remoting.UserRequest.perform(UserRequest.java:153)
at hudson.remoting.UserRequest.perform(UserRequest.java:50)
at hudson.remoting.Request$2.run(Request.java:336)
at hudson.remoting.InterceptingExecutorService$1.call(InterceptingExecutorService.java:68)
at java.util.concurrent.FutureTask.run(FutureTask.java:266)
at java.util.concurrent.ThreadPoolExecutor.runWorker(ThreadPoolExecutor.java:1142)
at java.util.concurrent.ThreadPoolExecutor$Worker.run(ThreadPoolExecutor.java:617)
at java.lang.Thread.run(Thread.java:748)
at ......remote call to H21(Native Method)
at hudson.remoting.Channel.attachCallSiteStackTrace(Channel.java:1545)
at hudson.remoting.UserResponse.retrieve(UserRequest.java:253)
at hudson.remoting.Channel.call(Channel.java:830)
at hudson.FilePath.act(FilePath.java:986)
Caused: java.io.IOException: remote file operation failed: <https://builds.apache.org/job/PDFBox-Trunk-jdk9/ws/> at hudson.remoting.Channel@4b715ff3:H21
at hudson.FilePath.act(FilePath.java:993)
at hudson.FilePath.act(FilePath.java:975)
at hudson.scm.SubversionSCM.checkout(SubversionSCM.java:902)
at hudson.scm.SubversionSCM.checkout(SubversionSCM.java:838)
at hudson.scm.SCM.checkout(SCM.java:495)
at hudson.model.AbstractProject.checkout(AbstractProject.java:1276)
at hudson.model.AbstractBuild$AbstractBuildExecution.defaultCheckout(AbstractBuild.java:560)
at jenkins.scm.SCMCheckoutStrategy.checkout(SCMCheckoutStrategy.java:86)
at hudson.model.AbstractBuild$AbstractBuildExecution.run(AbstractBuild.java:485)
at hudson.model.Run.execute(Run.java:1735)
at hudson.maven.MavenModuleSetBuild.run(MavenModuleSetBuild.java:542)
at hudson.model.ResourceController.execute(ResourceController.java:97)
at hudson.model.Executor.run(Executor.java:405)
Archiving artifacts
---------------------------------------------------------------------
To unsubscribe, e-mail: dev-unsubscribe@pdfbox.apache.org
For additional commands, e-mail: dev-help@pdfbox.apache.org
Build failed in Jenkins: PDFBox-Trunk-jdk9 #7
Posted by Apache Jenkins Server <je...@builds.apache.org>.
See <https://builds.apache.org/job/PDFBox-Trunk-jdk9/7/display/redirect>
------------------------------------------
[...truncated 183.92 KB...]
at org.tmatesoft.svn.core.internal.wc2.ng.SvnNgOperationRunner.run(SvnNgOperationRunner.java:20)
at org.tmatesoft.svn.core.internal.wc2.SvnOperationRunner.run(SvnOperationRunner.java:21)
at org.tmatesoft.svn.core.wc2.SvnOperationFactory.run(SvnOperationFactory.java:1235)
at org.tmatesoft.svn.core.wc2.SvnOperation.run(SvnOperation.java:294)
at org.tmatesoft.svn.core.wc.SVNUpdateClient.doUpdate(SVNUpdateClient.java:311)
at org.tmatesoft.svn.core.wc.SVNUpdateClient.doUpdate(SVNUpdateClient.java:291)
at org.tmatesoft.svn.core.wc.SVNUpdateClient.doUpdate(SVNUpdateClient.java:387)
at hudson.scm.subversion.UpdateUpdater$TaskImpl.perform(UpdateUpdater.java:158)
Caused: hudson.scm.subversion.UpdaterException: failed to perform svn update
at hudson.scm.subversion.UpdateUpdater$TaskImpl.perform(UpdateUpdater.java:212)
at hudson.scm.subversion.WorkspaceUpdater$UpdateTask.delegateTo(WorkspaceUpdater.java:162)
at hudson.scm.SubversionSCM$CheckOutTask.perform(SubversionSCM.java:1001)
at hudson.scm.SubversionSCM$CheckOutTask.invoke(SubversionSCM.java:977)
at hudson.scm.SubversionSCM$CheckOutTask.invoke(SubversionSCM.java:953)
at hudson.FilePath$FileCallableWrapper.call(FilePath.java:2739)
at hudson.remoting.UserRequest.perform(UserRequest.java:153)
at hudson.remoting.UserRequest.perform(UserRequest.java:50)
at hudson.remoting.Request$2.run(Request.java:336)
at hudson.remoting.InterceptingExecutorService$1.call(InterceptingExecutorService.java:68)
at java.util.concurrent.FutureTask.run(FutureTask.java:266)
at java.util.concurrent.ThreadPoolExecutor.runWorker(ThreadPoolExecutor.java:1142)
at java.util.concurrent.ThreadPoolExecutor$Worker.run(ThreadPoolExecutor.java:617)
at java.lang.Thread.run(Thread.java:748)
Caused: java.io.IOException
at hudson.scm.subversion.UpdateUpdater$TaskImpl.perform(UpdateUpdater.java:212)
at hudson.scm.subversion.WorkspaceUpdater$UpdateTask.delegateTo(WorkspaceUpdater.java:162)
at hudson.scm.SubversionSCM$CheckOutTask.perform(SubversionSCM.java:1001)
at hudson.scm.SubversionSCM$CheckOutTask.invoke(SubversionSCM.java:977)
at hudson.scm.SubversionSCM$CheckOutTask.invoke(SubversionSCM.java:953)
at hudson.FilePath$FileCallableWrapper.call(FilePath.java:2739)
at hudson.remoting.UserRequest.perform(UserRequest.java:153)
at hudson.remoting.UserRequest.perform(UserRequest.java:50)
at hudson.remoting.Request$2.run(Request.java:336)
at hudson.remoting.InterceptingExecutorService$1.call(InterceptingExecutorService.java:68)
at java.util.concurrent.FutureTask.run(FutureTask.java:266)
at java.util.concurrent.ThreadPoolExecutor.runWorker(ThreadPoolExecutor.java:1142)
at java.util.concurrent.ThreadPoolExecutor$Worker.run(ThreadPoolExecutor.java:617)
at java.lang.Thread.run(Thread.java:748)
at ......remote call to H21(Native Method)
at hudson.remoting.Channel.attachCallSiteStackTrace(Channel.java:1545)
at hudson.remoting.UserResponse.retrieve(UserRequest.java:253)
at hudson.remoting.Channel.call(Channel.java:830)
at hudson.FilePath.act(FilePath.java:986)
Caused: java.io.IOException: remote file operation failed: <https://builds.apache.org/job/PDFBox-Trunk-jdk9/ws/> at hudson.remoting.Channel@4b715ff3:H21
at hudson.FilePath.act(FilePath.java:993)
at hudson.FilePath.act(FilePath.java:975)
at hudson.scm.SubversionSCM.checkout(SubversionSCM.java:902)
at hudson.scm.SubversionSCM.checkout(SubversionSCM.java:838)
at hudson.scm.SCM.checkout(SCM.java:495)
at hudson.model.AbstractProject.checkout(AbstractProject.java:1276)
at hudson.model.AbstractBuild$AbstractBuildExecution.defaultCheckout(AbstractBuild.java:560)
at jenkins.scm.SCMCheckoutStrategy.checkout(SCMCheckoutStrategy.java:86)
at hudson.model.AbstractBuild$AbstractBuildExecution.run(AbstractBuild.java:485)
at hudson.model.Run.execute(Run.java:1735)
at hudson.maven.MavenModuleSetBuild.run(MavenModuleSetBuild.java:542)
at hudson.model.ResourceController.execute(ResourceController.java:97)
at hudson.model.Executor.run(Executor.java:405)
Retrying after 10 seconds
Cleaning up <https://builds.apache.org/job/PDFBox-Trunk-jdk9/ws/trunk>
Updating http://svn.apache.org/repos/asf/pdfbox/trunk at revision '2017-08-10T17:23:45.671 +0000'
ERROR: Failed to update http://svn.apache.org/repos/asf/pdfbox/trunk
org.tmatesoft.svn.core.SVNException: svn: E200030: java.io.IOException: Permission denied
at org.tmatesoft.svn.core.internal.wc.SVNErrorManager.error(SVNErrorManager.java:70)
at org.tmatesoft.svn.core.internal.wc.SVNErrorManager.error(SVNErrorManager.java:57)
at org.tmatesoft.svn.core.internal.io.dav.http.HTTPConnection.request(HTTPConnection.java:798)
at org.tmatesoft.svn.core.internal.io.dav.http.HTTPConnection.request(HTTPConnection.java:391)
at org.tmatesoft.svn.core.internal.io.dav.http.HTTPConnection.request(HTTPConnection.java:379)
at org.tmatesoft.svn.core.internal.io.dav.DAVConnection.performHttpRequest(DAVConnection.java:862)
at org.tmatesoft.svn.core.internal.io.dav.DAVConnection.doReport(DAVConnection.java:359)
at org.tmatesoft.svn.core.internal.io.dav.DAVRepository.runReport(DAVRepository.java:1341)
at org.tmatesoft.svn.core.internal.io.dav.DAVRepository.update(DAVRepository.java:868)
at org.tmatesoft.svn.core.internal.wc2.ng.SvnNgAbstractUpdate.updateInternal(SvnNgAbstractUpdate.java:247)
at org.tmatesoft.svn.core.internal.wc2.ng.SvnNgAbstractUpdate.update(SvnNgAbstractUpdate.java:111)
at org.tmatesoft.svn.core.internal.wc2.ng.SvnNgUpdate.run(SvnNgUpdate.java:40)
at org.tmatesoft.svn.core.internal.wc2.ng.SvnNgUpdate.run(SvnNgUpdate.java:18)
at org.tmatesoft.svn.core.internal.wc2.ng.SvnNgOperationRunner.run(SvnNgOperationRunner.java:20)
at org.tmatesoft.svn.core.internal.wc2.SvnOperationRunner.run(SvnOperationRunner.java:21)
at org.tmatesoft.svn.core.wc2.SvnOperationFactory.run(SvnOperationFactory.java:1235)
at org.tmatesoft.svn.core.wc2.SvnOperation.run(SvnOperation.java:294)
at org.tmatesoft.svn.core.wc.SVNUpdateClient.doUpdate(SVNUpdateClient.java:311)
at org.tmatesoft.svn.core.wc.SVNUpdateClient.doUpdate(SVNUpdateClient.java:291)
at org.tmatesoft.svn.core.wc.SVNUpdateClient.doUpdate(SVNUpdateClient.java:387)
at hudson.scm.subversion.UpdateUpdater$TaskImpl.perform(UpdateUpdater.java:158)
at hudson.scm.subversion.WorkspaceUpdater$UpdateTask.delegateTo(WorkspaceUpdater.java:162)
at hudson.scm.SubversionSCM$CheckOutTask.perform(SubversionSCM.java:1001)
at hudson.scm.SubversionSCM$CheckOutTask.invoke(SubversionSCM.java:977)
at hudson.scm.SubversionSCM$CheckOutTask.invoke(SubversionSCM.java:953)
at hudson.FilePath$FileCallableWrapper.call(FilePath.java:2739)
at hudson.remoting.UserRequest.perform(UserRequest.java:153)
at hudson.remoting.UserRequest.perform(UserRequest.java:50)
at hudson.remoting.Request$2.run(Request.java:336)
at hudson.remoting.InterceptingExecutorService$1.call(InterceptingExecutorService.java:68)
at java.util.concurrent.FutureTask.run(FutureTask.java:266)
at java.util.concurrent.ThreadPoolExecutor.runWorker(ThreadPoolExecutor.java:1142)
at java.util.concurrent.ThreadPoolExecutor$Worker.run(ThreadPoolExecutor.java:617)
at java.lang.Thread.run(Thread.java:748)
Caused by: org.tmatesoft.sqljet.core.SqlJetException: java.io.IOException: Permission denied: error code is CANTOPEN
at org.tmatesoft.sqljet.core.table.SqlJetDb.getTemporaryDatabaseFile(SqlJetDb.java:484)
at org.tmatesoft.sqljet.core.table.SqlJetDb.access$1400(SqlJetDb.java:63)
at org.tmatesoft.sqljet.core.table.SqlJetDb$15.runWithLock(SqlJetDb.java:449)
at org.tmatesoft.sqljet.core.table.SqlJetDb$1.runSynchronized(SqlJetDb.java:172)
at org.tmatesoft.sqljet.core.table.engine.SqlJetEngine.runSynchronized(SqlJetEngine.java:217)
at org.tmatesoft.sqljet.core.table.SqlJetDb.runWithLock(SqlJetDb.java:170)
at org.tmatesoft.sqljet.core.table.SqlJetDb.getTemporaryDatabase(SqlJetDb.java:445)
at org.tmatesoft.svn.core.internal.db.SVNSqlJetDb.getTemporaryDb(SVNSqlJetDb.java:132)
at org.tmatesoft.svn.core.internal.wc17.db.SVNWCDb$BumpRevisionPostUpdate.bumpMovedAway(SVNWCDb.java:5419)
at org.tmatesoft.svn.core.internal.wc17.db.SVNWCDb$BumpRevisionPostUpdate.transaction(SVNWCDb.java:5414)
at org.tmatesoft.svn.core.internal.db.SVNSqlJetDb.runTransaction(SVNSqlJetDb.java:258)
at org.tmatesoft.svn.core.internal.db.SVNSqlJetDb.runTransaction(SVNSqlJetDb.java:252)
at org.tmatesoft.svn.core.internal.wc17.db.SVNWCDb.opBumpRevisionPostUpdate(SVNWCDb.java:5366)
at org.tmatesoft.svn.core.internal.wc17.SVNUpdateEditor17.closeEdit(SVNUpdateEditor17.java:1728)
at org.tmatesoft.svn.core.internal.wc.SVNCancellableEditor.closeEdit(SVNCancellableEditor.java:148)
at org.tmatesoft.svn.core.internal.io.dav.handlers.DAVEditorHandler.endElement(DAVEditorHandler.java:492)
at org.tmatesoft.svn.core.internal.io.dav.handlers.BasicDAVHandler.endElement(BasicDAVHandler.java:103)
at com.sun.org.apache.xerces.internal.parsers.AbstractSAXParser.endElement(AbstractSAXParser.java:609)
at com.sun.org.apache.xerces.internal.impl.XMLDocumentFragmentScannerImpl.scanEndElement(XMLDocumentFragmentScannerImpl.java:1782)
at com.sun.org.apache.xerces.internal.impl.XMLDocumentFragmentScannerImpl$FragmentContentDriver.next(XMLDocumentFragmentScannerImpl.java:2967)
at com.sun.org.apache.xerces.internal.impl.XMLDocumentScannerImpl.next(XMLDocumentScannerImpl.java:602)
at com.sun.org.apache.xerces.internal.impl.XMLNSDocumentScannerImpl.next(XMLNSDocumentScannerImpl.java:112)
at com.sun.org.apache.xerces.internal.impl.XMLDocumentFragmentScannerImpl.scanDocument(XMLDocumentFragmentScannerImpl.java:505)
at com.sun.org.apache.xerces.internal.parsers.XML11Configuration.parse(XML11Configuration.java:841)
at com.sun.org.apache.xerces.internal.parsers.XML11Configuration.parse(XML11Configuration.java:770)
at com.sun.org.apache.xerces.internal.parsers.XMLParser.parse(XMLParser.java:141)
at com.sun.org.apache.xerces.internal.parsers.AbstractSAXParser.parse(AbstractSAXParser.java:1213)
at com.sun.org.apache.xerces.internal.jaxp.SAXParserImpl$JAXPSAXParser.parse(SAXParserImpl.java:643)
at org.tmatesoft.svn.core.internal.io.dav.http.HTTPConnection.readData(HTTPConnection.java:937)
at org.tmatesoft.svn.core.internal.io.dav.http.HTTPConnection.readData(HTTPConnection.java:902)
at org.tmatesoft.svn.core.internal.io.dav.http.HTTPRequest.dispatch(HTTPRequest.java:220)
at org.tmatesoft.svn.core.internal.io.dav.http.HTTPConnection.request(HTTPConnection.java:490)
... 31 more
Caused by: java.io.IOException: Permission denied
at java.io.UnixFileSystem.createFileExclusively(Native Method)
at java.io.File.createTempFile(File.java:2024)
at java.io.File.createTempFile(File.java:2070)
at org.tmatesoft.sqljet.core.internal.fs.SqlJetFileSystem.getTempFile(SqlJetFileSystem.java:202)
at org.tmatesoft.sqljet.core.table.SqlJetDb.getTemporaryDatabaseFile(SqlJetDb.java:482)
... 62 more
ERROR: Subversion update failed
java.io.IOException: Permission denied
at java.io.UnixFileSystem.createFileExclusively(Native Method)
at java.io.File.createTempFile(File.java:2024)
at java.io.File.createTempFile(File.java:2070)
at org.tmatesoft.sqljet.core.internal.fs.SqlJetFileSystem.getTempFile(SqlJetFileSystem.java:202)
at org.tmatesoft.sqljet.core.table.SqlJetDb.getTemporaryDatabaseFile(SqlJetDb.java:482)
Caused: org.tmatesoft.sqljet.core.SqlJetException: java.io.IOException: Permission denied: error code is CANTOPEN
at org.tmatesoft.sqljet.core.table.SqlJetDb.getTemporaryDatabaseFile(SqlJetDb.java:484)
at org.tmatesoft.sqljet.core.table.SqlJetDb.access$1400(SqlJetDb.java:63)
at org.tmatesoft.sqljet.core.table.SqlJetDb$15.runWithLock(SqlJetDb.java:449)
at org.tmatesoft.sqljet.core.table.SqlJetDb$1.runSynchronized(SqlJetDb.java:172)
at org.tmatesoft.sqljet.core.table.engine.SqlJetEngine.runSynchronized(SqlJetEngine.java:217)
at org.tmatesoft.sqljet.core.table.SqlJetDb.runWithLock(SqlJetDb.java:170)
at org.tmatesoft.sqljet.core.table.SqlJetDb.getTemporaryDatabase(SqlJetDb.java:445)
at org.tmatesoft.svn.core.internal.db.SVNSqlJetDb.getTemporaryDb(SVNSqlJetDb.java:132)
at org.tmatesoft.svn.core.internal.wc17.db.SVNWCDb$BumpRevisionPostUpdate.bumpMovedAway(SVNWCDb.java:5419)
at org.tmatesoft.svn.core.internal.wc17.db.SVNWCDb$BumpRevisionPostUpdate.transaction(SVNWCDb.java:5414)
at org.tmatesoft.svn.core.internal.db.SVNSqlJetDb.runTransaction(SVNSqlJetDb.java:258)
at org.tmatesoft.svn.core.internal.db.SVNSqlJetDb.runTransaction(SVNSqlJetDb.java:252)
at org.tmatesoft.svn.core.internal.wc17.db.SVNWCDb.opBumpRevisionPostUpdate(SVNWCDb.java:5366)
at org.tmatesoft.svn.core.internal.wc17.SVNUpdateEditor17.closeEdit(SVNUpdateEditor17.java:1728)
at org.tmatesoft.svn.core.internal.wc.SVNCancellableEditor.closeEdit(SVNCancellableEditor.java:148)
at org.tmatesoft.svn.core.internal.io.dav.handlers.DAVEditorHandler.endElement(DAVEditorHandler.java:492)
at org.tmatesoft.svn.core.internal.io.dav.handlers.BasicDAVHandler.endElement(BasicDAVHandler.java:103)
at com.sun.org.apache.xerces.internal.parsers.AbstractSAXParser.endElement(AbstractSAXParser.java:609)
at com.sun.org.apache.xerces.internal.impl.XMLDocumentFragmentScannerImpl.scanEndElement(XMLDocumentFragmentScannerImpl.java:1782)
at com.sun.org.apache.xerces.internal.impl.XMLDocumentFragmentScannerImpl$FragmentContentDriver.next(XMLDocumentFragmentScannerImpl.java:2967)
at com.sun.org.apache.xerces.internal.impl.XMLDocumentScannerImpl.next(XMLDocumentScannerImpl.java:602)
at com.sun.org.apache.xerces.internal.impl.XMLNSDocumentScannerImpl.next(XMLNSDocumentScannerImpl.java:112)
at com.sun.org.apache.xerces.internal.impl.XMLDocumentFragmentScannerImpl.scanDocument(XMLDocumentFragmentScannerImpl.java:505)
at com.sun.org.apache.xerces.internal.parsers.XML11Configuration.parse(XML11Configuration.java:841)
at com.sun.org.apache.xerces.internal.parsers.XML11Configuration.parse(XML11Configuration.java:770)
at com.sun.org.apache.xerces.internal.parsers.XMLParser.parse(XMLParser.java:141)
at com.sun.org.apache.xerces.internal.parsers.AbstractSAXParser.parse(AbstractSAXParser.java:1213)
at com.sun.org.apache.xerces.internal.jaxp.SAXParserImpl$JAXPSAXParser.parse(SAXParserImpl.java:643)
at org.tmatesoft.svn.core.internal.io.dav.http.HTTPConnection.readData(HTTPConnection.java:937)
at org.tmatesoft.svn.core.internal.io.dav.http.HTTPConnection.readData(HTTPConnection.java:902)
at org.tmatesoft.svn.core.internal.io.dav.http.HTTPRequest.dispatch(HTTPRequest.java:220)
at org.tmatesoft.svn.core.internal.io.dav.http.HTTPConnection.request(HTTPConnection.java:490)
Caused: org.tmatesoft.svn.core.SVNException: svn: E200030: java.io.IOException: Permission denied
at org.tmatesoft.svn.core.internal.wc.SVNErrorManager.error(SVNErrorManager.java:70)
at org.tmatesoft.svn.core.internal.wc.SVNErrorManager.error(SVNErrorManager.java:57)
at org.tmatesoft.svn.core.internal.io.dav.http.HTTPConnection.request(HTTPConnection.java:798)
at org.tmatesoft.svn.core.internal.io.dav.http.HTTPConnection.request(HTTPConnection.java:391)
at org.tmatesoft.svn.core.internal.io.dav.http.HTTPConnection.request(HTTPConnection.java:379)
at org.tmatesoft.svn.core.internal.io.dav.DAVConnection.performHttpRequest(DAVConnection.java:862)
at org.tmatesoft.svn.core.internal.io.dav.DAVConnection.doReport(DAVConnection.java:359)
at org.tmatesoft.svn.core.internal.io.dav.DAVRepository.runReport(DAVRepository.java:1341)
at org.tmatesoft.svn.core.internal.io.dav.DAVRepository.update(DAVRepository.java:868)
at org.tmatesoft.svn.core.internal.wc2.ng.SvnNgAbstractUpdate.updateInternal(SvnNgAbstractUpdate.java:247)
at org.tmatesoft.svn.core.internal.wc2.ng.SvnNgAbstractUpdate.update(SvnNgAbstractUpdate.java:111)
at org.tmatesoft.svn.core.internal.wc2.ng.SvnNgUpdate.run(SvnNgUpdate.java:40)
at org.tmatesoft.svn.core.internal.wc2.ng.SvnNgUpdate.run(SvnNgUpdate.java:18)
at org.tmatesoft.svn.core.internal.wc2.ng.SvnNgOperationRunner.run(SvnNgOperationRunner.java:20)
at org.tmatesoft.svn.core.internal.wc2.SvnOperationRunner.run(SvnOperationRunner.java:21)
at org.tmatesoft.svn.core.wc2.SvnOperationFactory.run(SvnOperationFactory.java:1235)
at org.tmatesoft.svn.core.wc2.SvnOperation.run(SvnOperation.java:294)
at org.tmatesoft.svn.core.wc.SVNUpdateClient.doUpdate(SVNUpdateClient.java:311)
at org.tmatesoft.svn.core.wc.SVNUpdateClient.doUpdate(SVNUpdateClient.java:291)
at org.tmatesoft.svn.core.wc.SVNUpdateClient.doUpdate(SVNUpdateClient.java:387)
at hudson.scm.subversion.UpdateUpdater$TaskImpl.perform(UpdateUpdater.java:158)
Caused: hudson.scm.subversion.UpdaterException: failed to perform svn update
at hudson.scm.subversion.UpdateUpdater$TaskImpl.perform(UpdateUpdater.java:212)
at hudson.scm.subversion.WorkspaceUpdater$UpdateTask.delegateTo(WorkspaceUpdater.java:162)
at hudson.scm.SubversionSCM$CheckOutTask.perform(SubversionSCM.java:1001)
at hudson.scm.SubversionSCM$CheckOutTask.invoke(SubversionSCM.java:977)
at hudson.scm.SubversionSCM$CheckOutTask.invoke(SubversionSCM.java:953)
at hudson.FilePath$FileCallableWrapper.call(FilePath.java:2739)
at hudson.remoting.UserRequest.perform(UserRequest.java:153)
at hudson.remoting.UserRequest.perform(UserRequest.java:50)
at hudson.remoting.Request$2.run(Request.java:336)
at hudson.remoting.InterceptingExecutorService$1.call(InterceptingExecutorService.java:68)
at java.util.concurrent.FutureTask.run(FutureTask.java:266)
at java.util.concurrent.ThreadPoolExecutor.runWorker(ThreadPoolExecutor.java:1142)
at java.util.concurrent.ThreadPoolExecutor$Worker.run(ThreadPoolExecutor.java:617)
at java.lang.Thread.run(Thread.java:748)
Caused: java.io.IOException
at hudson.scm.subversion.UpdateUpdater$TaskImpl.perform(UpdateUpdater.java:212)
at hudson.scm.subversion.WorkspaceUpdater$UpdateTask.delegateTo(WorkspaceUpdater.java:162)
at hudson.scm.SubversionSCM$CheckOutTask.perform(SubversionSCM.java:1001)
at hudson.scm.SubversionSCM$CheckOutTask.invoke(SubversionSCM.java:977)
at hudson.scm.SubversionSCM$CheckOutTask.invoke(SubversionSCM.java:953)
at hudson.FilePath$FileCallableWrapper.call(FilePath.java:2739)
at hudson.remoting.UserRequest.perform(UserRequest.java:153)
at hudson.remoting.UserRequest.perform(UserRequest.java:50)
at hudson.remoting.Request$2.run(Request.java:336)
at hudson.remoting.InterceptingExecutorService$1.call(InterceptingExecutorService.java:68)
at java.util.concurrent.FutureTask.run(FutureTask.java:266)
at java.util.concurrent.ThreadPoolExecutor.runWorker(ThreadPoolExecutor.java:1142)
at java.util.concurrent.ThreadPoolExecutor$Worker.run(ThreadPoolExecutor.java:617)
at java.lang.Thread.run(Thread.java:748)
at ......remote call to H21(Native Method)
at hudson.remoting.Channel.attachCallSiteStackTrace(Channel.java:1545)
at hudson.remoting.UserResponse.retrieve(UserRequest.java:253)
at hudson.remoting.Channel.call(Channel.java:830)
at hudson.FilePath.act(FilePath.java:986)
Caused: java.io.IOException: remote file operation failed: <https://builds.apache.org/job/PDFBox-Trunk-jdk9/ws/> at hudson.remoting.Channel@4b715ff3:H21
at hudson.FilePath.act(FilePath.java:993)
at hudson.FilePath.act(FilePath.java:975)
at hudson.scm.SubversionSCM.checkout(SubversionSCM.java:902)
at hudson.scm.SubversionSCM.checkout(SubversionSCM.java:838)
at hudson.scm.SCM.checkout(SCM.java:495)
at hudson.model.AbstractProject.checkout(AbstractProject.java:1276)
at hudson.model.AbstractBuild$AbstractBuildExecution.defaultCheckout(AbstractBuild.java:560)
at jenkins.scm.SCMCheckoutStrategy.checkout(SCMCheckoutStrategy.java:86)
at hudson.model.AbstractBuild$AbstractBuildExecution.run(AbstractBuild.java:485)
at hudson.model.Run.execute(Run.java:1735)
at hudson.maven.MavenModuleSetBuild.run(MavenModuleSetBuild.java:542)
at hudson.model.ResourceController.execute(ResourceController.java:97)
at hudson.model.Executor.run(Executor.java:405)
Archiving artifacts
---------------------------------------------------------------------
To unsubscribe, e-mail: dev-unsubscribe@pdfbox.apache.org
For additional commands, e-mail: dev-help@pdfbox.apache.org
Build failed in Jenkins: PDFBox-Trunk-jdk9 #6
Posted by Apache Jenkins Server <je...@builds.apache.org>.
See <https://builds.apache.org/job/PDFBox-Trunk-jdk9/6/display/redirect>
------------------------------------------
[...truncated 27.88 KB...]
at org.tmatesoft.svn.core.internal.wc2.ng.SvnNgOperationRunner.run(SvnNgOperationRunner.java:20)
at org.tmatesoft.svn.core.internal.wc2.SvnOperationRunner.run(SvnOperationRunner.java:21)
at org.tmatesoft.svn.core.wc2.SvnOperationFactory.run(SvnOperationFactory.java:1235)
at org.tmatesoft.svn.core.wc2.SvnOperation.run(SvnOperation.java:294)
at org.tmatesoft.svn.core.wc.SVNUpdateClient.doUpdate(SVNUpdateClient.java:311)
at org.tmatesoft.svn.core.wc.SVNUpdateClient.doUpdate(SVNUpdateClient.java:291)
at org.tmatesoft.svn.core.wc.SVNUpdateClient.doUpdate(SVNUpdateClient.java:387)
at hudson.scm.subversion.UpdateUpdater$TaskImpl.perform(UpdateUpdater.java:158)
Caused: hudson.scm.subversion.UpdaterException: failed to perform svn update
at hudson.scm.subversion.UpdateUpdater$TaskImpl.perform(UpdateUpdater.java:212)
at hudson.scm.subversion.WorkspaceUpdater$UpdateTask.delegateTo(WorkspaceUpdater.java:162)
at hudson.scm.SubversionSCM$CheckOutTask.perform(SubversionSCM.java:1001)
at hudson.scm.SubversionSCM$CheckOutTask.invoke(SubversionSCM.java:977)
at hudson.scm.SubversionSCM$CheckOutTask.invoke(SubversionSCM.java:953)
at hudson.FilePath$FileCallableWrapper.call(FilePath.java:2739)
at hudson.remoting.UserRequest.perform(UserRequest.java:153)
at hudson.remoting.UserRequest.perform(UserRequest.java:50)
at hudson.remoting.Request$2.run(Request.java:336)
at hudson.remoting.InterceptingExecutorService$1.call(InterceptingExecutorService.java:68)
at java.util.concurrent.FutureTask.run(FutureTask.java:266)
at java.util.concurrent.ThreadPoolExecutor.runWorker(ThreadPoolExecutor.java:1142)
at java.util.concurrent.ThreadPoolExecutor$Worker.run(ThreadPoolExecutor.java:617)
at java.lang.Thread.run(Thread.java:748)
Caused: java.io.IOException
at hudson.scm.subversion.UpdateUpdater$TaskImpl.perform(UpdateUpdater.java:212)
at hudson.scm.subversion.WorkspaceUpdater$UpdateTask.delegateTo(WorkspaceUpdater.java:162)
at hudson.scm.SubversionSCM$CheckOutTask.perform(SubversionSCM.java:1001)
at hudson.scm.SubversionSCM$CheckOutTask.invoke(SubversionSCM.java:977)
at hudson.scm.SubversionSCM$CheckOutTask.invoke(SubversionSCM.java:953)
at hudson.FilePath$FileCallableWrapper.call(FilePath.java:2739)
at hudson.remoting.UserRequest.perform(UserRequest.java:153)
at hudson.remoting.UserRequest.perform(UserRequest.java:50)
at hudson.remoting.Request$2.run(Request.java:336)
at hudson.remoting.InterceptingExecutorService$1.call(InterceptingExecutorService.java:68)
at java.util.concurrent.FutureTask.run(FutureTask.java:266)
at java.util.concurrent.ThreadPoolExecutor.runWorker(ThreadPoolExecutor.java:1142)
at java.util.concurrent.ThreadPoolExecutor$Worker.run(ThreadPoolExecutor.java:617)
at java.lang.Thread.run(Thread.java:748)
at ......remote call to H21(Native Method)
at hudson.remoting.Channel.attachCallSiteStackTrace(Channel.java:1545)
at hudson.remoting.UserResponse.retrieve(UserRequest.java:253)
at hudson.remoting.Channel.call(Channel.java:830)
at hudson.FilePath.act(FilePath.java:986)
Caused: java.io.IOException: remote file operation failed: <https://builds.apache.org/job/PDFBox-Trunk-jdk9/ws/> at hudson.remoting.Channel@4b715ff3:H21
at hudson.FilePath.act(FilePath.java:993)
at hudson.FilePath.act(FilePath.java:975)
at hudson.scm.SubversionSCM.checkout(SubversionSCM.java:902)
at hudson.scm.SubversionSCM.checkout(SubversionSCM.java:838)
at hudson.scm.SCM.checkout(SCM.java:495)
at hudson.model.AbstractProject.checkout(AbstractProject.java:1276)
at hudson.model.AbstractBuild$AbstractBuildExecution.defaultCheckout(AbstractBuild.java:560)
at jenkins.scm.SCMCheckoutStrategy.checkout(SCMCheckoutStrategy.java:86)
at hudson.model.AbstractBuild$AbstractBuildExecution.run(AbstractBuild.java:485)
at hudson.model.Run.execute(Run.java:1735)
at hudson.maven.MavenModuleSetBuild.run(MavenModuleSetBuild.java:542)
at hudson.model.ResourceController.execute(ResourceController.java:97)
at hudson.model.Executor.run(Executor.java:405)
Retrying after 10 seconds
Cleaning up <https://builds.apache.org/job/PDFBox-Trunk-jdk9/ws/trunk>
Updating http://svn.apache.org/repos/asf/pdfbox/trunk at revision '2017-08-10T16:27:11.375 +0000'
ERROR: Failed to update http://svn.apache.org/repos/asf/pdfbox/trunk
org.tmatesoft.svn.core.SVNException: svn: E200030: java.io.IOException: Permission denied
at org.tmatesoft.svn.core.internal.wc.SVNErrorManager.error(SVNErrorManager.java:70)
at org.tmatesoft.svn.core.internal.wc.SVNErrorManager.error(SVNErrorManager.java:57)
at org.tmatesoft.svn.core.internal.io.dav.http.HTTPConnection.request(HTTPConnection.java:798)
at org.tmatesoft.svn.core.internal.io.dav.http.HTTPConnection.request(HTTPConnection.java:391)
at org.tmatesoft.svn.core.internal.io.dav.http.HTTPConnection.request(HTTPConnection.java:379)
at org.tmatesoft.svn.core.internal.io.dav.DAVConnection.performHttpRequest(DAVConnection.java:862)
at org.tmatesoft.svn.core.internal.io.dav.DAVConnection.doReport(DAVConnection.java:359)
at org.tmatesoft.svn.core.internal.io.dav.DAVRepository.runReport(DAVRepository.java:1341)
at org.tmatesoft.svn.core.internal.io.dav.DAVRepository.update(DAVRepository.java:868)
at org.tmatesoft.svn.core.internal.wc2.ng.SvnNgAbstractUpdate.updateInternal(SvnNgAbstractUpdate.java:247)
at org.tmatesoft.svn.core.internal.wc2.ng.SvnNgAbstractUpdate.update(SvnNgAbstractUpdate.java:111)
at org.tmatesoft.svn.core.internal.wc2.ng.SvnNgUpdate.run(SvnNgUpdate.java:40)
at org.tmatesoft.svn.core.internal.wc2.ng.SvnNgUpdate.run(SvnNgUpdate.java:18)
at org.tmatesoft.svn.core.internal.wc2.ng.SvnNgOperationRunner.run(SvnNgOperationRunner.java:20)
at org.tmatesoft.svn.core.internal.wc2.SvnOperationRunner.run(SvnOperationRunner.java:21)
at org.tmatesoft.svn.core.wc2.SvnOperationFactory.run(SvnOperationFactory.java:1235)
at org.tmatesoft.svn.core.wc2.SvnOperation.run(SvnOperation.java:294)
at org.tmatesoft.svn.core.wc.SVNUpdateClient.doUpdate(SVNUpdateClient.java:311)
at org.tmatesoft.svn.core.wc.SVNUpdateClient.doUpdate(SVNUpdateClient.java:291)
at org.tmatesoft.svn.core.wc.SVNUpdateClient.doUpdate(SVNUpdateClient.java:387)
at hudson.scm.subversion.UpdateUpdater$TaskImpl.perform(UpdateUpdater.java:158)
at hudson.scm.subversion.WorkspaceUpdater$UpdateTask.delegateTo(WorkspaceUpdater.java:162)
at hudson.scm.SubversionSCM$CheckOutTask.perform(SubversionSCM.java:1001)
at hudson.scm.SubversionSCM$CheckOutTask.invoke(SubversionSCM.java:977)
at hudson.scm.SubversionSCM$CheckOutTask.invoke(SubversionSCM.java:953)
at hudson.FilePath$FileCallableWrapper.call(FilePath.java:2739)
at hudson.remoting.UserRequest.perform(UserRequest.java:153)
at hudson.remoting.UserRequest.perform(UserRequest.java:50)
at hudson.remoting.Request$2.run(Request.java:336)
at hudson.remoting.InterceptingExecutorService$1.call(InterceptingExecutorService.java:68)
at java.util.concurrent.FutureTask.run(FutureTask.java:266)
at java.util.concurrent.ThreadPoolExecutor.runWorker(ThreadPoolExecutor.java:1142)
at java.util.concurrent.ThreadPoolExecutor$Worker.run(ThreadPoolExecutor.java:617)
at java.lang.Thread.run(Thread.java:748)
Caused by: org.tmatesoft.sqljet.core.SqlJetException: java.io.IOException: Permission denied: error code is CANTOPEN
at org.tmatesoft.sqljet.core.table.SqlJetDb.getTemporaryDatabaseFile(SqlJetDb.java:484)
at org.tmatesoft.sqljet.core.table.SqlJetDb.access$1400(SqlJetDb.java:63)
at org.tmatesoft.sqljet.core.table.SqlJetDb$15.runWithLock(SqlJetDb.java:449)
at org.tmatesoft.sqljet.core.table.SqlJetDb$1.runSynchronized(SqlJetDb.java:172)
at org.tmatesoft.sqljet.core.table.engine.SqlJetEngine.runSynchronized(SqlJetEngine.java:217)
at org.tmatesoft.sqljet.core.table.SqlJetDb.runWithLock(SqlJetDb.java:170)
at org.tmatesoft.sqljet.core.table.SqlJetDb.getTemporaryDatabase(SqlJetDb.java:445)
at org.tmatesoft.svn.core.internal.db.SVNSqlJetDb.getTemporaryDb(SVNSqlJetDb.java:132)
at org.tmatesoft.svn.core.internal.wc17.db.SVNWCDb$BumpRevisionPostUpdate.bumpMovedAway(SVNWCDb.java:5419)
at org.tmatesoft.svn.core.internal.wc17.db.SVNWCDb$BumpRevisionPostUpdate.transaction(SVNWCDb.java:5414)
at org.tmatesoft.svn.core.internal.db.SVNSqlJetDb.runTransaction(SVNSqlJetDb.java:258)
at org.tmatesoft.svn.core.internal.db.SVNSqlJetDb.runTransaction(SVNSqlJetDb.java:252)
at org.tmatesoft.svn.core.internal.wc17.db.SVNWCDb.opBumpRevisionPostUpdate(SVNWCDb.java:5366)
at org.tmatesoft.svn.core.internal.wc17.SVNUpdateEditor17.closeEdit(SVNUpdateEditor17.java:1728)
at org.tmatesoft.svn.core.internal.wc.SVNCancellableEditor.closeEdit(SVNCancellableEditor.java:148)
at org.tmatesoft.svn.core.internal.io.dav.handlers.DAVEditorHandler.endElement(DAVEditorHandler.java:492)
at org.tmatesoft.svn.core.internal.io.dav.handlers.BasicDAVHandler.endElement(BasicDAVHandler.java:103)
at com.sun.org.apache.xerces.internal.parsers.AbstractSAXParser.endElement(AbstractSAXParser.java:609)
at com.sun.org.apache.xerces.internal.impl.XMLDocumentFragmentScannerImpl.scanEndElement(XMLDocumentFragmentScannerImpl.java:1782)
at com.sun.org.apache.xerces.internal.impl.XMLDocumentFragmentScannerImpl$FragmentContentDriver.next(XMLDocumentFragmentScannerImpl.java:2967)
at com.sun.org.apache.xerces.internal.impl.XMLDocumentScannerImpl.next(XMLDocumentScannerImpl.java:602)
at com.sun.org.apache.xerces.internal.impl.XMLNSDocumentScannerImpl.next(XMLNSDocumentScannerImpl.java:112)
at com.sun.org.apache.xerces.internal.impl.XMLDocumentFragmentScannerImpl.scanDocument(XMLDocumentFragmentScannerImpl.java:505)
at com.sun.org.apache.xerces.internal.parsers.XML11Configuration.parse(XML11Configuration.java:841)
at com.sun.org.apache.xerces.internal.parsers.XML11Configuration.parse(XML11Configuration.java:770)
at com.sun.org.apache.xerces.internal.parsers.XMLParser.parse(XMLParser.java:141)
at com.sun.org.apache.xerces.internal.parsers.AbstractSAXParser.parse(AbstractSAXParser.java:1213)
at com.sun.org.apache.xerces.internal.jaxp.SAXParserImpl$JAXPSAXParser.parse(SAXParserImpl.java:643)
at org.tmatesoft.svn.core.internal.io.dav.http.HTTPConnection.readData(HTTPConnection.java:937)
at org.tmatesoft.svn.core.internal.io.dav.http.HTTPConnection.readData(HTTPConnection.java:902)
at org.tmatesoft.svn.core.internal.io.dav.http.HTTPRequest.dispatch(HTTPRequest.java:220)
at org.tmatesoft.svn.core.internal.io.dav.http.HTTPConnection.request(HTTPConnection.java:490)
... 31 more
Caused by: java.io.IOException: Permission denied
at java.io.UnixFileSystem.createFileExclusively(Native Method)
at java.io.File.createTempFile(File.java:2024)
at java.io.File.createTempFile(File.java:2070)
at org.tmatesoft.sqljet.core.internal.fs.SqlJetFileSystem.getTempFile(SqlJetFileSystem.java:202)
at org.tmatesoft.sqljet.core.table.SqlJetDb.getTemporaryDatabaseFile(SqlJetDb.java:482)
... 62 more
ERROR: Subversion update failed
java.io.IOException: Permission denied
at java.io.UnixFileSystem.createFileExclusively(Native Method)
at java.io.File.createTempFile(File.java:2024)
at java.io.File.createTempFile(File.java:2070)
at org.tmatesoft.sqljet.core.internal.fs.SqlJetFileSystem.getTempFile(SqlJetFileSystem.java:202)
at org.tmatesoft.sqljet.core.table.SqlJetDb.getTemporaryDatabaseFile(SqlJetDb.java:482)
Caused: org.tmatesoft.sqljet.core.SqlJetException: java.io.IOException: Permission denied: error code is CANTOPEN
at org.tmatesoft.sqljet.core.table.SqlJetDb.getTemporaryDatabaseFile(SqlJetDb.java:484)
at org.tmatesoft.sqljet.core.table.SqlJetDb.access$1400(SqlJetDb.java:63)
at org.tmatesoft.sqljet.core.table.SqlJetDb$15.runWithLock(SqlJetDb.java:449)
at org.tmatesoft.sqljet.core.table.SqlJetDb$1.runSynchronized(SqlJetDb.java:172)
at org.tmatesoft.sqljet.core.table.engine.SqlJetEngine.runSynchronized(SqlJetEngine.java:217)
at org.tmatesoft.sqljet.core.table.SqlJetDb.runWithLock(SqlJetDb.java:170)
at org.tmatesoft.sqljet.core.table.SqlJetDb.getTemporaryDatabase(SqlJetDb.java:445)
at org.tmatesoft.svn.core.internal.db.SVNSqlJetDb.getTemporaryDb(SVNSqlJetDb.java:132)
at org.tmatesoft.svn.core.internal.wc17.db.SVNWCDb$BumpRevisionPostUpdate.bumpMovedAway(SVNWCDb.java:5419)
at org.tmatesoft.svn.core.internal.wc17.db.SVNWCDb$BumpRevisionPostUpdate.transaction(SVNWCDb.java:5414)
at org.tmatesoft.svn.core.internal.db.SVNSqlJetDb.runTransaction(SVNSqlJetDb.java:258)
at org.tmatesoft.svn.core.internal.db.SVNSqlJetDb.runTransaction(SVNSqlJetDb.java:252)
at org.tmatesoft.svn.core.internal.wc17.db.SVNWCDb.opBumpRevisionPostUpdate(SVNWCDb.java:5366)
at org.tmatesoft.svn.core.internal.wc17.SVNUpdateEditor17.closeEdit(SVNUpdateEditor17.java:1728)
at org.tmatesoft.svn.core.internal.wc.SVNCancellableEditor.closeEdit(SVNCancellableEditor.java:148)
at org.tmatesoft.svn.core.internal.io.dav.handlers.DAVEditorHandler.endElement(DAVEditorHandler.java:492)
at org.tmatesoft.svn.core.internal.io.dav.handlers.BasicDAVHandler.endElement(BasicDAVHandler.java:103)
at com.sun.org.apache.xerces.internal.parsers.AbstractSAXParser.endElement(AbstractSAXParser.java:609)
at com.sun.org.apache.xerces.internal.impl.XMLDocumentFragmentScannerImpl.scanEndElement(XMLDocumentFragmentScannerImpl.java:1782)
at com.sun.org.apache.xerces.internal.impl.XMLDocumentFragmentScannerImpl$FragmentContentDriver.next(XMLDocumentFragmentScannerImpl.java:2967)
at com.sun.org.apache.xerces.internal.impl.XMLDocumentScannerImpl.next(XMLDocumentScannerImpl.java:602)
at com.sun.org.apache.xerces.internal.impl.XMLNSDocumentScannerImpl.next(XMLNSDocumentScannerImpl.java:112)
at com.sun.org.apache.xerces.internal.impl.XMLDocumentFragmentScannerImpl.scanDocument(XMLDocumentFragmentScannerImpl.java:505)
at com.sun.org.apache.xerces.internal.parsers.XML11Configuration.parse(XML11Configuration.java:841)
at com.sun.org.apache.xerces.internal.parsers.XML11Configuration.parse(XML11Configuration.java:770)
at com.sun.org.apache.xerces.internal.parsers.XMLParser.parse(XMLParser.java:141)
at com.sun.org.apache.xerces.internal.parsers.AbstractSAXParser.parse(AbstractSAXParser.java:1213)
at com.sun.org.apache.xerces.internal.jaxp.SAXParserImpl$JAXPSAXParser.parse(SAXParserImpl.java:643)
at org.tmatesoft.svn.core.internal.io.dav.http.HTTPConnection.readData(HTTPConnection.java:937)
at org.tmatesoft.svn.core.internal.io.dav.http.HTTPConnection.readData(HTTPConnection.java:902)
at org.tmatesoft.svn.core.internal.io.dav.http.HTTPRequest.dispatch(HTTPRequest.java:220)
at org.tmatesoft.svn.core.internal.io.dav.http.HTTPConnection.request(HTTPConnection.java:490)
Caused: org.tmatesoft.svn.core.SVNException: svn: E200030: java.io.IOException: Permission denied
at org.tmatesoft.svn.core.internal.wc.SVNErrorManager.error(SVNErrorManager.java:70)
at org.tmatesoft.svn.core.internal.wc.SVNErrorManager.error(SVNErrorManager.java:57)
at org.tmatesoft.svn.core.internal.io.dav.http.HTTPConnection.request(HTTPConnection.java:798)
at org.tmatesoft.svn.core.internal.io.dav.http.HTTPConnection.request(HTTPConnection.java:391)
at org.tmatesoft.svn.core.internal.io.dav.http.HTTPConnection.request(HTTPConnection.java:379)
at org.tmatesoft.svn.core.internal.io.dav.DAVConnection.performHttpRequest(DAVConnection.java:862)
at org.tmatesoft.svn.core.internal.io.dav.DAVConnection.doReport(DAVConnection.java:359)
at org.tmatesoft.svn.core.internal.io.dav.DAVRepository.runReport(DAVRepository.java:1341)
at org.tmatesoft.svn.core.internal.io.dav.DAVRepository.update(DAVRepository.java:868)
at org.tmatesoft.svn.core.internal.wc2.ng.SvnNgAbstractUpdate.updateInternal(SvnNgAbstractUpdate.java:247)
at org.tmatesoft.svn.core.internal.wc2.ng.SvnNgAbstractUpdate.update(SvnNgAbstractUpdate.java:111)
at org.tmatesoft.svn.core.internal.wc2.ng.SvnNgUpdate.run(SvnNgUpdate.java:40)
at org.tmatesoft.svn.core.internal.wc2.ng.SvnNgUpdate.run(SvnNgUpdate.java:18)
at org.tmatesoft.svn.core.internal.wc2.ng.SvnNgOperationRunner.run(SvnNgOperationRunner.java:20)
at org.tmatesoft.svn.core.internal.wc2.SvnOperationRunner.run(SvnOperationRunner.java:21)
at org.tmatesoft.svn.core.wc2.SvnOperationFactory.run(SvnOperationFactory.java:1235)
at org.tmatesoft.svn.core.wc2.SvnOperation.run(SvnOperation.java:294)
at org.tmatesoft.svn.core.wc.SVNUpdateClient.doUpdate(SVNUpdateClient.java:311)
at org.tmatesoft.svn.core.wc.SVNUpdateClient.doUpdate(SVNUpdateClient.java:291)
at org.tmatesoft.svn.core.wc.SVNUpdateClient.doUpdate(SVNUpdateClient.java:387)
at hudson.scm.subversion.UpdateUpdater$TaskImpl.perform(UpdateUpdater.java:158)
Caused: hudson.scm.subversion.UpdaterException: failed to perform svn update
at hudson.scm.subversion.UpdateUpdater$TaskImpl.perform(UpdateUpdater.java:212)
at hudson.scm.subversion.WorkspaceUpdater$UpdateTask.delegateTo(WorkspaceUpdater.java:162)
at hudson.scm.SubversionSCM$CheckOutTask.perform(SubversionSCM.java:1001)
at hudson.scm.SubversionSCM$CheckOutTask.invoke(SubversionSCM.java:977)
at hudson.scm.SubversionSCM$CheckOutTask.invoke(SubversionSCM.java:953)
at hudson.FilePath$FileCallableWrapper.call(FilePath.java:2739)
at hudson.remoting.UserRequest.perform(UserRequest.java:153)
at hudson.remoting.UserRequest.perform(UserRequest.java:50)
at hudson.remoting.Request$2.run(Request.java:336)
at hudson.remoting.InterceptingExecutorService$1.call(InterceptingExecutorService.java:68)
at java.util.concurrent.FutureTask.run(FutureTask.java:266)
at java.util.concurrent.ThreadPoolExecutor.runWorker(ThreadPoolExecutor.java:1142)
at java.util.concurrent.ThreadPoolExecutor$Worker.run(ThreadPoolExecutor.java:617)
at java.lang.Thread.run(Thread.java:748)
Caused: java.io.IOException
at hudson.scm.subversion.UpdateUpdater$TaskImpl.perform(UpdateUpdater.java:212)
at hudson.scm.subversion.WorkspaceUpdater$UpdateTask.delegateTo(WorkspaceUpdater.java:162)
at hudson.scm.SubversionSCM$CheckOutTask.perform(SubversionSCM.java:1001)
at hudson.scm.SubversionSCM$CheckOutTask.invoke(SubversionSCM.java:977)
at hudson.scm.SubversionSCM$CheckOutTask.invoke(SubversionSCM.java:953)
at hudson.FilePath$FileCallableWrapper.call(FilePath.java:2739)
at hudson.remoting.UserRequest.perform(UserRequest.java:153)
at hudson.remoting.UserRequest.perform(UserRequest.java:50)
at hudson.remoting.Request$2.run(Request.java:336)
at hudson.remoting.InterceptingExecutorService$1.call(InterceptingExecutorService.java:68)
at java.util.concurrent.FutureTask.run(FutureTask.java:266)
at java.util.concurrent.ThreadPoolExecutor.runWorker(ThreadPoolExecutor.java:1142)
at java.util.concurrent.ThreadPoolExecutor$Worker.run(ThreadPoolExecutor.java:617)
at java.lang.Thread.run(Thread.java:748)
at ......remote call to H21(Native Method)
at hudson.remoting.Channel.attachCallSiteStackTrace(Channel.java:1545)
at hudson.remoting.UserResponse.retrieve(UserRequest.java:253)
at hudson.remoting.Channel.call(Channel.java:830)
at hudson.FilePath.act(FilePath.java:986)
Caused: java.io.IOException: remote file operation failed: <https://builds.apache.org/job/PDFBox-Trunk-jdk9/ws/> at hudson.remoting.Channel@4b715ff3:H21
at hudson.FilePath.act(FilePath.java:993)
at hudson.FilePath.act(FilePath.java:975)
at hudson.scm.SubversionSCM.checkout(SubversionSCM.java:902)
at hudson.scm.SubversionSCM.checkout(SubversionSCM.java:838)
at hudson.scm.SCM.checkout(SCM.java:495)
at hudson.model.AbstractProject.checkout(AbstractProject.java:1276)
at hudson.model.AbstractBuild$AbstractBuildExecution.defaultCheckout(AbstractBuild.java:560)
at jenkins.scm.SCMCheckoutStrategy.checkout(SCMCheckoutStrategy.java:86)
at hudson.model.AbstractBuild$AbstractBuildExecution.run(AbstractBuild.java:485)
at hudson.model.Run.execute(Run.java:1735)
at hudson.maven.MavenModuleSetBuild.run(MavenModuleSetBuild.java:542)
at hudson.model.ResourceController.execute(ResourceController.java:97)
at hudson.model.Executor.run(Executor.java:405)
Archiving artifacts
---------------------------------------------------------------------
To unsubscribe, e-mail: dev-unsubscribe@pdfbox.apache.org
For additional commands, e-mail: dev-help@pdfbox.apache.org
Build failed in Jenkins: PDFBox-Trunk-jdk9 #5
Posted by Apache Jenkins Server <je...@builds.apache.org>.
See <https://builds.apache.org/job/PDFBox-Trunk-jdk9/5/display/redirect>
------------------------------------------
[...truncated 28.14 KB...]
at org.tmatesoft.svn.core.internal.wc2.ng.SvnNgOperationRunner.run(SvnNgOperationRunner.java:20)
at org.tmatesoft.svn.core.internal.wc2.SvnOperationRunner.run(SvnOperationRunner.java:21)
at org.tmatesoft.svn.core.wc2.SvnOperationFactory.run(SvnOperationFactory.java:1235)
at org.tmatesoft.svn.core.wc2.SvnOperation.run(SvnOperation.java:294)
at org.tmatesoft.svn.core.wc.SVNUpdateClient.doUpdate(SVNUpdateClient.java:311)
at org.tmatesoft.svn.core.wc.SVNUpdateClient.doUpdate(SVNUpdateClient.java:291)
at org.tmatesoft.svn.core.wc.SVNUpdateClient.doUpdate(SVNUpdateClient.java:387)
at hudson.scm.subversion.UpdateUpdater$TaskImpl.perform(UpdateUpdater.java:158)
Caused: hudson.scm.subversion.UpdaterException: failed to perform svn update
at hudson.scm.subversion.UpdateUpdater$TaskImpl.perform(UpdateUpdater.java:212)
at hudson.scm.subversion.WorkspaceUpdater$UpdateTask.delegateTo(WorkspaceUpdater.java:162)
at hudson.scm.SubversionSCM$CheckOutTask.perform(SubversionSCM.java:1001)
at hudson.scm.SubversionSCM$CheckOutTask.invoke(SubversionSCM.java:977)
at hudson.scm.SubversionSCM$CheckOutTask.invoke(SubversionSCM.java:953)
at hudson.FilePath$FileCallableWrapper.call(FilePath.java:2739)
at hudson.remoting.UserRequest.perform(UserRequest.java:153)
at hudson.remoting.UserRequest.perform(UserRequest.java:50)
at hudson.remoting.Request$2.run(Request.java:336)
at hudson.remoting.InterceptingExecutorService$1.call(InterceptingExecutorService.java:68)
at java.util.concurrent.FutureTask.run(FutureTask.java:266)
at java.util.concurrent.ThreadPoolExecutor.runWorker(ThreadPoolExecutor.java:1142)
at java.util.concurrent.ThreadPoolExecutor$Worker.run(ThreadPoolExecutor.java:617)
at java.lang.Thread.run(Thread.java:748)
Caused: java.io.IOException
at hudson.scm.subversion.UpdateUpdater$TaskImpl.perform(UpdateUpdater.java:212)
at hudson.scm.subversion.WorkspaceUpdater$UpdateTask.delegateTo(WorkspaceUpdater.java:162)
at hudson.scm.SubversionSCM$CheckOutTask.perform(SubversionSCM.java:1001)
at hudson.scm.SubversionSCM$CheckOutTask.invoke(SubversionSCM.java:977)
at hudson.scm.SubversionSCM$CheckOutTask.invoke(SubversionSCM.java:953)
at hudson.FilePath$FileCallableWrapper.call(FilePath.java:2739)
at hudson.remoting.UserRequest.perform(UserRequest.java:153)
at hudson.remoting.UserRequest.perform(UserRequest.java:50)
at hudson.remoting.Request$2.run(Request.java:336)
at hudson.remoting.InterceptingExecutorService$1.call(InterceptingExecutorService.java:68)
at java.util.concurrent.FutureTask.run(FutureTask.java:266)
at java.util.concurrent.ThreadPoolExecutor.runWorker(ThreadPoolExecutor.java:1142)
at java.util.concurrent.ThreadPoolExecutor$Worker.run(ThreadPoolExecutor.java:617)
at java.lang.Thread.run(Thread.java:748)
at ......remote call to H21(Native Method)
at hudson.remoting.Channel.attachCallSiteStackTrace(Channel.java:1545)
at hudson.remoting.UserResponse.retrieve(UserRequest.java:253)
at hudson.remoting.Channel.call(Channel.java:830)
at hudson.FilePath.act(FilePath.java:986)
Caused: java.io.IOException: remote file operation failed: <https://builds.apache.org/job/PDFBox-Trunk-jdk9/ws/> at hudson.remoting.Channel@4b715ff3:H21
at hudson.FilePath.act(FilePath.java:993)
at hudson.FilePath.act(FilePath.java:975)
at hudson.scm.SubversionSCM.checkout(SubversionSCM.java:902)
at hudson.scm.SubversionSCM.checkout(SubversionSCM.java:838)
at hudson.scm.SCM.checkout(SCM.java:495)
at hudson.model.AbstractProject.checkout(AbstractProject.java:1276)
at hudson.model.AbstractBuild$AbstractBuildExecution.defaultCheckout(AbstractBuild.java:560)
at jenkins.scm.SCMCheckoutStrategy.checkout(SCMCheckoutStrategy.java:86)
at hudson.model.AbstractBuild$AbstractBuildExecution.run(AbstractBuild.java:485)
at hudson.model.Run.execute(Run.java:1735)
at hudson.maven.MavenModuleSetBuild.run(MavenModuleSetBuild.java:542)
at hudson.model.ResourceController.execute(ResourceController.java:97)
at hudson.model.Executor.run(Executor.java:405)
Retrying after 10 seconds
Cleaning up <https://builds.apache.org/job/PDFBox-Trunk-jdk9/ws/trunk>
Updating http://svn.apache.org/repos/asf/pdfbox/trunk at revision '2017-08-10T16:21:39.951 +0000'
ERROR: Failed to update http://svn.apache.org/repos/asf/pdfbox/trunk
org.tmatesoft.svn.core.SVNException: svn: E200030: java.io.IOException: Permission denied
at org.tmatesoft.svn.core.internal.wc.SVNErrorManager.error(SVNErrorManager.java:70)
at org.tmatesoft.svn.core.internal.wc.SVNErrorManager.error(SVNErrorManager.java:57)
at org.tmatesoft.svn.core.internal.io.dav.http.HTTPConnection.request(HTTPConnection.java:798)
at org.tmatesoft.svn.core.internal.io.dav.http.HTTPConnection.request(HTTPConnection.java:391)
at org.tmatesoft.svn.core.internal.io.dav.http.HTTPConnection.request(HTTPConnection.java:379)
at org.tmatesoft.svn.core.internal.io.dav.DAVConnection.performHttpRequest(DAVConnection.java:862)
at org.tmatesoft.svn.core.internal.io.dav.DAVConnection.doReport(DAVConnection.java:359)
at org.tmatesoft.svn.core.internal.io.dav.DAVRepository.runReport(DAVRepository.java:1341)
at org.tmatesoft.svn.core.internal.io.dav.DAVRepository.update(DAVRepository.java:868)
at org.tmatesoft.svn.core.internal.wc2.ng.SvnNgAbstractUpdate.updateInternal(SvnNgAbstractUpdate.java:247)
at org.tmatesoft.svn.core.internal.wc2.ng.SvnNgAbstractUpdate.update(SvnNgAbstractUpdate.java:111)
at org.tmatesoft.svn.core.internal.wc2.ng.SvnNgUpdate.run(SvnNgUpdate.java:40)
at org.tmatesoft.svn.core.internal.wc2.ng.SvnNgUpdate.run(SvnNgUpdate.java:18)
at org.tmatesoft.svn.core.internal.wc2.ng.SvnNgOperationRunner.run(SvnNgOperationRunner.java:20)
at org.tmatesoft.svn.core.internal.wc2.SvnOperationRunner.run(SvnOperationRunner.java:21)
at org.tmatesoft.svn.core.wc2.SvnOperationFactory.run(SvnOperationFactory.java:1235)
at org.tmatesoft.svn.core.wc2.SvnOperation.run(SvnOperation.java:294)
at org.tmatesoft.svn.core.wc.SVNUpdateClient.doUpdate(SVNUpdateClient.java:311)
at org.tmatesoft.svn.core.wc.SVNUpdateClient.doUpdate(SVNUpdateClient.java:291)
at org.tmatesoft.svn.core.wc.SVNUpdateClient.doUpdate(SVNUpdateClient.java:387)
at hudson.scm.subversion.UpdateUpdater$TaskImpl.perform(UpdateUpdater.java:158)
at hudson.scm.subversion.WorkspaceUpdater$UpdateTask.delegateTo(WorkspaceUpdater.java:162)
at hudson.scm.SubversionSCM$CheckOutTask.perform(SubversionSCM.java:1001)
at hudson.scm.SubversionSCM$CheckOutTask.invoke(SubversionSCM.java:977)
at hudson.scm.SubversionSCM$CheckOutTask.invoke(SubversionSCM.java:953)
at hudson.FilePath$FileCallableWrapper.call(FilePath.java:2739)
at hudson.remoting.UserRequest.perform(UserRequest.java:153)
at hudson.remoting.UserRequest.perform(UserRequest.java:50)
at hudson.remoting.Request$2.run(Request.java:336)
at hudson.remoting.InterceptingExecutorService$1.call(InterceptingExecutorService.java:68)
at java.util.concurrent.FutureTask.run(FutureTask.java:266)
at java.util.concurrent.ThreadPoolExecutor.runWorker(ThreadPoolExecutor.java:1142)
at java.util.concurrent.ThreadPoolExecutor$Worker.run(ThreadPoolExecutor.java:617)
at java.lang.Thread.run(Thread.java:748)
Caused by: org.tmatesoft.sqljet.core.SqlJetException: java.io.IOException: Permission denied: error code is CANTOPEN
at org.tmatesoft.sqljet.core.table.SqlJetDb.getTemporaryDatabaseFile(SqlJetDb.java:484)
at org.tmatesoft.sqljet.core.table.SqlJetDb.access$1400(SqlJetDb.java:63)
at org.tmatesoft.sqljet.core.table.SqlJetDb$15.runWithLock(SqlJetDb.java:449)
at org.tmatesoft.sqljet.core.table.SqlJetDb$1.runSynchronized(SqlJetDb.java:172)
at org.tmatesoft.sqljet.core.table.engine.SqlJetEngine.runSynchronized(SqlJetEngine.java:217)
at org.tmatesoft.sqljet.core.table.SqlJetDb.runWithLock(SqlJetDb.java:170)
at org.tmatesoft.sqljet.core.table.SqlJetDb.getTemporaryDatabase(SqlJetDb.java:445)
at org.tmatesoft.svn.core.internal.db.SVNSqlJetDb.getTemporaryDb(SVNSqlJetDb.java:132)
at org.tmatesoft.svn.core.internal.wc17.db.SVNWCDb$BumpRevisionPostUpdate.bumpMovedAway(SVNWCDb.java:5419)
at org.tmatesoft.svn.core.internal.wc17.db.SVNWCDb$BumpRevisionPostUpdate.transaction(SVNWCDb.java:5414)
at org.tmatesoft.svn.core.internal.db.SVNSqlJetDb.runTransaction(SVNSqlJetDb.java:258)
at org.tmatesoft.svn.core.internal.db.SVNSqlJetDb.runTransaction(SVNSqlJetDb.java:252)
at org.tmatesoft.svn.core.internal.wc17.db.SVNWCDb.opBumpRevisionPostUpdate(SVNWCDb.java:5366)
at org.tmatesoft.svn.core.internal.wc17.SVNUpdateEditor17.closeEdit(SVNUpdateEditor17.java:1728)
at org.tmatesoft.svn.core.internal.wc.SVNCancellableEditor.closeEdit(SVNCancellableEditor.java:148)
at org.tmatesoft.svn.core.internal.io.dav.handlers.DAVEditorHandler.endElement(DAVEditorHandler.java:492)
at org.tmatesoft.svn.core.internal.io.dav.handlers.BasicDAVHandler.endElement(BasicDAVHandler.java:103)
at com.sun.org.apache.xerces.internal.parsers.AbstractSAXParser.endElement(AbstractSAXParser.java:609)
at com.sun.org.apache.xerces.internal.impl.XMLDocumentFragmentScannerImpl.scanEndElement(XMLDocumentFragmentScannerImpl.java:1782)
at com.sun.org.apache.xerces.internal.impl.XMLDocumentFragmentScannerImpl$FragmentContentDriver.next(XMLDocumentFragmentScannerImpl.java:2967)
at com.sun.org.apache.xerces.internal.impl.XMLDocumentScannerImpl.next(XMLDocumentScannerImpl.java:602)
at com.sun.org.apache.xerces.internal.impl.XMLNSDocumentScannerImpl.next(XMLNSDocumentScannerImpl.java:112)
at com.sun.org.apache.xerces.internal.impl.XMLDocumentFragmentScannerImpl.scanDocument(XMLDocumentFragmentScannerImpl.java:505)
at com.sun.org.apache.xerces.internal.parsers.XML11Configuration.parse(XML11Configuration.java:841)
at com.sun.org.apache.xerces.internal.parsers.XML11Configuration.parse(XML11Configuration.java:770)
at com.sun.org.apache.xerces.internal.parsers.XMLParser.parse(XMLParser.java:141)
at com.sun.org.apache.xerces.internal.parsers.AbstractSAXParser.parse(AbstractSAXParser.java:1213)
at com.sun.org.apache.xerces.internal.jaxp.SAXParserImpl$JAXPSAXParser.parse(SAXParserImpl.java:643)
at org.tmatesoft.svn.core.internal.io.dav.http.HTTPConnection.readData(HTTPConnection.java:937)
at org.tmatesoft.svn.core.internal.io.dav.http.HTTPConnection.readData(HTTPConnection.java:902)
at org.tmatesoft.svn.core.internal.io.dav.http.HTTPRequest.dispatch(HTTPRequest.java:220)
at org.tmatesoft.svn.core.internal.io.dav.http.HTTPConnection.request(HTTPConnection.java:490)
... 31 more
Caused by: java.io.IOException: Permission denied
at java.io.UnixFileSystem.createFileExclusively(Native Method)
at java.io.File.createTempFile(File.java:2024)
at java.io.File.createTempFile(File.java:2070)
at org.tmatesoft.sqljet.core.internal.fs.SqlJetFileSystem.getTempFile(SqlJetFileSystem.java:202)
at org.tmatesoft.sqljet.core.table.SqlJetDb.getTemporaryDatabaseFile(SqlJetDb.java:482)
... 62 more
ERROR: Subversion update failed
java.io.IOException: Permission denied
at java.io.UnixFileSystem.createFileExclusively(Native Method)
at java.io.File.createTempFile(File.java:2024)
at java.io.File.createTempFile(File.java:2070)
at org.tmatesoft.sqljet.core.internal.fs.SqlJetFileSystem.getTempFile(SqlJetFileSystem.java:202)
at org.tmatesoft.sqljet.core.table.SqlJetDb.getTemporaryDatabaseFile(SqlJetDb.java:482)
Caused: org.tmatesoft.sqljet.core.SqlJetException: java.io.IOException: Permission denied: error code is CANTOPEN
at org.tmatesoft.sqljet.core.table.SqlJetDb.getTemporaryDatabaseFile(SqlJetDb.java:484)
at org.tmatesoft.sqljet.core.table.SqlJetDb.access$1400(SqlJetDb.java:63)
at org.tmatesoft.sqljet.core.table.SqlJetDb$15.runWithLock(SqlJetDb.java:449)
at org.tmatesoft.sqljet.core.table.SqlJetDb$1.runSynchronized(SqlJetDb.java:172)
at org.tmatesoft.sqljet.core.table.engine.SqlJetEngine.runSynchronized(SqlJetEngine.java:217)
at org.tmatesoft.sqljet.core.table.SqlJetDb.runWithLock(SqlJetDb.java:170)
at org.tmatesoft.sqljet.core.table.SqlJetDb.getTemporaryDatabase(SqlJetDb.java:445)
at org.tmatesoft.svn.core.internal.db.SVNSqlJetDb.getTemporaryDb(SVNSqlJetDb.java:132)
at org.tmatesoft.svn.core.internal.wc17.db.SVNWCDb$BumpRevisionPostUpdate.bumpMovedAway(SVNWCDb.java:5419)
at org.tmatesoft.svn.core.internal.wc17.db.SVNWCDb$BumpRevisionPostUpdate.transaction(SVNWCDb.java:5414)
at org.tmatesoft.svn.core.internal.db.SVNSqlJetDb.runTransaction(SVNSqlJetDb.java:258)
at org.tmatesoft.svn.core.internal.db.SVNSqlJetDb.runTransaction(SVNSqlJetDb.java:252)
at org.tmatesoft.svn.core.internal.wc17.db.SVNWCDb.opBumpRevisionPostUpdate(SVNWCDb.java:5366)
at org.tmatesoft.svn.core.internal.wc17.SVNUpdateEditor17.closeEdit(SVNUpdateEditor17.java:1728)
at org.tmatesoft.svn.core.internal.wc.SVNCancellableEditor.closeEdit(SVNCancellableEditor.java:148)
at org.tmatesoft.svn.core.internal.io.dav.handlers.DAVEditorHandler.endElement(DAVEditorHandler.java:492)
at org.tmatesoft.svn.core.internal.io.dav.handlers.BasicDAVHandler.endElement(BasicDAVHandler.java:103)
at com.sun.org.apache.xerces.internal.parsers.AbstractSAXParser.endElement(AbstractSAXParser.java:609)
at com.sun.org.apache.xerces.internal.impl.XMLDocumentFragmentScannerImpl.scanEndElement(XMLDocumentFragmentScannerImpl.java:1782)
at com.sun.org.apache.xerces.internal.impl.XMLDocumentFragmentScannerImpl$FragmentContentDriver.next(XMLDocumentFragmentScannerImpl.java:2967)
at com.sun.org.apache.xerces.internal.impl.XMLDocumentScannerImpl.next(XMLDocumentScannerImpl.java:602)
at com.sun.org.apache.xerces.internal.impl.XMLNSDocumentScannerImpl.next(XMLNSDocumentScannerImpl.java:112)
at com.sun.org.apache.xerces.internal.impl.XMLDocumentFragmentScannerImpl.scanDocument(XMLDocumentFragmentScannerImpl.java:505)
at com.sun.org.apache.xerces.internal.parsers.XML11Configuration.parse(XML11Configuration.java:841)
at com.sun.org.apache.xerces.internal.parsers.XML11Configuration.parse(XML11Configuration.java:770)
at com.sun.org.apache.xerces.internal.parsers.XMLParser.parse(XMLParser.java:141)
at com.sun.org.apache.xerces.internal.parsers.AbstractSAXParser.parse(AbstractSAXParser.java:1213)
at com.sun.org.apache.xerces.internal.jaxp.SAXParserImpl$JAXPSAXParser.parse(SAXParserImpl.java:643)
at org.tmatesoft.svn.core.internal.io.dav.http.HTTPConnection.readData(HTTPConnection.java:937)
at org.tmatesoft.svn.core.internal.io.dav.http.HTTPConnection.readData(HTTPConnection.java:902)
at org.tmatesoft.svn.core.internal.io.dav.http.HTTPRequest.dispatch(HTTPRequest.java:220)
at org.tmatesoft.svn.core.internal.io.dav.http.HTTPConnection.request(HTTPConnection.java:490)
Caused: org.tmatesoft.svn.core.SVNException: svn: E200030: java.io.IOException: Permission denied
at org.tmatesoft.svn.core.internal.wc.SVNErrorManager.error(SVNErrorManager.java:70)
at org.tmatesoft.svn.core.internal.wc.SVNErrorManager.error(SVNErrorManager.java:57)
at org.tmatesoft.svn.core.internal.io.dav.http.HTTPConnection.request(HTTPConnection.java:798)
at org.tmatesoft.svn.core.internal.io.dav.http.HTTPConnection.request(HTTPConnection.java:391)
at org.tmatesoft.svn.core.internal.io.dav.http.HTTPConnection.request(HTTPConnection.java:379)
at org.tmatesoft.svn.core.internal.io.dav.DAVConnection.performHttpRequest(DAVConnection.java:862)
at org.tmatesoft.svn.core.internal.io.dav.DAVConnection.doReport(DAVConnection.java:359)
at org.tmatesoft.svn.core.internal.io.dav.DAVRepository.runReport(DAVRepository.java:1341)
at org.tmatesoft.svn.core.internal.io.dav.DAVRepository.update(DAVRepository.java:868)
at org.tmatesoft.svn.core.internal.wc2.ng.SvnNgAbstractUpdate.updateInternal(SvnNgAbstractUpdate.java:247)
at org.tmatesoft.svn.core.internal.wc2.ng.SvnNgAbstractUpdate.update(SvnNgAbstractUpdate.java:111)
at org.tmatesoft.svn.core.internal.wc2.ng.SvnNgUpdate.run(SvnNgUpdate.java:40)
at org.tmatesoft.svn.core.internal.wc2.ng.SvnNgUpdate.run(SvnNgUpdate.java:18)
at org.tmatesoft.svn.core.internal.wc2.ng.SvnNgOperationRunner.run(SvnNgOperationRunner.java:20)
at org.tmatesoft.svn.core.internal.wc2.SvnOperationRunner.run(SvnOperationRunner.java:21)
at org.tmatesoft.svn.core.wc2.SvnOperationFactory.run(SvnOperationFactory.java:1235)
at org.tmatesoft.svn.core.wc2.SvnOperation.run(SvnOperation.java:294)
at org.tmatesoft.svn.core.wc.SVNUpdateClient.doUpdate(SVNUpdateClient.java:311)
at org.tmatesoft.svn.core.wc.SVNUpdateClient.doUpdate(SVNUpdateClient.java:291)
at org.tmatesoft.svn.core.wc.SVNUpdateClient.doUpdate(SVNUpdateClient.java:387)
at hudson.scm.subversion.UpdateUpdater$TaskImpl.perform(UpdateUpdater.java:158)
Caused: hudson.scm.subversion.UpdaterException: failed to perform svn update
at hudson.scm.subversion.UpdateUpdater$TaskImpl.perform(UpdateUpdater.java:212)
at hudson.scm.subversion.WorkspaceUpdater$UpdateTask.delegateTo(WorkspaceUpdater.java:162)
at hudson.scm.SubversionSCM$CheckOutTask.perform(SubversionSCM.java:1001)
at hudson.scm.SubversionSCM$CheckOutTask.invoke(SubversionSCM.java:977)
at hudson.scm.SubversionSCM$CheckOutTask.invoke(SubversionSCM.java:953)
at hudson.FilePath$FileCallableWrapper.call(FilePath.java:2739)
at hudson.remoting.UserRequest.perform(UserRequest.java:153)
at hudson.remoting.UserRequest.perform(UserRequest.java:50)
at hudson.remoting.Request$2.run(Request.java:336)
at hudson.remoting.InterceptingExecutorService$1.call(InterceptingExecutorService.java:68)
at java.util.concurrent.FutureTask.run(FutureTask.java:266)
at java.util.concurrent.ThreadPoolExecutor.runWorker(ThreadPoolExecutor.java:1142)
at java.util.concurrent.ThreadPoolExecutor$Worker.run(ThreadPoolExecutor.java:617)
at java.lang.Thread.run(Thread.java:748)
Caused: java.io.IOException
at hudson.scm.subversion.UpdateUpdater$TaskImpl.perform(UpdateUpdater.java:212)
at hudson.scm.subversion.WorkspaceUpdater$UpdateTask.delegateTo(WorkspaceUpdater.java:162)
at hudson.scm.SubversionSCM$CheckOutTask.perform(SubversionSCM.java:1001)
at hudson.scm.SubversionSCM$CheckOutTask.invoke(SubversionSCM.java:977)
at hudson.scm.SubversionSCM$CheckOutTask.invoke(SubversionSCM.java:953)
at hudson.FilePath$FileCallableWrapper.call(FilePath.java:2739)
at hudson.remoting.UserRequest.perform(UserRequest.java:153)
at hudson.remoting.UserRequest.perform(UserRequest.java:50)
at hudson.remoting.Request$2.run(Request.java:336)
at hudson.remoting.InterceptingExecutorService$1.call(InterceptingExecutorService.java:68)
at java.util.concurrent.FutureTask.run(FutureTask.java:266)
at java.util.concurrent.ThreadPoolExecutor.runWorker(ThreadPoolExecutor.java:1142)
at java.util.concurrent.ThreadPoolExecutor$Worker.run(ThreadPoolExecutor.java:617)
at java.lang.Thread.run(Thread.java:748)
at ......remote call to H21(Native Method)
at hudson.remoting.Channel.attachCallSiteStackTrace(Channel.java:1545)
at hudson.remoting.UserResponse.retrieve(UserRequest.java:253)
at hudson.remoting.Channel.call(Channel.java:830)
at hudson.FilePath.act(FilePath.java:986)
Caused: java.io.IOException: remote file operation failed: <https://builds.apache.org/job/PDFBox-Trunk-jdk9/ws/> at hudson.remoting.Channel@4b715ff3:H21
at hudson.FilePath.act(FilePath.java:993)
at hudson.FilePath.act(FilePath.java:975)
at hudson.scm.SubversionSCM.checkout(SubversionSCM.java:902)
at hudson.scm.SubversionSCM.checkout(SubversionSCM.java:838)
at hudson.scm.SCM.checkout(SCM.java:495)
at hudson.model.AbstractProject.checkout(AbstractProject.java:1276)
at hudson.model.AbstractBuild$AbstractBuildExecution.defaultCheckout(AbstractBuild.java:560)
at jenkins.scm.SCMCheckoutStrategy.checkout(SCMCheckoutStrategy.java:86)
at hudson.model.AbstractBuild$AbstractBuildExecution.run(AbstractBuild.java:485)
at hudson.model.Run.execute(Run.java:1735)
at hudson.maven.MavenModuleSetBuild.run(MavenModuleSetBuild.java:542)
at hudson.model.ResourceController.execute(ResourceController.java:97)
at hudson.model.Executor.run(Executor.java:405)
Archiving artifacts
---------------------------------------------------------------------
To unsubscribe, e-mail: dev-unsubscribe@pdfbox.apache.org
For additional commands, e-mail: dev-help@pdfbox.apache.org