You are viewing a plain text version of this content. The canonical link for it is here.
Posted to yarn-dev@hadoop.apache.org by Apache Jenkins Server <je...@builds.apache.org> on 2016/05/25 02:36:07 UTC

Build failed in Jenkins: Hadoop-Yarn-trunk-Java8 #1491

See <https://builds.apache.org/job/Hadoop-Yarn-trunk-Java8/1491/changes>

Changes:

[wang] HADOOP-13198. Add support for OWASP's dependency-check. Contributed by

------------------------------------------
[...truncated 51468 lines...]
[WARNING] ^
[WARNING] <https://builds.apache.org/job/Hadoop-Yarn-trunk-Java8/ws/source/hadoop-yarn-project/hadoop-yarn/hadoop-yarn-registry/src/main/java/org/apache/hadoop/registry/client/api/RegistryOperations.java>:128: warning: no description for @throws
[WARNING] * @throws PathNotFoundException
[WARNING] ^
[WARNING] <https://builds.apache.org/job/Hadoop-Yarn-trunk-Java8/ws/source/hadoop-yarn-project/hadoop-yarn/hadoop-yarn-registry/src/main/java/org/apache/hadoop/registry/client/api/RegistryOperations.java>:129: warning: no description for @throws
[WARNING] * @throws InvalidPathnameException
[WARNING] ^
[WARNING] <https://builds.apache.org/job/Hadoop-Yarn-trunk-Java8/ws/source/hadoop-yarn-project/hadoop-yarn/hadoop-yarn-registry/src/main/java/org/apache/hadoop/registry/client/api/RegistryOperations.java>:130: warning: no description for @throws
[WARNING] * @throws IOException
[WARNING] ^
[WARNING] <https://builds.apache.org/job/Hadoop-Yarn-trunk-Java8/ws/source/hadoop-yarn-project/hadoop-yarn/hadoop-yarn-registry/src/main/java/org/apache/hadoop/registry/client/impl/zk/CuratorService.java>:136: warning: no description for @throws
[WARNING] * @throws Exception
[WARNING] ^
[WARNING] <https://builds.apache.org/job/Hadoop-Yarn-trunk-Java8/ws/source/hadoop-yarn-project/hadoop-yarn/hadoop-yarn-registry/src/main/java/org/apache/hadoop/registry/client/impl/zk/CuratorService.java>:158: warning: no description for @throws
[WARNING] * @throws Exception
[WARNING] ^
[WARNING] <https://builds.apache.org/job/Hadoop-Yarn-trunk-Java8/ws/source/hadoop-yarn-project/hadoop-yarn/hadoop-yarn-registry/src/main/java/org/apache/hadoop/registry/client/impl/zk/CuratorService.java>:295: warning: no @throws for java.io.IOException
[WARNING] protected String createFullPath(String path) throws IOException {
[WARNING] ^
[WARNING] <https://builds.apache.org/job/Hadoop-Yarn-trunk-Java8/ws/source/hadoop-yarn-project/hadoop-yarn/hadoop-yarn-registry/src/main/java/org/apache/hadoop/registry/client/impl/zk/CuratorService.java>:370: warning: no @param for acls
[WARNING] protected IOException operationFailure(String path,
[WARNING] ^
[WARNING] <https://builds.apache.org/job/Hadoop-Yarn-trunk-Java8/ws/source/hadoop-yarn-project/hadoop-yarn/hadoop-yarn-registry/src/main/java/org/apache/hadoop/registry/client/impl/zk/CuratorService.java>:424: warning: no description for @throws
[WARNING] * @throws IOException
[WARNING] ^
[WARNING] <https://builds.apache.org/job/Hadoop-Yarn-trunk-Java8/ws/source/hadoop-yarn-project/hadoop-yarn/hadoop-yarn-registry/src/main/java/org/apache/hadoop/registry/client/impl/zk/CuratorService.java>:427: warning: no @param for mode
[WARNING] public boolean maybeCreate(String path,
[WARNING] ^
[WARNING] <https://builds.apache.org/job/Hadoop-Yarn-trunk-Java8/ws/source/hadoop-yarn-project/hadoop-yarn/hadoop-yarn-registry/src/main/java/org/apache/hadoop/registry/client/impl/zk/CuratorService.java>:463: warning: no description for @throws
[WARNING] * @throws IOException
[WARNING] ^
[WARNING] <https://builds.apache.org/job/Hadoop-Yarn-trunk-Java8/ws/source/hadoop-yarn-project/hadoop-yarn/hadoop-yarn-registry/src/main/java/org/apache/hadoop/registry/client/impl/zk/CuratorService.java>:509: warning: no description for @throws
[WARNING] * @throws IOException
[WARNING] ^
[WARNING] <https://builds.apache.org/job/Hadoop-Yarn-trunk-Java8/ws/source/hadoop-yarn-project/hadoop-yarn/hadoop-yarn-registry/src/main/java/org/apache/hadoop/registry/client/impl/zk/CuratorService.java>:511: warning: no @return
[WARNING] public String zkPathMustExist(String path) throws IOException {
[WARNING] ^
[WARNING] <https://builds.apache.org/job/Hadoop-Yarn-trunk-Java8/ws/source/hadoop-yarn-project/hadoop-yarn/hadoop-yarn-registry/src/main/java/org/apache/hadoop/registry/client/impl/zk/CuratorService.java>:524: warning: no @return
[WARNING] public boolean zkMkPath(String path,
[WARNING] ^
[WARNING] <https://builds.apache.org/job/Hadoop-Yarn-trunk-Java8/ws/source/hadoop-yarn-project/hadoop-yarn/hadoop-yarn-registry/src/main/java/org/apache/hadoop/registry/client/impl/zk/CuratorService.java>:580: warning: no description for @param
[WARNING] * @param acls
[WARNING] ^
[WARNING] <https://builds.apache.org/job/Hadoop-Yarn-trunk-Java8/ws/source/hadoop-yarn-project/hadoop-yarn/hadoop-yarn-registry/src/main/java/org/apache/hadoop/registry/client/impl/zk/CuratorService.java>:581: warning: no description for @throws
[WARNING] * @throws IOException
[WARNING] ^
[WARNING] <https://builds.apache.org/job/Hadoop-Yarn-trunk-Java8/ws/source/hadoop-yarn-project/hadoop-yarn/hadoop-yarn-registry/src/main/java/org/apache/hadoop/registry/client/impl/zk/CuratorService.java>:583: warning: no @param for mode
[WARNING] public void zkCreate(String path,
[WARNING] ^
[WARNING] <https://builds.apache.org/job/Hadoop-Yarn-trunk-Java8/ws/source/hadoop-yarn-project/hadoop-yarn/hadoop-yarn-registry/src/main/java/org/apache/hadoop/registry/client/impl/zk/CuratorService.java>:606: warning: no description for @throws
[WARNING] * @throws IOException
[WARNING] ^
[WARNING] <https://builds.apache.org/job/Hadoop-Yarn-trunk-Java8/ws/source/hadoop-yarn-project/hadoop-yarn/hadoop-yarn-registry/src/main/java/org/apache/hadoop/registry/client/impl/zk/CuratorService.java>:628: warning: no description for @throws
[WARNING] * @throws IOException
[WARNING] ^
[WARNING] <https://builds.apache.org/job/Hadoop-Yarn-trunk-Java8/ws/source/hadoop-yarn-project/hadoop-yarn/hadoop-yarn-registry/src/main/java/org/apache/hadoop/registry/client/impl/zk/CuratorService.java>:631: warning: no @param for mode
[WARNING] public boolean zkSet(String path,
[WARNING] ^
[WARNING] <https://builds.apache.org/job/Hadoop-Yarn-trunk-Java8/ws/source/hadoop-yarn-project/hadoop-yarn/hadoop-yarn-registry/src/main/java/org/apache/hadoop/registry/client/impl/zk/CuratorService.java>:688: warning: no description for @throws
[WARNING] * @throws IOException
[WARNING] ^
[WARNING] <https://builds.apache.org/job/Hadoop-Yarn-trunk-Java8/ws/source/hadoop-yarn-project/hadoop-yarn/hadoop-yarn-registry/src/main/java/org/apache/hadoop/registry/client/impl/zk/CuratorService.java>:741: warning: no @return
[WARNING] public boolean addWriteAccessor(String id, String pass) throws IOException {
[WARNING] ^
[WARNING] <https://builds.apache.org/job/Hadoop-Yarn-trunk-Java8/ws/source/hadoop-yarn-project/hadoop-yarn/hadoop-yarn-registry/src/main/java/org/apache/hadoop/registry/server/services/MicroZookeeperService.java>:130: warning: no description for @throws
[WARNING] * @throws Exception
[WARNING] ^
[WARNING] <https://builds.apache.org/job/Hadoop-Yarn-trunk-Java8/ws/source/hadoop-yarn-project/hadoop-yarn/hadoop-yarn-registry/src/main/java/org/apache/hadoop/registry/server/services/MicroZookeeperService.java>:196: warning: no @throws for java.io.IOException
[WARNING] public boolean setupSecurity() throws IOException {
[WARNING] ^
[WARNING] <https://builds.apache.org/job/Hadoop-Yarn-trunk-Java8/ws/source/hadoop-yarn-project/hadoop-yarn/hadoop-yarn-registry/src/main/java/org/apache/hadoop/registry/server/services/MicroZookeeperService.java>:223: warning: no description for @throws
[WARNING] * @throws Exception
[WARNING] ^
[WARNING] <https://builds.apache.org/job/Hadoop-Yarn-trunk-Java8/ws/source/hadoop-yarn-project/hadoop-yarn/hadoop-yarn-registry/src/main/java/org/apache/hadoop/registry/server/services/MicroZookeeperService.java>:263: warning: no description for @throws
[WARNING] * @throws Exception
[WARNING] ^
[WARNING] <https://builds.apache.org/job/Hadoop-Yarn-trunk-Java8/ws/source/hadoop-yarn-project/hadoop-yarn/hadoop-yarn-registry/src/main/java/org/apache/hadoop/registry/client/types/Endpoint.java>:229: warning: no description for @throws
[WARNING] * @throws CloneNotSupportedException
[WARNING] ^
[WARNING] <https://builds.apache.org/job/Hadoop-Yarn-trunk-Java8/ws/source/hadoop-yarn-project/hadoop-yarn/hadoop-yarn-registry/src/main/java/org/apache/hadoop/registry/client/types/ServiceRecord.java>:241: warning: no description for @throws
[WARNING] * @throws CloneNotSupportedException
[WARNING] ^
[WARNING] <https://builds.apache.org/job/Hadoop-Yarn-trunk-Java8/ws/source/hadoop-yarn-project/hadoop-yarn/hadoop-yarn-registry/src/main/java/org/apache/hadoop/registry/client/binding/JsonSerDeser.java>:101: warning: no @throws for org.codehaus.jackson.JsonParseException
[WARNING] public synchronized T fromJson(String json)
[WARNING] ^
[WARNING] <https://builds.apache.org/job/Hadoop-Yarn-trunk-Java8/ws/source/hadoop-yarn-project/hadoop-yarn/hadoop-yarn-registry/src/main/java/org/apache/hadoop/registry/client/binding/JsonSerDeser.java>:119: warning: no @throws for org.codehaus.jackson.JsonParseException
[WARNING] public synchronized T fromFile(File jsonFile)
[WARNING] ^
[WARNING] <https://builds.apache.org/job/Hadoop-Yarn-trunk-Java8/ws/source/hadoop-yarn-project/hadoop-yarn/hadoop-yarn-registry/src/main/java/org/apache/hadoop/registry/client/binding/JsonSerDeser.java>:137: warning: no @throws for org.codehaus.jackson.JsonParseException
[WARNING] public synchronized T fromResource(String resource)
[WARNING] ^
[WARNING] <https://builds.apache.org/job/Hadoop-Yarn-trunk-Java8/ws/source/hadoop-yarn-project/hadoop-yarn/hadoop-yarn-registry/src/main/java/org/apache/hadoop/registry/client/binding/JsonSerDeser.java>:195: warning: no @param for instance
[WARNING] public void save(FileSystem fs, Path path, T instance,
[WARNING] ^
[WARNING] <https://builds.apache.org/job/Hadoop-Yarn-trunk-Java8/ws/source/hadoop-yarn-project/hadoop-yarn/hadoop-yarn-registry/src/main/java/org/apache/hadoop/registry/client/binding/JsonSerDeser.java>:221: warning: no description for @throws
[WARNING] * @throws IOException
[WARNING] ^
[WARNING] <https://builds.apache.org/job/Hadoop-Yarn-trunk-Java8/ws/source/hadoop-yarn-project/hadoop-yarn/hadoop-yarn-registry/src/main/java/org/apache/hadoop/registry/client/binding/JsonSerDeser.java>:236: warning: no @return
[WARNING] public T fromBytes(String path, byte[] bytes) throws IOException,
[WARNING] ^
[WARNING] <https://builds.apache.org/job/Hadoop-Yarn-trunk-Java8/ws/source/hadoop-yarn-project/hadoop-yarn/hadoop-yarn-registry/src/main/java/org/apache/hadoop/registry/client/binding/JsonSerDeser.java>:287: warning: no @throws for org.codehaus.jackson.JsonGenerationException
[WARNING] public synchronized String toJson(T instance) throws IOException,
[WARNING] ^
[WARNING] <https://builds.apache.org/job/Hadoop-Yarn-trunk-Java8/ws/source/hadoop-yarn-project/hadoop-yarn/hadoop-yarn-registry/src/main/java/org/apache/hadoop/registry/client/binding/RegistryPathUtils.java>:91: warning: no @param for base
[WARNING] public static String createFullPath(String base, String path) throws
[WARNING] ^
[WARNING] <https://builds.apache.org/job/Hadoop-Yarn-trunk-Java8/ws/source/hadoop-yarn-project/hadoop-yarn/hadoop-yarn-registry/src/main/java/org/apache/hadoop/registry/client/binding/RegistryUtils.java>:170: warning: no description for @throws
[WARNING] * @throws IOException
[WARNING] ^
[WARNING] <https://builds.apache.org/job/Hadoop-Yarn-trunk-Java8/ws/source/hadoop-yarn-project/hadoop-yarn/hadoop-yarn-registry/src/main/java/org/apache/hadoop/registry/client/binding/RegistryUtils.java>:198: warning: no @param for registryOperations
[WARNING] public static Map<String, RegistryPathStatus> statChildren(
[WARNING] ^
[WARNING] <https://builds.apache.org/job/Hadoop-Yarn-trunk-Java8/ws/source/hadoop-yarn-project/hadoop-yarn/hadoop-yarn-registry/src/main/java/org/apache/hadoop/registry/client/binding/RegistryUtils.java>:350: warning: no @param for stats
[WARNING] public static Map<String, ServiceRecord> extractServiceRecords(
[WARNING] ^
[WARNING] <https://builds.apache.org/job/Hadoop-Yarn-trunk-Java8/ws/source/hadoop-yarn-project/hadoop-yarn/hadoop-yarn-registry/src/main/java/org/apache/hadoop/registry/client/impl/zk/RegistrySecurity.java>:187: warning: no description for @throws
[WARNING] * @throws Exception
[WARNING] ^
[WARNING] <https://builds.apache.org/job/Hadoop-Yarn-trunk-Java8/ws/source/hadoop-yarn-project/hadoop-yarn/hadoop-yarn-registry/src/main/java/org/apache/hadoop/registry/client/impl/zk/RegistrySecurity.java>:320: warning: no @return
[WARNING] public boolean addDigestACL(ACL acl) {
[WARNING] ^
[WARNING] <https://builds.apache.org/job/Hadoop-Yarn-trunk-Java8/ws/source/hadoop-yarn-project/hadoop-yarn/hadoop-yarn-registry/src/main/java/org/apache/hadoop/registry/client/impl/zk/RegistrySecurity.java>:378: warning: no description for @throws
[WARNING] * @throws IOException
[WARNING] ^
[WARNING] <https://builds.apache.org/job/Hadoop-Yarn-trunk-Java8/ws/source/hadoop-yarn-project/hadoop-yarn/hadoop-yarn-registry/src/main/java/org/apache/hadoop/registry/client/impl/zk/RegistrySecurity.java>:444: warning: no @throws for java.io.IOException
[WARNING] public String digest(String idPasswordPair) throws IOException {
[WARNING] ^
[WARNING] <https://builds.apache.org/job/Hadoop-Yarn-trunk-Java8/ws/source/hadoop-yarn-project/hadoop-yarn/hadoop-yarn-registry/src/main/java/org/apache/hadoop/registry/client/impl/zk/RegistrySecurity.java>:462: warning: no description for @throws
[WARNING] * @throws IOException
[WARNING] ^
[WARNING] <https://builds.apache.org/job/Hadoop-Yarn-trunk-Java8/ws/source/hadoop-yarn-project/hadoop-yarn/hadoop-yarn-registry/src/main/java/org/apache/hadoop/registry/client/impl/zk/RegistrySecurity.java>:482: warning: no description for @throws
[WARNING] * @throws IOException
[WARNING] ^
[WARNING] <https://builds.apache.org/job/Hadoop-Yarn-trunk-Java8/ws/source/hadoop-yarn-project/hadoop-yarn/hadoop-yarn-registry/src/main/java/org/apache/hadoop/registry/client/impl/zk/RegistrySecurity.java>:550: warning: no description for @throws
[WARNING] * @throws IOException
[WARNING] ^
[WARNING] <https://builds.apache.org/job/Hadoop-Yarn-trunk-Java8/ws/source/hadoop-yarn-project/hadoop-yarn/hadoop-yarn-registry/src/main/java/org/apache/hadoop/registry/client/impl/zk/RegistrySecurity.java>:923: warning: no @param for perms
[WARNING] public ACL createACLForUser(UserGroupInformation ugi, int perms) {
[WARNING] ^
[WARNING] <https://builds.apache.org/job/Hadoop-Yarn-trunk-Java8/ws/source/hadoop-yarn-project/hadoop-yarn/hadoop-yarn-registry/src/main/java/org/apache/hadoop/registry/cli/RegistryCli.java>:124: warning: no description for @throws
[WARNING] * @throws IOException
[WARNING] ^
[INFO] Building jar: <https://builds.apache.org/job/Hadoop-Yarn-trunk-Java8/ws/source/hadoop-yarn-project/hadoop-yarn/hadoop-yarn-registry/target/hadoop-yarn-registry-3.0.0-alpha1-SNAPSHOT-javadoc.jar>
[INFO] 
[INFO] --- maven-enforcer-plugin:1.3.1:enforce (depcheck) @ hadoop-yarn-registry ---
[INFO] 
[INFO] --- maven-checkstyle-plugin:2.15:checkstyle (default-cli) @ hadoop-yarn-registry ---
[INFO] There are 509 errors reported by Checkstyle 6.6 with checkstyle/checkstyle.xml ruleset.
[WARNING] Unable to locate Source XRef to link to - DISABLED
[INFO] 
[INFO] --- findbugs-maven-plugin:3.0.0:findbugs (default-cli) @ hadoop-yarn-registry ---
[INFO] Fork Value is true
ERROR: Could not install LATEST1_8_HOME
java.lang.NullPointerException
	at hudson.plugins.toolenv.ToolEnvBuildWrapper$1.buildEnvVars(ToolEnvBuildWrapper.java:46)
	at hudson.model.AbstractBuild.getEnvironment(AbstractBuild.java:947)
	at hudson.plugins.git.GitSCM.getParamExpandedRepos(GitSCM.java:390)
	at hudson.plugins.git.GitSCM.compareRemoteRevisionWithImpl(GitSCM.java:577)
	at hudson.plugins.git.GitSCM.compareRemoteRevisionWith(GitSCM.java:527)
	at hudson.scm.SCM.compareRemoteRevisionWith(SCM.java:381)
	at hudson.scm.SCM.poll(SCM.java:398)
	at hudson.model.AbstractProject._poll(AbstractProject.java:1453)
	at hudson.model.AbstractProject.poll(AbstractProject.java:1356)
	at hudson.triggers.SCMTrigger$Runner.runPolling(SCMTrigger.java:526)
	at hudson.triggers.SCMTrigger$Runner.run(SCMTrigger.java:555)
	at hudson.util.SequentialExecutionQueue$QueueEntry.run(SequentialExecutionQueue.java:119)
	at java.util.concurrent.Executors$RunnableAdapter.call(Executors.java:471)
	at java.util.concurrent.FutureTask.run(FutureTask.java:262)
	at java.util.concurrent.ThreadPoolExecutor.runWorker(ThreadPoolExecutor.java:1145)
	at java.util.concurrent.ThreadPoolExecutor$Worker.run(ThreadPoolExecutor.java:615)
	at java.lang.Thread.run(Thread.java:745)
ERROR: Could not install MAVEN_3_3_3_HOME
java.lang.NullPointerException
	at hudson.plugins.toolenv.ToolEnvBuildWrapper$1.buildEnvVars(ToolEnvBuildWrapper.java:46)
	at hudson.model.AbstractBuild.getEnvironment(AbstractBuild.java:947)
	at hudson.plugins.git.GitSCM.getParamExpandedRepos(GitSCM.java:390)
	at hudson.plugins.git.GitSCM.compareRemoteRevisionWithImpl(GitSCM.java:577)
	at hudson.plugins.git.GitSCM.compareRemoteRevisionWith(GitSCM.java:527)
	at hudson.scm.SCM.compareRemoteRevisionWith(SCM.java:381)
	at hudson.scm.SCM.poll(SCM.java:398)
	at hudson.model.AbstractProject._poll(AbstractProject.java:1453)
	at hudson.model.AbstractProject.poll(AbstractProject.java:1356)
	at hudson.triggers.SCMTrigger$Runner.runPolling(SCMTrigger.java:526)
	at hudson.triggers.SCMTrigger$Runner.run(SCMTrigger.java:555)
	at hudson.util.SequentialExecutionQueue$QueueEntry.run(SequentialExecutionQueue.java:119)
	at java.util.concurrent.Executors$RunnableAdapter.call(Executors.java:471)
	at java.util.concurrent.FutureTask.run(FutureTask.java:262)
	at java.util.concurrent.ThreadPoolExecutor.runWorker(ThreadPoolExecutor.java:1145)
	at java.util.concurrent.ThreadPoolExecutor$Worker.run(ThreadPoolExecutor.java:615)
	at java.lang.Thread.run(Thread.java:745)
[INFO] Done FindBugs Analysis....
[INFO]                                                                         
[INFO] ------------------------------------------------------------------------
[INFO] Skipping Apache Hadoop YARN Project
[INFO] This project has been banned from the build due to previous failures.
[INFO] ------------------------------------------------------------------------
[INFO] ------------------------------------------------------------------------
[INFO] Reactor Summary:
[INFO] 
[INFO] Apache Hadoop YARN ................................. SUCCESS [  2.638 s]
[INFO] Apache Hadoop YARN API ............................. SUCCESS [01:50 min]
[INFO] Apache Hadoop YARN Common .......................... SUCCESS [02:57 min]
[INFO] Apache Hadoop YARN Server .......................... SUCCESS [  0.051 s]
[INFO] Apache Hadoop YARN Server Common ................... SUCCESS [ 39.049 s]
[INFO] Apache Hadoop YARN NodeManager ..................... SUCCESS [12:01 min]
[INFO] Apache Hadoop YARN Web Proxy ....................... SUCCESS [ 18.802 s]
[INFO] Apache Hadoop YARN ApplicationHistoryService ....... SUCCESS [03:43 min]
[INFO] Apache Hadoop YARN ResourceManager ................. FAILURE [34:25 min]
[INFO] Apache Hadoop YARN Server Tests .................... SKIPPED
[INFO] Apache Hadoop YARN Client .......................... SKIPPED
[INFO] Apache Hadoop YARN SharedCacheManager .............. SKIPPED
[INFO] Apache Hadoop YARN Timeline Plugin Storage ......... SKIPPED
[INFO] Apache Hadoop YARN Applications .................... SUCCESS [  0.043 s]
[INFO] Apache Hadoop YARN DistributedShell ................ SKIPPED
[INFO] Apache Hadoop YARN Unmanaged Am Launcher ........... SKIPPED
[INFO] Apache Hadoop YARN Site ............................ SUCCESS [  0.045 s]
[INFO] Apache Hadoop YARN Registry ........................ SUCCESS [01:58 min]
[INFO] Apache Hadoop YARN Project ......................... SKIPPED
[INFO] ------------------------------------------------------------------------
[INFO] BUILD FAILURE
[INFO] ------------------------------------------------------------------------
[INFO] Total time: 58:01 min
[INFO] Finished at: 2016-05-25T02:35:34+00:00
[INFO] Final Memory: 113M/3815M
[INFO] ------------------------------------------------------------------------
[WARNING] The requested profile "docs" could not be activated because it does not exist.
[WARNING] The requested profile "parallel-tests" could not be activated because it does not exist.
[ERROR] Failed to execute goal org.apache.maven.plugins:maven-surefire-plugin:2.17:test (default-test) on project hadoop-yarn-server-resourcemanager: There are test failures.
[ERROR] 
[ERROR] Please refer to <https://builds.apache.org/job/Hadoop-Yarn-trunk-Java8/ws/source/hadoop-yarn-project/hadoop-yarn/hadoop-yarn-server/hadoop-yarn-server-resourcemanager/target/surefire-reports> for the individual test results.
[ERROR] -> [Help 1]
[ERROR] 
[ERROR] To see the full stack trace of the errors, re-run Maven with the -e switch.
[ERROR] Re-run Maven using the -X switch to enable full debug logging.
[ERROR] 
[ERROR] For more information about the errors and possible solutions, please read the following articles:
[ERROR] [Help 1] http://cwiki.apache.org/confluence/display/MAVEN/MojoFailureException
[ERROR] 
[ERROR] After correcting the problems, you can resume the build with the command
[ERROR]   mvn <goals> -rf :hadoop-yarn-server-resourcemanager
Build step 'Execute shell' marked build as failure
Archiving artifacts
Setting LATEST1_8_HOME=/home/jenkins/jenkins-slave/tools/hudson.model.JDK/latest1.8
Setting MAVEN_3_3_3_HOME=/home/jenkins/jenkins-slave/tools/hudson.tasks.Maven_MavenInstallation/maven-3.3.3
Recording test results
Setting LATEST1_8_HOME=/home/jenkins/jenkins-slave/tools/hudson.model.JDK/latest1.8
Setting MAVEN_3_3_3_HOME=/home/jenkins/jenkins-slave/tools/hudson.tasks.Maven_MavenInstallation/maven-3.3.3
Setting LATEST1_8_HOME=/home/jenkins/jenkins-slave/tools/hudson.model.JDK/latest1.8
Setting MAVEN_3_3_3_HOME=/home/jenkins/jenkins-slave/tools/hudson.tasks.Maven_MavenInstallation/maven-3.3.3

---------------------------------------------------------------------
To unsubscribe, e-mail: yarn-dev-unsubscribe@hadoop.apache.org
For additional commands, e-mail: yarn-dev-help@hadoop.apache.org


Hadoop-Yarn-trunk-Java8 - Build # 1494 - Still Failing

Posted by Apache Jenkins Server <je...@builds.apache.org>.
See https://builds.apache.org/job/Hadoop-Yarn-trunk-Java8/1494/

###################################################################################
########################## LAST 60 LINES OF THE CONSOLE ###########################
[...truncated 51627 lines...]
[INFO] Reactor Summary:
[INFO] 
[INFO] Apache Hadoop YARN ................................. SUCCESS [  2.764 s]
[INFO] Apache Hadoop YARN API ............................. SUCCESS [01:47 min]
[INFO] Apache Hadoop YARN Common .......................... SUCCESS [02:59 min]
[INFO] Apache Hadoop YARN Server .......................... SUCCESS [  0.066 s]
[INFO] Apache Hadoop YARN Server Common ................... SUCCESS [ 38.637 s]
[INFO] Apache Hadoop YARN NodeManager ..................... SUCCESS [11:58 min]
[INFO] Apache Hadoop YARN Web Proxy ....................... SUCCESS [ 19.413 s]
[INFO] Apache Hadoop YARN ApplicationHistoryService ....... SUCCESS [04:12 min]
[INFO] Apache Hadoop YARN ResourceManager ................. FAILURE [34:50 min]
[INFO] Apache Hadoop YARN Server Tests .................... SKIPPED
[INFO] Apache Hadoop YARN Client .......................... SKIPPED
[INFO] Apache Hadoop YARN SharedCacheManager .............. SKIPPED
[INFO] Apache Hadoop YARN Timeline Plugin Storage ......... SKIPPED
[INFO] Apache Hadoop YARN Applications .................... SUCCESS [  0.035 s]
[INFO] Apache Hadoop YARN DistributedShell ................ SKIPPED
[INFO] Apache Hadoop YARN Unmanaged Am Launcher ........... SKIPPED
[INFO] Apache Hadoop YARN Site ............................ SUCCESS [  0.038 s]
[INFO] Apache Hadoop YARN Registry ........................ SUCCESS [01:46 min]
[INFO] Apache Hadoop YARN Project ......................... SKIPPED
[INFO] ------------------------------------------------------------------------
[INFO] BUILD FAILURE
[INFO] ------------------------------------------------------------------------
[INFO] Total time: 58:36 min
[INFO] Finished at: 2016-05-25T08:36:27+00:00
[INFO] Final Memory: 127M/4429M
[INFO] ------------------------------------------------------------------------
[WARNING] The requested profile "docs" could not be activated because it does not exist.
[WARNING] The requested profile "parallel-tests" could not be activated because it does not exist.
[ERROR] Failed to execute goal org.apache.maven.plugins:maven-surefire-plugin:2.17:test (default-test) on project hadoop-yarn-server-resourcemanager: There are test failures.
[ERROR] 
[ERROR] Please refer to /home/jenkins/jenkins-slave/workspace/Hadoop-Yarn-trunk-Java8/source/hadoop-yarn-project/hadoop-yarn/hadoop-yarn-server/hadoop-yarn-server-resourcemanager/target/surefire-reports for the individual test results.
[ERROR] -> [Help 1]
[ERROR] 
[ERROR] To see the full stack trace of the errors, re-run Maven with the -e switch.
[ERROR] Re-run Maven using the -X switch to enable full debug logging.
[ERROR] 
[ERROR] For more information about the errors and possible solutions, please read the following articles:
[ERROR] [Help 1] http://cwiki.apache.org/confluence/display/MAVEN/MojoFailureException
[ERROR] 
[ERROR] After correcting the problems, you can resume the build with the command
[ERROR]   mvn <goals> -rf :hadoop-yarn-server-resourcemanager
Build step 'Execute shell' marked build as failure
Archiving artifacts
Setting LATEST1_8_HOME=/home/jenkins/jenkins-slave/tools/hudson.model.JDK/latest1.8
Setting MAVEN_3_3_3_HOME=/home/jenkins/jenkins-slave/tools/hudson.tasks.Maven_MavenInstallation/maven-3.3.3
Recording test results
Setting LATEST1_8_HOME=/home/jenkins/jenkins-slave/tools/hudson.model.JDK/latest1.8
Setting MAVEN_3_3_3_HOME=/home/jenkins/jenkins-slave/tools/hudson.tasks.Maven_MavenInstallation/maven-3.3.3
Setting LATEST1_8_HOME=/home/jenkins/jenkins-slave/tools/hudson.model.JDK/latest1.8
Setting MAVEN_3_3_3_HOME=/home/jenkins/jenkins-slave/tools/hudson.tasks.Maven_MavenInstallation/maven-3.3.3
Sending e-mails to: yarn-dev@hadoop.apache.org
Email was triggered for: Failure - Any
Sending email for trigger: Failure - Any
Setting LATEST1_8_HOME=/home/jenkins/jenkins-slave/tools/hudson.model.JDK/latest1.8
Setting MAVEN_3_3_3_HOME=/home/jenkins/jenkins-slave/tools/hudson.tasks.Maven_MavenInstallation/maven-3.3.3
Setting LATEST1_8_HOME=/home/jenkins/jenkins-slave/tools/hudson.model.JDK/latest1.8
Setting MAVEN_3_3_3_HOME=/home/jenkins/jenkins-slave/tools/hudson.tasks.Maven_MavenInstallation/maven-3.3.3



###################################################################################
############################## FAILED TESTS (if any) ##############################
1 tests failed.
FAILED:  org.apache.hadoop.yarn.server.resourcemanager.TestRMRestart.testQueueMetricsOnRMRestart

Error Message:
expected:<2> but was:<1>

Stack Trace:
java.lang.AssertionError: expected:<2> but was:<1>
	at org.junit.Assert.fail(Assert.java:88)
	at org.junit.Assert.failNotEquals(Assert.java:743)
	at org.junit.Assert.assertEquals(Assert.java:118)
	at org.junit.Assert.assertEquals(Assert.java:555)
	at org.junit.Assert.assertEquals(Assert.java:542)
	at org.apache.hadoop.yarn.server.resourcemanager.TestRMRestart.assertQueueMetrics(TestRMRestart.java:1874)
	at org.apache.hadoop.yarn.server.resourcemanager.TestRMRestart.testQueueMetricsOnRMRestart(TestRMRestart.java:1849)




Jenkins build is back to normal : Hadoop-Yarn-trunk-Java8 #1496

Posted by Apache Jenkins Server <je...@builds.apache.org>.
See <https://builds.apache.org/job/Hadoop-Yarn-trunk-Java8/1496/changes>


---------------------------------------------------------------------
To unsubscribe, e-mail: yarn-dev-unsubscribe@hadoop.apache.org
For additional commands, e-mail: yarn-dev-help@hadoop.apache.org


Build failed in Jenkins: Hadoop-Yarn-trunk-Java8 #1495

Posted by Apache Jenkins Server <je...@builds.apache.org>.
See <https://builds.apache.org/job/Hadoop-Yarn-trunk-Java8/1495/changes>

Changes:

[stevel] HADOOP-13160. Suppress checkstyle JavadocPackage check for test source.

------------------------------------------
[...truncated 51388 lines...]
Generating <https://builds.apache.org/job/Hadoop-Yarn-trunk-Java8/ws/source/hadoop-yarn-project/hadoop-yarn/hadoop-yarn-registry/target/org/apache/hadoop/registry/client/impl/zk/class-use/RegistrySecurity.AclListInfo.html...>
Generating <https://builds.apache.org/job/Hadoop-Yarn-trunk-Java8/ws/source/hadoop-yarn-project/hadoop-yarn/hadoop-yarn-registry/target/org/apache/hadoop/registry/cli/package-use.html...>
Generating <https://builds.apache.org/job/Hadoop-Yarn-trunk-Java8/ws/source/hadoop-yarn-project/hadoop-yarn/hadoop-yarn-registry/target/org/apache/hadoop/registry/client/api/package-use.html...>
Generating <https://builds.apache.org/job/Hadoop-Yarn-trunk-Java8/ws/source/hadoop-yarn-project/hadoop-yarn/hadoop-yarn-registry/target/org/apache/hadoop/registry/client/binding/package-use.html...>
Generating <https://builds.apache.org/job/Hadoop-Yarn-trunk-Java8/ws/source/hadoop-yarn-project/hadoop-yarn/hadoop-yarn-registry/target/org/apache/hadoop/registry/client/exceptions/package-use.html...>
Generating <https://builds.apache.org/job/Hadoop-Yarn-trunk-Java8/ws/source/hadoop-yarn-project/hadoop-yarn/hadoop-yarn-registry/target/org/apache/hadoop/registry/client/impl/package-use.html...>
Generating <https://builds.apache.org/job/Hadoop-Yarn-trunk-Java8/ws/source/hadoop-yarn-project/hadoop-yarn/hadoop-yarn-registry/target/org/apache/hadoop/registry/client/impl/zk/package-use.html...>
Generating <https://builds.apache.org/job/Hadoop-Yarn-trunk-Java8/ws/source/hadoop-yarn-project/hadoop-yarn/hadoop-yarn-registry/target/org/apache/hadoop/registry/client/types/package-use.html...>
Generating <https://builds.apache.org/job/Hadoop-Yarn-trunk-Java8/ws/source/hadoop-yarn-project/hadoop-yarn/hadoop-yarn-registry/target/org/apache/hadoop/registry/client/types/yarn/package-use.html...>
Generating <https://builds.apache.org/job/Hadoop-Yarn-trunk-Java8/ws/source/hadoop-yarn-project/hadoop-yarn/hadoop-yarn-registry/target/org/apache/hadoop/registry/server/package-use.html...>
Generating <https://builds.apache.org/job/Hadoop-Yarn-trunk-Java8/ws/source/hadoop-yarn-project/hadoop-yarn/hadoop-yarn-registry/target/org/apache/hadoop/registry/server/integration/package-use.html...>
Generating <https://builds.apache.org/job/Hadoop-Yarn-trunk-Java8/ws/source/hadoop-yarn-project/hadoop-yarn/hadoop-yarn-registry/target/org/apache/hadoop/registry/server/services/package-use.html...>
Building index for all the packages and classes...
Generating <https://builds.apache.org/job/Hadoop-Yarn-trunk-Java8/ws/source/hadoop-yarn-project/hadoop-yarn/hadoop-yarn-registry/target/overview-tree.html...>
Generating <https://builds.apache.org/job/Hadoop-Yarn-trunk-Java8/ws/source/hadoop-yarn-project/hadoop-yarn/hadoop-yarn-registry/target/index-all.html...>
Generating <https://builds.apache.org/job/Hadoop-Yarn-trunk-Java8/ws/source/hadoop-yarn-project/hadoop-yarn/hadoop-yarn-registry/target/deprecated-list.html...>
Building index for all classes...
Generating <https://builds.apache.org/job/Hadoop-Yarn-trunk-Java8/ws/source/hadoop-yarn-project/hadoop-yarn/hadoop-yarn-registry/target/allclasses-frame.html...>
Generating <https://builds.apache.org/job/Hadoop-Yarn-trunk-Java8/ws/source/hadoop-yarn-project/hadoop-yarn/hadoop-yarn-registry/target/allclasses-noframe.html...>
Generating <https://builds.apache.org/job/Hadoop-Yarn-trunk-Java8/ws/source/hadoop-yarn-project/hadoop-yarn/hadoop-yarn-registry/target/index.html...>
Generating <https://builds.apache.org/job/Hadoop-Yarn-trunk-Java8/ws/source/hadoop-yarn-project/hadoop-yarn/hadoop-yarn-registry/target/overview-summary.html...>
Generating <https://builds.apache.org/job/Hadoop-Yarn-trunk-Java8/ws/source/hadoop-yarn-project/hadoop-yarn/hadoop-yarn-registry/target/help-doc.html...>
52 warnings
[WARNING] Javadoc Warnings
[WARNING] <https://builds.apache.org/job/Hadoop-Yarn-trunk-Java8/ws/source/hadoop-yarn-project/hadoop-yarn/hadoop-yarn-registry/src/main/java/org/apache/hadoop/registry/server/integration/RMRegistryOperationsService.java>:73: warning: no description for @throws
[WARNING] * @throws Exception
[WARNING] ^
[WARNING] <https://builds.apache.org/job/Hadoop-Yarn-trunk-Java8/ws/source/hadoop-yarn-project/hadoop-yarn/hadoop-yarn-registry/src/main/java/org/apache/hadoop/registry/server/services/RegistryAdminService.java>:174: warning: no description for @throws
[WARNING] * @throws IOException
[WARNING] ^
[WARNING] <https://builds.apache.org/job/Hadoop-Yarn-trunk-Java8/ws/source/hadoop-yarn-project/hadoop-yarn/hadoop-yarn-registry/src/main/java/org/apache/hadoop/registry/server/services/RegistryAdminService.java>:191: warning: no description for @throws
[WARNING] * @throws Exception
[WARNING] ^
[WARNING] <https://builds.apache.org/job/Hadoop-Yarn-trunk-Java8/ws/source/hadoop-yarn-project/hadoop-yarn/hadoop-yarn-registry/src/main/java/org/apache/hadoop/registry/server/services/RegistryAdminService.java>:208: warning: no description for @throws
[WARNING] * @throws Exception
[WARNING] ^
[WARNING] <https://builds.apache.org/job/Hadoop-Yarn-trunk-Java8/ws/source/hadoop-yarn-project/hadoop-yarn/hadoop-yarn-registry/src/main/java/org/apache/hadoop/registry/client/api/RegistryOperations.java>:118: warning: no description for @throws
[WARNING] * @throws IOException
[WARNING] ^
[WARNING] <https://builds.apache.org/job/Hadoop-Yarn-trunk-Java8/ws/source/hadoop-yarn-project/hadoop-yarn/hadoop-yarn-registry/src/main/java/org/apache/hadoop/registry/client/api/RegistryOperations.java>:128: warning: no description for @throws
[WARNING] * @throws PathNotFoundException
[WARNING] ^
[WARNING] <https://builds.apache.org/job/Hadoop-Yarn-trunk-Java8/ws/source/hadoop-yarn-project/hadoop-yarn/hadoop-yarn-registry/src/main/java/org/apache/hadoop/registry/client/api/RegistryOperations.java>:129: warning: no description for @throws
[WARNING] * @throws InvalidPathnameException
[WARNING] ^
[WARNING] <https://builds.apache.org/job/Hadoop-Yarn-trunk-Java8/ws/source/hadoop-yarn-project/hadoop-yarn/hadoop-yarn-registry/src/main/java/org/apache/hadoop/registry/client/api/RegistryOperations.java>:130: warning: no description for @throws
[WARNING] * @throws IOException
[WARNING] ^
[WARNING] <https://builds.apache.org/job/Hadoop-Yarn-trunk-Java8/ws/source/hadoop-yarn-project/hadoop-yarn/hadoop-yarn-registry/src/main/java/org/apache/hadoop/registry/client/impl/zk/CuratorService.java>:136: warning: no description for @throws
[WARNING] * @throws Exception
[WARNING] ^
[WARNING] <https://builds.apache.org/job/Hadoop-Yarn-trunk-Java8/ws/source/hadoop-yarn-project/hadoop-yarn/hadoop-yarn-registry/src/main/java/org/apache/hadoop/registry/client/impl/zk/CuratorService.java>:158: warning: no description for @throws
[WARNING] * @throws Exception
[WARNING] ^
[WARNING] <https://builds.apache.org/job/Hadoop-Yarn-trunk-Java8/ws/source/hadoop-yarn-project/hadoop-yarn/hadoop-yarn-registry/src/main/java/org/apache/hadoop/registry/client/impl/zk/CuratorService.java>:295: warning: no @throws for java.io.IOException
[WARNING] protected String createFullPath(String path) throws IOException {
[WARNING] ^
[WARNING] <https://builds.apache.org/job/Hadoop-Yarn-trunk-Java8/ws/source/hadoop-yarn-project/hadoop-yarn/hadoop-yarn-registry/src/main/java/org/apache/hadoop/registry/client/impl/zk/CuratorService.java>:370: warning: no @param for acls
[WARNING] protected IOException operationFailure(String path,
[WARNING] ^
[WARNING] <https://builds.apache.org/job/Hadoop-Yarn-trunk-Java8/ws/source/hadoop-yarn-project/hadoop-yarn/hadoop-yarn-registry/src/main/java/org/apache/hadoop/registry/client/impl/zk/CuratorService.java>:424: warning: no description for @throws
[WARNING] * @throws IOException
[WARNING] ^
[WARNING] <https://builds.apache.org/job/Hadoop-Yarn-trunk-Java8/ws/source/hadoop-yarn-project/hadoop-yarn/hadoop-yarn-registry/src/main/java/org/apache/hadoop/registry/client/impl/zk/CuratorService.java>:427: warning: no @param for mode
[WARNING] public boolean maybeCreate(String path,
[WARNING] ^
[WARNING] <https://builds.apache.org/job/Hadoop-Yarn-trunk-Java8/ws/source/hadoop-yarn-project/hadoop-yarn/hadoop-yarn-registry/src/main/java/org/apache/hadoop/registry/client/impl/zk/CuratorService.java>:463: warning: no description for @throws
[WARNING] * @throws IOException
[WARNING] ^
[WARNING] <https://builds.apache.org/job/Hadoop-Yarn-trunk-Java8/ws/source/hadoop-yarn-project/hadoop-yarn/hadoop-yarn-registry/src/main/java/org/apache/hadoop/registry/client/impl/zk/CuratorService.java>:509: warning: no description for @throws
[WARNING] * @throws IOException
[WARNING] ^
[WARNING] <https://builds.apache.org/job/Hadoop-Yarn-trunk-Java8/ws/source/hadoop-yarn-project/hadoop-yarn/hadoop-yarn-registry/src/main/java/org/apache/hadoop/registry/client/impl/zk/CuratorService.java>:511: warning: no @return
[WARNING] public String zkPathMustExist(String path) throws IOException {
[WARNING] ^
[WARNING] <https://builds.apache.org/job/Hadoop-Yarn-trunk-Java8/ws/source/hadoop-yarn-project/hadoop-yarn/hadoop-yarn-registry/src/main/java/org/apache/hadoop/registry/client/impl/zk/CuratorService.java>:524: warning: no @return
[WARNING] public boolean zkMkPath(String path,
[WARNING] ^
[WARNING] <https://builds.apache.org/job/Hadoop-Yarn-trunk-Java8/ws/source/hadoop-yarn-project/hadoop-yarn/hadoop-yarn-registry/src/main/java/org/apache/hadoop/registry/client/impl/zk/CuratorService.java>:580: warning: no description for @param
[WARNING] * @param acls
[WARNING] ^
[WARNING] <https://builds.apache.org/job/Hadoop-Yarn-trunk-Java8/ws/source/hadoop-yarn-project/hadoop-yarn/hadoop-yarn-registry/src/main/java/org/apache/hadoop/registry/client/impl/zk/CuratorService.java>:581: warning: no description for @throws
[WARNING] * @throws IOException
[WARNING] ^
[WARNING] <https://builds.apache.org/job/Hadoop-Yarn-trunk-Java8/ws/source/hadoop-yarn-project/hadoop-yarn/hadoop-yarn-registry/src/main/java/org/apache/hadoop/registry/client/impl/zk/CuratorService.java>:583: warning: no @param for mode
[WARNING] public void zkCreate(String path,
[WARNING] ^
[WARNING] <https://builds.apache.org/job/Hadoop-Yarn-trunk-Java8/ws/source/hadoop-yarn-project/hadoop-yarn/hadoop-yarn-registry/src/main/java/org/apache/hadoop/registry/client/impl/zk/CuratorService.java>:606: warning: no description for @throws
[WARNING] * @throws IOException
[WARNING] ^
[WARNING] <https://builds.apache.org/job/Hadoop-Yarn-trunk-Java8/ws/source/hadoop-yarn-project/hadoop-yarn/hadoop-yarn-registry/src/main/java/org/apache/hadoop/registry/client/impl/zk/CuratorService.java>:628: warning: no description for @throws
[WARNING] * @throws IOException
[WARNING] ^
[WARNING] <https://builds.apache.org/job/Hadoop-Yarn-trunk-Java8/ws/source/hadoop-yarn-project/hadoop-yarn/hadoop-yarn-registry/src/main/java/org/apache/hadoop/registry/client/impl/zk/CuratorService.java>:631: warning: no @param for mode
[WARNING] public boolean zkSet(String path,
[WARNING] ^
[WARNING] <https://builds.apache.org/job/Hadoop-Yarn-trunk-Java8/ws/source/hadoop-yarn-project/hadoop-yarn/hadoop-yarn-registry/src/main/java/org/apache/hadoop/registry/client/impl/zk/CuratorService.java>:688: warning: no description for @throws
[WARNING] * @throws IOException
[WARNING] ^
[WARNING] <https://builds.apache.org/job/Hadoop-Yarn-trunk-Java8/ws/source/hadoop-yarn-project/hadoop-yarn/hadoop-yarn-registry/src/main/java/org/apache/hadoop/registry/client/impl/zk/CuratorService.java>:741: warning: no @return
[WARNING] public boolean addWriteAccessor(String id, String pass) throws IOException {
[WARNING] ^
[WARNING] <https://builds.apache.org/job/Hadoop-Yarn-trunk-Java8/ws/source/hadoop-yarn-project/hadoop-yarn/hadoop-yarn-registry/src/main/java/org/apache/hadoop/registry/server/services/MicroZookeeperService.java>:130: warning: no description for @throws
[WARNING] * @throws Exception
[WARNING] ^
[WARNING] <https://builds.apache.org/job/Hadoop-Yarn-trunk-Java8/ws/source/hadoop-yarn-project/hadoop-yarn/hadoop-yarn-registry/src/main/java/org/apache/hadoop/registry/server/services/MicroZookeeperService.java>:196: warning: no @throws for java.io.IOException
[WARNING] public boolean setupSecurity() throws IOException {
[WARNING] ^
[WARNING] <https://builds.apache.org/job/Hadoop-Yarn-trunk-Java8/ws/source/hadoop-yarn-project/hadoop-yarn/hadoop-yarn-registry/src/main/java/org/apache/hadoop/registry/server/services/MicroZookeeperService.java>:223: warning: no description for @throws
[WARNING] * @throws Exception
[WARNING] ^
[WARNING] <https://builds.apache.org/job/Hadoop-Yarn-trunk-Java8/ws/source/hadoop-yarn-project/hadoop-yarn/hadoop-yarn-registry/src/main/java/org/apache/hadoop/registry/server/services/MicroZookeeperService.java>:263: warning: no description for @throws
[WARNING] * @throws Exception
[WARNING] ^
[WARNING] <https://builds.apache.org/job/Hadoop-Yarn-trunk-Java8/ws/source/hadoop-yarn-project/hadoop-yarn/hadoop-yarn-registry/src/main/java/org/apache/hadoop/registry/cli/RegistryCli.java>:124: warning: no description for @throws
[WARNING] * @throws IOException
[WARNING] ^
[WARNING] <https://builds.apache.org/job/Hadoop-Yarn-trunk-Java8/ws/source/hadoop-yarn-project/hadoop-yarn/hadoop-yarn-registry/src/main/java/org/apache/hadoop/registry/client/binding/JsonSerDeser.java>:101: warning: no @throws for org.codehaus.jackson.JsonParseException
[WARNING] public synchronized T fromJson(String json)
[WARNING] ^
[WARNING] <https://builds.apache.org/job/Hadoop-Yarn-trunk-Java8/ws/source/hadoop-yarn-project/hadoop-yarn/hadoop-yarn-registry/src/main/java/org/apache/hadoop/registry/client/binding/JsonSerDeser.java>:119: warning: no @throws for org.codehaus.jackson.JsonParseException
[WARNING] public synchronized T fromFile(File jsonFile)
[WARNING] ^
[WARNING] <https://builds.apache.org/job/Hadoop-Yarn-trunk-Java8/ws/source/hadoop-yarn-project/hadoop-yarn/hadoop-yarn-registry/src/main/java/org/apache/hadoop/registry/client/binding/JsonSerDeser.java>:137: warning: no @throws for org.codehaus.jackson.JsonParseException
[WARNING] public synchronized T fromResource(String resource)
[WARNING] ^
[WARNING] <https://builds.apache.org/job/Hadoop-Yarn-trunk-Java8/ws/source/hadoop-yarn-project/hadoop-yarn/hadoop-yarn-registry/src/main/java/org/apache/hadoop/registry/client/binding/JsonSerDeser.java>:195: warning: no @param for instance
[WARNING] public void save(FileSystem fs, Path path, T instance,
[WARNING] ^
[WARNING] <https://builds.apache.org/job/Hadoop-Yarn-trunk-Java8/ws/source/hadoop-yarn-project/hadoop-yarn/hadoop-yarn-registry/src/main/java/org/apache/hadoop/registry/client/binding/JsonSerDeser.java>:221: warning: no description for @throws
[WARNING] * @throws IOException
[WARNING] ^
[WARNING] <https://builds.apache.org/job/Hadoop-Yarn-trunk-Java8/ws/source/hadoop-yarn-project/hadoop-yarn/hadoop-yarn-registry/src/main/java/org/apache/hadoop/registry/client/binding/JsonSerDeser.java>:236: warning: no @return
[WARNING] public T fromBytes(String path, byte[] bytes) throws IOException,
[WARNING] ^
[WARNING] <https://builds.apache.org/job/Hadoop-Yarn-trunk-Java8/ws/source/hadoop-yarn-project/hadoop-yarn/hadoop-yarn-registry/src/main/java/org/apache/hadoop/registry/client/binding/JsonSerDeser.java>:287: warning: no @throws for org.codehaus.jackson.JsonGenerationException
[WARNING] public synchronized String toJson(T instance) throws IOException,
[WARNING] ^
[WARNING] <https://builds.apache.org/job/Hadoop-Yarn-trunk-Java8/ws/source/hadoop-yarn-project/hadoop-yarn/hadoop-yarn-registry/src/main/java/org/apache/hadoop/registry/client/binding/RegistryPathUtils.java>:91: warning: no @param for base
[WARNING] public static String createFullPath(String base, String path) throws
[WARNING] ^
[WARNING] <https://builds.apache.org/job/Hadoop-Yarn-trunk-Java8/ws/source/hadoop-yarn-project/hadoop-yarn/hadoop-yarn-registry/src/main/java/org/apache/hadoop/registry/client/binding/RegistryUtils.java>:170: warning: no description for @throws
[WARNING] * @throws IOException
[WARNING] ^
[WARNING] <https://builds.apache.org/job/Hadoop-Yarn-trunk-Java8/ws/source/hadoop-yarn-project/hadoop-yarn/hadoop-yarn-registry/src/main/java/org/apache/hadoop/registry/client/binding/RegistryUtils.java>:198: warning: no @param for registryOperations
[WARNING] public static Map<String, RegistryPathStatus> statChildren(
[WARNING] ^
[WARNING] <https://builds.apache.org/job/Hadoop-Yarn-trunk-Java8/ws/source/hadoop-yarn-project/hadoop-yarn/hadoop-yarn-registry/src/main/java/org/apache/hadoop/registry/client/binding/RegistryUtils.java>:350: warning: no @param for stats
[WARNING] public static Map<String, ServiceRecord> extractServiceRecords(
[WARNING] ^
[WARNING] <https://builds.apache.org/job/Hadoop-Yarn-trunk-Java8/ws/source/hadoop-yarn-project/hadoop-yarn/hadoop-yarn-registry/src/main/java/org/apache/hadoop/registry/client/types/Endpoint.java>:229: warning: no description for @throws
[WARNING] * @throws CloneNotSupportedException
[WARNING] ^
[WARNING] <https://builds.apache.org/job/Hadoop-Yarn-trunk-Java8/ws/source/hadoop-yarn-project/hadoop-yarn/hadoop-yarn-registry/src/main/java/org/apache/hadoop/registry/client/types/ServiceRecord.java>:241: warning: no description for @throws
[WARNING] * @throws CloneNotSupportedException
[WARNING] ^
[WARNING] <https://builds.apache.org/job/Hadoop-Yarn-trunk-Java8/ws/source/hadoop-yarn-project/hadoop-yarn/hadoop-yarn-registry/src/main/java/org/apache/hadoop/registry/client/impl/zk/RegistrySecurity.java>:187: warning: no description for @throws
[WARNING] * @throws Exception
[WARNING] ^
[WARNING] <https://builds.apache.org/job/Hadoop-Yarn-trunk-Java8/ws/source/hadoop-yarn-project/hadoop-yarn/hadoop-yarn-registry/src/main/java/org/apache/hadoop/registry/client/impl/zk/RegistrySecurity.java>:320: warning: no @return
[WARNING] public boolean addDigestACL(ACL acl) {
[WARNING] ^
[WARNING] <https://builds.apache.org/job/Hadoop-Yarn-trunk-Java8/ws/source/hadoop-yarn-project/hadoop-yarn/hadoop-yarn-registry/src/main/java/org/apache/hadoop/registry/client/impl/zk/RegistrySecurity.java>:378: warning: no description for @throws
[WARNING] * @throws IOException
[WARNING] ^
[WARNING] <https://builds.apache.org/job/Hadoop-Yarn-trunk-Java8/ws/source/hadoop-yarn-project/hadoop-yarn/hadoop-yarn-registry/src/main/java/org/apache/hadoop/registry/client/impl/zk/RegistrySecurity.java>:444: warning: no @throws for java.io.IOException
[WARNING] public String digest(String idPasswordPair) throws IOException {
[WARNING] ^
[WARNING] <https://builds.apache.org/job/Hadoop-Yarn-trunk-Java8/ws/source/hadoop-yarn-project/hadoop-yarn/hadoop-yarn-registry/src/main/java/org/apache/hadoop/registry/client/impl/zk/RegistrySecurity.java>:462: warning: no description for @throws
[WARNING] * @throws IOException
[WARNING] ^
[WARNING] <https://builds.apache.org/job/Hadoop-Yarn-trunk-Java8/ws/source/hadoop-yarn-project/hadoop-yarn/hadoop-yarn-registry/src/main/java/org/apache/hadoop/registry/client/impl/zk/RegistrySecurity.java>:482: warning: no description for @throws
[WARNING] * @throws IOException
[WARNING] ^
[WARNING] <https://builds.apache.org/job/Hadoop-Yarn-trunk-Java8/ws/source/hadoop-yarn-project/hadoop-yarn/hadoop-yarn-registry/src/main/java/org/apache/hadoop/registry/client/impl/zk/RegistrySecurity.java>:550: warning: no description for @throws
[WARNING] * @throws IOException
[WARNING] ^
[WARNING] <https://builds.apache.org/job/Hadoop-Yarn-trunk-Java8/ws/source/hadoop-yarn-project/hadoop-yarn/hadoop-yarn-registry/src/main/java/org/apache/hadoop/registry/client/impl/zk/RegistrySecurity.java>:923: warning: no @param for perms
[WARNING] public ACL createACLForUser(UserGroupInformation ugi, int perms) {
[WARNING] ^
[INFO] Building jar: <https://builds.apache.org/job/Hadoop-Yarn-trunk-Java8/ws/source/hadoop-yarn-project/hadoop-yarn/hadoop-yarn-registry/target/hadoop-yarn-registry-3.0.0-alpha1-SNAPSHOT-javadoc.jar>
[INFO] 
[INFO] --- maven-enforcer-plugin:1.3.1:enforce (depcheck) @ hadoop-yarn-registry ---
[INFO] 
[INFO] --- maven-checkstyle-plugin:2.15:checkstyle (default-cli) @ hadoop-yarn-registry ---
[INFO] There are 502 errors reported by Checkstyle 6.6 with checkstyle/checkstyle.xml ruleset.
[WARNING] Unable to locate Source XRef to link to - DISABLED
[INFO] 
[INFO] --- findbugs-maven-plugin:3.0.0:findbugs (default-cli) @ hadoop-yarn-registry ---
[INFO] Fork Value is true
[INFO] Done FindBugs Analysis....
[INFO]                                                                         
[INFO] ------------------------------------------------------------------------
[INFO] Skipping Apache Hadoop YARN Project
[INFO] This project has been banned from the build due to previous failures.
[INFO] ------------------------------------------------------------------------
[INFO] ------------------------------------------------------------------------
[INFO] Reactor Summary:
[INFO] 
[INFO] Apache Hadoop YARN ................................. SUCCESS [  2.886 s]
[INFO] Apache Hadoop YARN API ............................. SUCCESS [01:51 min]
[INFO] Apache Hadoop YARN Common .......................... SUCCESS [03:01 min]
[INFO] Apache Hadoop YARN Server .......................... SUCCESS [  0.074 s]
[INFO] Apache Hadoop YARN Server Common ................... SUCCESS [ 39.087 s]
[INFO] Apache Hadoop YARN NodeManager ..................... SUCCESS [11:47 min]
[INFO] Apache Hadoop YARN Web Proxy ....................... SUCCESS [ 18.720 s]
[INFO] Apache Hadoop YARN ApplicationHistoryService ....... SUCCESS [03:48 min]
[INFO] Apache Hadoop YARN ResourceManager ................. FAILURE [33:59 min]
[INFO] Apache Hadoop YARN Server Tests .................... SKIPPED
[INFO] Apache Hadoop YARN Client .......................... SKIPPED
[INFO] Apache Hadoop YARN SharedCacheManager .............. SKIPPED
[INFO] Apache Hadoop YARN Timeline Plugin Storage ......... SKIPPED
[INFO] Apache Hadoop YARN Applications .................... SUCCESS [  0.038 s]
[INFO] Apache Hadoop YARN DistributedShell ................ SKIPPED
[INFO] Apache Hadoop YARN Unmanaged Am Launcher ........... SKIPPED
[INFO] Apache Hadoop YARN Site ............................ SUCCESS [  0.041 s]
[INFO] Apache Hadoop YARN Registry ........................ SUCCESS [01:51 min]
[INFO] Apache Hadoop YARN Project ......................... SKIPPED
[INFO] ------------------------------------------------------------------------
[INFO] BUILD FAILURE
[INFO] ------------------------------------------------------------------------
[INFO] Total time: 57:21 min
[INFO] Finished at: 2016-05-25T11:34:54+00:00
[INFO] Final Memory: 129M/4736M
[INFO] ------------------------------------------------------------------------
[WARNING] The requested profile "docs" could not be activated because it does not exist.
[WARNING] The requested profile "parallel-tests" could not be activated because it does not exist.
[ERROR] Failed to execute goal org.apache.maven.plugins:maven-surefire-plugin:2.17:test (default-test) on project hadoop-yarn-server-resourcemanager: There are test failures.
[ERROR] 
[ERROR] Please refer to <https://builds.apache.org/job/Hadoop-Yarn-trunk-Java8/ws/source/hadoop-yarn-project/hadoop-yarn/hadoop-yarn-server/hadoop-yarn-server-resourcemanager/target/surefire-reports> for the individual test results.
[ERROR] -> [Help 1]
[ERROR] 
[ERROR] To see the full stack trace of the errors, re-run Maven with the -e switch.
[ERROR] Re-run Maven using the -X switch to enable full debug logging.
[ERROR] 
[ERROR] For more information about the errors and possible solutions, please read the following articles:
[ERROR] [Help 1] http://cwiki.apache.org/confluence/display/MAVEN/MojoFailureException
[ERROR] 
[ERROR] After correcting the problems, you can resume the build with the command
[ERROR]   mvn <goals> -rf :hadoop-yarn-server-resourcemanager
Build step 'Execute shell' marked build as failure
Archiving artifacts
Setting LATEST1_8_HOME=/home/jenkins/jenkins-slave/tools/hudson.model.JDK/latest1.8
Setting MAVEN_3_3_3_HOME=/home/jenkins/jenkins-slave/tools/hudson.tasks.Maven_MavenInstallation/maven-3.3.3
Recording test results
Setting LATEST1_8_HOME=/home/jenkins/jenkins-slave/tools/hudson.model.JDK/latest1.8
Setting MAVEN_3_3_3_HOME=/home/jenkins/jenkins-slave/tools/hudson.tasks.Maven_MavenInstallation/maven-3.3.3
Setting LATEST1_8_HOME=/home/jenkins/jenkins-slave/tools/hudson.model.JDK/latest1.8
Setting MAVEN_3_3_3_HOME=/home/jenkins/jenkins-slave/tools/hudson.tasks.Maven_MavenInstallation/maven-3.3.3

---------------------------------------------------------------------
To unsubscribe, e-mail: yarn-dev-unsubscribe@hadoop.apache.org
For additional commands, e-mail: yarn-dev-help@hadoop.apache.org


Hadoop-Yarn-trunk-Java8 - Build # 1495 - Still Failing

Posted by Apache Jenkins Server <je...@builds.apache.org>.
See https://builds.apache.org/job/Hadoop-Yarn-trunk-Java8/1495/

###################################################################################
########################## LAST 60 LINES OF THE CONSOLE ###########################
[...truncated 51585 lines...]
[INFO] Reactor Summary:
[INFO] 
[INFO] Apache Hadoop YARN ................................. SUCCESS [  2.886 s]
[INFO] Apache Hadoop YARN API ............................. SUCCESS [01:51 min]
[INFO] Apache Hadoop YARN Common .......................... SUCCESS [03:01 min]
[INFO] Apache Hadoop YARN Server .......................... SUCCESS [  0.074 s]
[INFO] Apache Hadoop YARN Server Common ................... SUCCESS [ 39.087 s]
[INFO] Apache Hadoop YARN NodeManager ..................... SUCCESS [11:47 min]
[INFO] Apache Hadoop YARN Web Proxy ....................... SUCCESS [ 18.720 s]
[INFO] Apache Hadoop YARN ApplicationHistoryService ....... SUCCESS [03:48 min]
[INFO] Apache Hadoop YARN ResourceManager ................. FAILURE [33:59 min]
[INFO] Apache Hadoop YARN Server Tests .................... SKIPPED
[INFO] Apache Hadoop YARN Client .......................... SKIPPED
[INFO] Apache Hadoop YARN SharedCacheManager .............. SKIPPED
[INFO] Apache Hadoop YARN Timeline Plugin Storage ......... SKIPPED
[INFO] Apache Hadoop YARN Applications .................... SUCCESS [  0.038 s]
[INFO] Apache Hadoop YARN DistributedShell ................ SKIPPED
[INFO] Apache Hadoop YARN Unmanaged Am Launcher ........... SKIPPED
[INFO] Apache Hadoop YARN Site ............................ SUCCESS [  0.041 s]
[INFO] Apache Hadoop YARN Registry ........................ SUCCESS [01:51 min]
[INFO] Apache Hadoop YARN Project ......................... SKIPPED
[INFO] ------------------------------------------------------------------------
[INFO] BUILD FAILURE
[INFO] ------------------------------------------------------------------------
[INFO] Total time: 57:21 min
[INFO] Finished at: 2016-05-25T11:34:54+00:00
[INFO] Final Memory: 129M/4736M
[INFO] ------------------------------------------------------------------------
[WARNING] The requested profile "docs" could not be activated because it does not exist.
[WARNING] The requested profile "parallel-tests" could not be activated because it does not exist.
[ERROR] Failed to execute goal org.apache.maven.plugins:maven-surefire-plugin:2.17:test (default-test) on project hadoop-yarn-server-resourcemanager: There are test failures.
[ERROR] 
[ERROR] Please refer to /home/jenkins/jenkins-slave/workspace/Hadoop-Yarn-trunk-Java8/source/hadoop-yarn-project/hadoop-yarn/hadoop-yarn-server/hadoop-yarn-server-resourcemanager/target/surefire-reports for the individual test results.
[ERROR] -> [Help 1]
[ERROR] 
[ERROR] To see the full stack trace of the errors, re-run Maven with the -e switch.
[ERROR] Re-run Maven using the -X switch to enable full debug logging.
[ERROR] 
[ERROR] For more information about the errors and possible solutions, please read the following articles:
[ERROR] [Help 1] http://cwiki.apache.org/confluence/display/MAVEN/MojoFailureException
[ERROR] 
[ERROR] After correcting the problems, you can resume the build with the command
[ERROR]   mvn <goals> -rf :hadoop-yarn-server-resourcemanager
Build step 'Execute shell' marked build as failure
Archiving artifacts
Setting LATEST1_8_HOME=/home/jenkins/jenkins-slave/tools/hudson.model.JDK/latest1.8
Setting MAVEN_3_3_3_HOME=/home/jenkins/jenkins-slave/tools/hudson.tasks.Maven_MavenInstallation/maven-3.3.3
Recording test results
Setting LATEST1_8_HOME=/home/jenkins/jenkins-slave/tools/hudson.model.JDK/latest1.8
Setting MAVEN_3_3_3_HOME=/home/jenkins/jenkins-slave/tools/hudson.tasks.Maven_MavenInstallation/maven-3.3.3
Setting LATEST1_8_HOME=/home/jenkins/jenkins-slave/tools/hudson.model.JDK/latest1.8
Setting MAVEN_3_3_3_HOME=/home/jenkins/jenkins-slave/tools/hudson.tasks.Maven_MavenInstallation/maven-3.3.3
Sending e-mails to: yarn-dev@hadoop.apache.org
Email was triggered for: Failure - Any
Sending email for trigger: Failure - Any
Setting LATEST1_8_HOME=/home/jenkins/jenkins-slave/tools/hudson.model.JDK/latest1.8
Setting MAVEN_3_3_3_HOME=/home/jenkins/jenkins-slave/tools/hudson.tasks.Maven_MavenInstallation/maven-3.3.3
Setting LATEST1_8_HOME=/home/jenkins/jenkins-slave/tools/hudson.model.JDK/latest1.8
Setting MAVEN_3_3_3_HOME=/home/jenkins/jenkins-slave/tools/hudson.tasks.Maven_MavenInstallation/maven-3.3.3



###################################################################################
############################## FAILED TESTS (if any) ##############################
1 tests failed.
FAILED:  org.apache.hadoop.yarn.server.resourcemanager.TestRMAdminService.testRefreshNodesResourceWithFileSystemBasedConfigurationProvider

Error Message:
expected:<<memory:[4096, vCores:4]>> but was:<<memory:[5120, vCores:5]>>

Stack Trace:
org.junit.ComparisonFailure: expected:<<memory:[4096, vCores:4]>> but was:<<memory:[5120, vCores:5]>>
	at org.junit.Assert.assertEquals(Assert.java:115)
	at org.junit.Assert.assertEquals(Assert.java:144)
	at org.apache.hadoop.yarn.server.resourcemanager.TestRMAdminService.testRefreshNodesResourceWithFileSystemBasedConfigurationProvider(TestRMAdminService.java:238)




Build failed in Jenkins: Hadoop-Yarn-trunk-Java8 #1494

Posted by Apache Jenkins Server <je...@builds.apache.org>.
See <https://builds.apache.org/job/Hadoop-Yarn-trunk-Java8/1494/changes>

Changes:

[vinayakumarb] HDFS-10217. show 'blockScheduled' tooltip in datanodes table.

------------------------------------------
[...truncated 51430 lines...]
Generating <https://builds.apache.org/job/Hadoop-Yarn-trunk-Java8/ws/source/hadoop-yarn-project/hadoop-yarn/hadoop-yarn-registry/target/org/apache/hadoop/registry/client/impl/zk/class-use/RegistrySecurity.AclListInfo.html...>
Generating <https://builds.apache.org/job/Hadoop-Yarn-trunk-Java8/ws/source/hadoop-yarn-project/hadoop-yarn/hadoop-yarn-registry/target/org/apache/hadoop/registry/cli/package-use.html...>
Generating <https://builds.apache.org/job/Hadoop-Yarn-trunk-Java8/ws/source/hadoop-yarn-project/hadoop-yarn/hadoop-yarn-registry/target/org/apache/hadoop/registry/client/api/package-use.html...>
Generating <https://builds.apache.org/job/Hadoop-Yarn-trunk-Java8/ws/source/hadoop-yarn-project/hadoop-yarn/hadoop-yarn-registry/target/org/apache/hadoop/registry/client/binding/package-use.html...>
Generating <https://builds.apache.org/job/Hadoop-Yarn-trunk-Java8/ws/source/hadoop-yarn-project/hadoop-yarn/hadoop-yarn-registry/target/org/apache/hadoop/registry/client/exceptions/package-use.html...>
Generating <https://builds.apache.org/job/Hadoop-Yarn-trunk-Java8/ws/source/hadoop-yarn-project/hadoop-yarn/hadoop-yarn-registry/target/org/apache/hadoop/registry/client/impl/package-use.html...>
Generating <https://builds.apache.org/job/Hadoop-Yarn-trunk-Java8/ws/source/hadoop-yarn-project/hadoop-yarn/hadoop-yarn-registry/target/org/apache/hadoop/registry/client/impl/zk/package-use.html...>
Generating <https://builds.apache.org/job/Hadoop-Yarn-trunk-Java8/ws/source/hadoop-yarn-project/hadoop-yarn/hadoop-yarn-registry/target/org/apache/hadoop/registry/client/types/package-use.html...>
Generating <https://builds.apache.org/job/Hadoop-Yarn-trunk-Java8/ws/source/hadoop-yarn-project/hadoop-yarn/hadoop-yarn-registry/target/org/apache/hadoop/registry/client/types/yarn/package-use.html...>
Generating <https://builds.apache.org/job/Hadoop-Yarn-trunk-Java8/ws/source/hadoop-yarn-project/hadoop-yarn/hadoop-yarn-registry/target/org/apache/hadoop/registry/server/package-use.html...>
Generating <https://builds.apache.org/job/Hadoop-Yarn-trunk-Java8/ws/source/hadoop-yarn-project/hadoop-yarn/hadoop-yarn-registry/target/org/apache/hadoop/registry/server/integration/package-use.html...>
Generating <https://builds.apache.org/job/Hadoop-Yarn-trunk-Java8/ws/source/hadoop-yarn-project/hadoop-yarn/hadoop-yarn-registry/target/org/apache/hadoop/registry/server/services/package-use.html...>
Building index for all the packages and classes...
Generating <https://builds.apache.org/job/Hadoop-Yarn-trunk-Java8/ws/source/hadoop-yarn-project/hadoop-yarn/hadoop-yarn-registry/target/overview-tree.html...>
Generating <https://builds.apache.org/job/Hadoop-Yarn-trunk-Java8/ws/source/hadoop-yarn-project/hadoop-yarn/hadoop-yarn-registry/target/index-all.html...>
Generating <https://builds.apache.org/job/Hadoop-Yarn-trunk-Java8/ws/source/hadoop-yarn-project/hadoop-yarn/hadoop-yarn-registry/target/deprecated-list.html...>
Building index for all classes...
Generating <https://builds.apache.org/job/Hadoop-Yarn-trunk-Java8/ws/source/hadoop-yarn-project/hadoop-yarn/hadoop-yarn-registry/target/allclasses-frame.html...>
Generating <https://builds.apache.org/job/Hadoop-Yarn-trunk-Java8/ws/source/hadoop-yarn-project/hadoop-yarn/hadoop-yarn-registry/target/allclasses-noframe.html...>
Generating <https://builds.apache.org/job/Hadoop-Yarn-trunk-Java8/ws/source/hadoop-yarn-project/hadoop-yarn/hadoop-yarn-registry/target/index.html...>
Generating <https://builds.apache.org/job/Hadoop-Yarn-trunk-Java8/ws/source/hadoop-yarn-project/hadoop-yarn/hadoop-yarn-registry/target/overview-summary.html...>
Generating <https://builds.apache.org/job/Hadoop-Yarn-trunk-Java8/ws/source/hadoop-yarn-project/hadoop-yarn/hadoop-yarn-registry/target/help-doc.html...>
52 warnings
[WARNING] Javadoc Warnings
[WARNING] <https://builds.apache.org/job/Hadoop-Yarn-trunk-Java8/ws/source/hadoop-yarn-project/hadoop-yarn/hadoop-yarn-registry/src/main/java/org/apache/hadoop/registry/server/integration/RMRegistryOperationsService.java>:73: warning: no description for @throws
[WARNING] * @throws Exception
[WARNING] ^
[WARNING] <https://builds.apache.org/job/Hadoop-Yarn-trunk-Java8/ws/source/hadoop-yarn-project/hadoop-yarn/hadoop-yarn-registry/src/main/java/org/apache/hadoop/registry/server/services/RegistryAdminService.java>:174: warning: no description for @throws
[WARNING] * @throws IOException
[WARNING] ^
[WARNING] <https://builds.apache.org/job/Hadoop-Yarn-trunk-Java8/ws/source/hadoop-yarn-project/hadoop-yarn/hadoop-yarn-registry/src/main/java/org/apache/hadoop/registry/server/services/RegistryAdminService.java>:191: warning: no description for @throws
[WARNING] * @throws Exception
[WARNING] ^
[WARNING] <https://builds.apache.org/job/Hadoop-Yarn-trunk-Java8/ws/source/hadoop-yarn-project/hadoop-yarn/hadoop-yarn-registry/src/main/java/org/apache/hadoop/registry/server/services/RegistryAdminService.java>:208: warning: no description for @throws
[WARNING] * @throws Exception
[WARNING] ^
[WARNING] <https://builds.apache.org/job/Hadoop-Yarn-trunk-Java8/ws/source/hadoop-yarn-project/hadoop-yarn/hadoop-yarn-registry/src/main/java/org/apache/hadoop/registry/client/api/RegistryOperations.java>:118: warning: no description for @throws
[WARNING] * @throws IOException
[WARNING] ^
[WARNING] <https://builds.apache.org/job/Hadoop-Yarn-trunk-Java8/ws/source/hadoop-yarn-project/hadoop-yarn/hadoop-yarn-registry/src/main/java/org/apache/hadoop/registry/client/api/RegistryOperations.java>:128: warning: no description for @throws
[WARNING] * @throws PathNotFoundException
[WARNING] ^
[WARNING] <https://builds.apache.org/job/Hadoop-Yarn-trunk-Java8/ws/source/hadoop-yarn-project/hadoop-yarn/hadoop-yarn-registry/src/main/java/org/apache/hadoop/registry/client/api/RegistryOperations.java>:129: warning: no description for @throws
[WARNING] * @throws InvalidPathnameException
[WARNING] ^
[WARNING] <https://builds.apache.org/job/Hadoop-Yarn-trunk-Java8/ws/source/hadoop-yarn-project/hadoop-yarn/hadoop-yarn-registry/src/main/java/org/apache/hadoop/registry/client/api/RegistryOperations.java>:130: warning: no description for @throws
[WARNING] * @throws IOException
[WARNING] ^
[WARNING] <https://builds.apache.org/job/Hadoop-Yarn-trunk-Java8/ws/source/hadoop-yarn-project/hadoop-yarn/hadoop-yarn-registry/src/main/java/org/apache/hadoop/registry/client/impl/zk/CuratorService.java>:136: warning: no description for @throws
[WARNING] * @throws Exception
[WARNING] ^
[WARNING] <https://builds.apache.org/job/Hadoop-Yarn-trunk-Java8/ws/source/hadoop-yarn-project/hadoop-yarn/hadoop-yarn-registry/src/main/java/org/apache/hadoop/registry/client/impl/zk/CuratorService.java>:158: warning: no description for @throws
[WARNING] * @throws Exception
[WARNING] ^
[WARNING] <https://builds.apache.org/job/Hadoop-Yarn-trunk-Java8/ws/source/hadoop-yarn-project/hadoop-yarn/hadoop-yarn-registry/src/main/java/org/apache/hadoop/registry/client/impl/zk/CuratorService.java>:295: warning: no @throws for java.io.IOException
[WARNING] protected String createFullPath(String path) throws IOException {
[WARNING] ^
[WARNING] <https://builds.apache.org/job/Hadoop-Yarn-trunk-Java8/ws/source/hadoop-yarn-project/hadoop-yarn/hadoop-yarn-registry/src/main/java/org/apache/hadoop/registry/client/impl/zk/CuratorService.java>:370: warning: no @param for acls
[WARNING] protected IOException operationFailure(String path,
[WARNING] ^
[WARNING] <https://builds.apache.org/job/Hadoop-Yarn-trunk-Java8/ws/source/hadoop-yarn-project/hadoop-yarn/hadoop-yarn-registry/src/main/java/org/apache/hadoop/registry/client/impl/zk/CuratorService.java>:424: warning: no description for @throws
[WARNING] * @throws IOException
[WARNING] ^
[WARNING] <https://builds.apache.org/job/Hadoop-Yarn-trunk-Java8/ws/source/hadoop-yarn-project/hadoop-yarn/hadoop-yarn-registry/src/main/java/org/apache/hadoop/registry/client/impl/zk/CuratorService.java>:427: warning: no @param for mode
[WARNING] public boolean maybeCreate(String path,
[WARNING] ^
[WARNING] <https://builds.apache.org/job/Hadoop-Yarn-trunk-Java8/ws/source/hadoop-yarn-project/hadoop-yarn/hadoop-yarn-registry/src/main/java/org/apache/hadoop/registry/client/impl/zk/CuratorService.java>:463: warning: no description for @throws
[WARNING] * @throws IOException
[WARNING] ^
[WARNING] <https://builds.apache.org/job/Hadoop-Yarn-trunk-Java8/ws/source/hadoop-yarn-project/hadoop-yarn/hadoop-yarn-registry/src/main/java/org/apache/hadoop/registry/client/impl/zk/CuratorService.java>:509: warning: no description for @throws
[WARNING] * @throws IOException
[WARNING] ^
[WARNING] <https://builds.apache.org/job/Hadoop-Yarn-trunk-Java8/ws/source/hadoop-yarn-project/hadoop-yarn/hadoop-yarn-registry/src/main/java/org/apache/hadoop/registry/client/impl/zk/CuratorService.java>:511: warning: no @return
[WARNING] public String zkPathMustExist(String path) throws IOException {
[WARNING] ^
[WARNING] <https://builds.apache.org/job/Hadoop-Yarn-trunk-Java8/ws/source/hadoop-yarn-project/hadoop-yarn/hadoop-yarn-registry/src/main/java/org/apache/hadoop/registry/client/impl/zk/CuratorService.java>:524: warning: no @return
[WARNING] public boolean zkMkPath(String path,
[WARNING] ^
[WARNING] <https://builds.apache.org/job/Hadoop-Yarn-trunk-Java8/ws/source/hadoop-yarn-project/hadoop-yarn/hadoop-yarn-registry/src/main/java/org/apache/hadoop/registry/client/impl/zk/CuratorService.java>:580: warning: no description for @param
[WARNING] * @param acls
[WARNING] ^
[WARNING] <https://builds.apache.org/job/Hadoop-Yarn-trunk-Java8/ws/source/hadoop-yarn-project/hadoop-yarn/hadoop-yarn-registry/src/main/java/org/apache/hadoop/registry/client/impl/zk/CuratorService.java>:581: warning: no description for @throws
[WARNING] * @throws IOException
[WARNING] ^
[WARNING] <https://builds.apache.org/job/Hadoop-Yarn-trunk-Java8/ws/source/hadoop-yarn-project/hadoop-yarn/hadoop-yarn-registry/src/main/java/org/apache/hadoop/registry/client/impl/zk/CuratorService.java>:583: warning: no @param for mode
[WARNING] public void zkCreate(String path,
[WARNING] ^
[WARNING] <https://builds.apache.org/job/Hadoop-Yarn-trunk-Java8/ws/source/hadoop-yarn-project/hadoop-yarn/hadoop-yarn-registry/src/main/java/org/apache/hadoop/registry/client/impl/zk/CuratorService.java>:606: warning: no description for @throws
[WARNING] * @throws IOException
[WARNING] ^
[WARNING] <https://builds.apache.org/job/Hadoop-Yarn-trunk-Java8/ws/source/hadoop-yarn-project/hadoop-yarn/hadoop-yarn-registry/src/main/java/org/apache/hadoop/registry/client/impl/zk/CuratorService.java>:628: warning: no description for @throws
[WARNING] * @throws IOException
[WARNING] ^
[WARNING] <https://builds.apache.org/job/Hadoop-Yarn-trunk-Java8/ws/source/hadoop-yarn-project/hadoop-yarn/hadoop-yarn-registry/src/main/java/org/apache/hadoop/registry/client/impl/zk/CuratorService.java>:631: warning: no @param for mode
[WARNING] public boolean zkSet(String path,
[WARNING] ^
[WARNING] <https://builds.apache.org/job/Hadoop-Yarn-trunk-Java8/ws/source/hadoop-yarn-project/hadoop-yarn/hadoop-yarn-registry/src/main/java/org/apache/hadoop/registry/client/impl/zk/CuratorService.java>:688: warning: no description for @throws
[WARNING] * @throws IOException
[WARNING] ^
[WARNING] <https://builds.apache.org/job/Hadoop-Yarn-trunk-Java8/ws/source/hadoop-yarn-project/hadoop-yarn/hadoop-yarn-registry/src/main/java/org/apache/hadoop/registry/client/impl/zk/CuratorService.java>:741: warning: no @return
[WARNING] public boolean addWriteAccessor(String id, String pass) throws IOException {
[WARNING] ^
[WARNING] <https://builds.apache.org/job/Hadoop-Yarn-trunk-Java8/ws/source/hadoop-yarn-project/hadoop-yarn/hadoop-yarn-registry/src/main/java/org/apache/hadoop/registry/server/services/MicroZookeeperService.java>:130: warning: no description for @throws
[WARNING] * @throws Exception
[WARNING] ^
[WARNING] <https://builds.apache.org/job/Hadoop-Yarn-trunk-Java8/ws/source/hadoop-yarn-project/hadoop-yarn/hadoop-yarn-registry/src/main/java/org/apache/hadoop/registry/server/services/MicroZookeeperService.java>:196: warning: no @throws for java.io.IOException
[WARNING] public boolean setupSecurity() throws IOException {
[WARNING] ^
[WARNING] <https://builds.apache.org/job/Hadoop-Yarn-trunk-Java8/ws/source/hadoop-yarn-project/hadoop-yarn/hadoop-yarn-registry/src/main/java/org/apache/hadoop/registry/server/services/MicroZookeeperService.java>:223: warning: no description for @throws
[WARNING] * @throws Exception
[WARNING] ^
[WARNING] <https://builds.apache.org/job/Hadoop-Yarn-trunk-Java8/ws/source/hadoop-yarn-project/hadoop-yarn/hadoop-yarn-registry/src/main/java/org/apache/hadoop/registry/server/services/MicroZookeeperService.java>:263: warning: no description for @throws
[WARNING] * @throws Exception
[WARNING] ^
[WARNING] <https://builds.apache.org/job/Hadoop-Yarn-trunk-Java8/ws/source/hadoop-yarn-project/hadoop-yarn/hadoop-yarn-registry/src/main/java/org/apache/hadoop/registry/cli/RegistryCli.java>:124: warning: no description for @throws
[WARNING] * @throws IOException
[WARNING] ^
[WARNING] <https://builds.apache.org/job/Hadoop-Yarn-trunk-Java8/ws/source/hadoop-yarn-project/hadoop-yarn/hadoop-yarn-registry/src/main/java/org/apache/hadoop/registry/client/binding/JsonSerDeser.java>:101: warning: no @throws for org.codehaus.jackson.JsonParseException
[WARNING] public synchronized T fromJson(String json)
[WARNING] ^
[WARNING] <https://builds.apache.org/job/Hadoop-Yarn-trunk-Java8/ws/source/hadoop-yarn-project/hadoop-yarn/hadoop-yarn-registry/src/main/java/org/apache/hadoop/registry/client/binding/JsonSerDeser.java>:119: warning: no @throws for org.codehaus.jackson.JsonParseException
[WARNING] public synchronized T fromFile(File jsonFile)
[WARNING] ^
[WARNING] <https://builds.apache.org/job/Hadoop-Yarn-trunk-Java8/ws/source/hadoop-yarn-project/hadoop-yarn/hadoop-yarn-registry/src/main/java/org/apache/hadoop/registry/client/binding/JsonSerDeser.java>:137: warning: no @throws for org.codehaus.jackson.JsonParseException
[WARNING] public synchronized T fromResource(String resource)
[WARNING] ^
[WARNING] <https://builds.apache.org/job/Hadoop-Yarn-trunk-Java8/ws/source/hadoop-yarn-project/hadoop-yarn/hadoop-yarn-registry/src/main/java/org/apache/hadoop/registry/client/binding/JsonSerDeser.java>:195: warning: no @param for instance
[WARNING] public void save(FileSystem fs, Path path, T instance,
[WARNING] ^
[WARNING] <https://builds.apache.org/job/Hadoop-Yarn-trunk-Java8/ws/source/hadoop-yarn-project/hadoop-yarn/hadoop-yarn-registry/src/main/java/org/apache/hadoop/registry/client/binding/JsonSerDeser.java>:221: warning: no description for @throws
[WARNING] * @throws IOException
[WARNING] ^
[WARNING] <https://builds.apache.org/job/Hadoop-Yarn-trunk-Java8/ws/source/hadoop-yarn-project/hadoop-yarn/hadoop-yarn-registry/src/main/java/org/apache/hadoop/registry/client/binding/JsonSerDeser.java>:236: warning: no @return
[WARNING] public T fromBytes(String path, byte[] bytes) throws IOException,
[WARNING] ^
[WARNING] <https://builds.apache.org/job/Hadoop-Yarn-trunk-Java8/ws/source/hadoop-yarn-project/hadoop-yarn/hadoop-yarn-registry/src/main/java/org/apache/hadoop/registry/client/binding/JsonSerDeser.java>:287: warning: no @throws for org.codehaus.jackson.JsonGenerationException
[WARNING] public synchronized String toJson(T instance) throws IOException,
[WARNING] ^
[WARNING] <https://builds.apache.org/job/Hadoop-Yarn-trunk-Java8/ws/source/hadoop-yarn-project/hadoop-yarn/hadoop-yarn-registry/src/main/java/org/apache/hadoop/registry/client/binding/RegistryPathUtils.java>:91: warning: no @param for base
[WARNING] public static String createFullPath(String base, String path) throws
[WARNING] ^
[WARNING] <https://builds.apache.org/job/Hadoop-Yarn-trunk-Java8/ws/source/hadoop-yarn-project/hadoop-yarn/hadoop-yarn-registry/src/main/java/org/apache/hadoop/registry/client/binding/RegistryUtils.java>:170: warning: no description for @throws
[WARNING] * @throws IOException
[WARNING] ^
[WARNING] <https://builds.apache.org/job/Hadoop-Yarn-trunk-Java8/ws/source/hadoop-yarn-project/hadoop-yarn/hadoop-yarn-registry/src/main/java/org/apache/hadoop/registry/client/binding/RegistryUtils.java>:198: warning: no @param for registryOperations
[WARNING] public static Map<String, RegistryPathStatus> statChildren(
[WARNING] ^
[WARNING] <https://builds.apache.org/job/Hadoop-Yarn-trunk-Java8/ws/source/hadoop-yarn-project/hadoop-yarn/hadoop-yarn-registry/src/main/java/org/apache/hadoop/registry/client/binding/RegistryUtils.java>:350: warning: no @param for stats
[WARNING] public static Map<String, ServiceRecord> extractServiceRecords(
[WARNING] ^
[WARNING] <https://builds.apache.org/job/Hadoop-Yarn-trunk-Java8/ws/source/hadoop-yarn-project/hadoop-yarn/hadoop-yarn-registry/src/main/java/org/apache/hadoop/registry/client/types/Endpoint.java>:229: warning: no description for @throws
[WARNING] * @throws CloneNotSupportedException
[WARNING] ^
[WARNING] <https://builds.apache.org/job/Hadoop-Yarn-trunk-Java8/ws/source/hadoop-yarn-project/hadoop-yarn/hadoop-yarn-registry/src/main/java/org/apache/hadoop/registry/client/types/ServiceRecord.java>:241: warning: no description for @throws
[WARNING] * @throws CloneNotSupportedException
[WARNING] ^
[WARNING] <https://builds.apache.org/job/Hadoop-Yarn-trunk-Java8/ws/source/hadoop-yarn-project/hadoop-yarn/hadoop-yarn-registry/src/main/java/org/apache/hadoop/registry/client/impl/zk/RegistrySecurity.java>:187: warning: no description for @throws
[WARNING] * @throws Exception
[WARNING] ^
[WARNING] <https://builds.apache.org/job/Hadoop-Yarn-trunk-Java8/ws/source/hadoop-yarn-project/hadoop-yarn/hadoop-yarn-registry/src/main/java/org/apache/hadoop/registry/client/impl/zk/RegistrySecurity.java>:320: warning: no @return
[WARNING] public boolean addDigestACL(ACL acl) {
[WARNING] ^
[WARNING] <https://builds.apache.org/job/Hadoop-Yarn-trunk-Java8/ws/source/hadoop-yarn-project/hadoop-yarn/hadoop-yarn-registry/src/main/java/org/apache/hadoop/registry/client/impl/zk/RegistrySecurity.java>:378: warning: no description for @throws
[WARNING] * @throws IOException
[WARNING] ^
[WARNING] <https://builds.apache.org/job/Hadoop-Yarn-trunk-Java8/ws/source/hadoop-yarn-project/hadoop-yarn/hadoop-yarn-registry/src/main/java/org/apache/hadoop/registry/client/impl/zk/RegistrySecurity.java>:444: warning: no @throws for java.io.IOException
[WARNING] public String digest(String idPasswordPair) throws IOException {
[WARNING] ^
[WARNING] <https://builds.apache.org/job/Hadoop-Yarn-trunk-Java8/ws/source/hadoop-yarn-project/hadoop-yarn/hadoop-yarn-registry/src/main/java/org/apache/hadoop/registry/client/impl/zk/RegistrySecurity.java>:462: warning: no description for @throws
[WARNING] * @throws IOException
[WARNING] ^
[WARNING] <https://builds.apache.org/job/Hadoop-Yarn-trunk-Java8/ws/source/hadoop-yarn-project/hadoop-yarn/hadoop-yarn-registry/src/main/java/org/apache/hadoop/registry/client/impl/zk/RegistrySecurity.java>:482: warning: no description for @throws
[WARNING] * @throws IOException
[WARNING] ^
[WARNING] <https://builds.apache.org/job/Hadoop-Yarn-trunk-Java8/ws/source/hadoop-yarn-project/hadoop-yarn/hadoop-yarn-registry/src/main/java/org/apache/hadoop/registry/client/impl/zk/RegistrySecurity.java>:550: warning: no description for @throws
[WARNING] * @throws IOException
[WARNING] ^
[WARNING] <https://builds.apache.org/job/Hadoop-Yarn-trunk-Java8/ws/source/hadoop-yarn-project/hadoop-yarn/hadoop-yarn-registry/src/main/java/org/apache/hadoop/registry/client/impl/zk/RegistrySecurity.java>:923: warning: no @param for perms
[WARNING] public ACL createACLForUser(UserGroupInformation ugi, int perms) {
[WARNING] ^
[INFO] Building jar: <https://builds.apache.org/job/Hadoop-Yarn-trunk-Java8/ws/source/hadoop-yarn-project/hadoop-yarn/hadoop-yarn-registry/target/hadoop-yarn-registry-3.0.0-alpha1-SNAPSHOT-javadoc.jar>
[INFO] 
[INFO] --- maven-enforcer-plugin:1.3.1:enforce (depcheck) @ hadoop-yarn-registry ---
[INFO] 
[INFO] --- maven-checkstyle-plugin:2.15:checkstyle (default-cli) @ hadoop-yarn-registry ---
[INFO] There are 509 errors reported by Checkstyle 6.6 with checkstyle/checkstyle.xml ruleset.
[WARNING] Unable to locate Source XRef to link to - DISABLED
[INFO] 
[INFO] --- findbugs-maven-plugin:3.0.0:findbugs (default-cli) @ hadoop-yarn-registry ---
[INFO] Fork Value is true
[INFO] Done FindBugs Analysis....
[INFO]                                                                         
[INFO] ------------------------------------------------------------------------
[INFO] Skipping Apache Hadoop YARN Project
[INFO] This project has been banned from the build due to previous failures.
[INFO] ------------------------------------------------------------------------
[INFO] ------------------------------------------------------------------------
[INFO] Reactor Summary:
[INFO] 
[INFO] Apache Hadoop YARN ................................. SUCCESS [  2.764 s]
[INFO] Apache Hadoop YARN API ............................. SUCCESS [01:47 min]
[INFO] Apache Hadoop YARN Common .......................... SUCCESS [02:59 min]
[INFO] Apache Hadoop YARN Server .......................... SUCCESS [  0.066 s]
[INFO] Apache Hadoop YARN Server Common ................... SUCCESS [ 38.637 s]
[INFO] Apache Hadoop YARN NodeManager ..................... SUCCESS [11:58 min]
[INFO] Apache Hadoop YARN Web Proxy ....................... SUCCESS [ 19.413 s]
[INFO] Apache Hadoop YARN ApplicationHistoryService ....... SUCCESS [04:12 min]
[INFO] Apache Hadoop YARN ResourceManager ................. FAILURE [34:50 min]
[INFO] Apache Hadoop YARN Server Tests .................... SKIPPED
[INFO] Apache Hadoop YARN Client .......................... SKIPPED
[INFO] Apache Hadoop YARN SharedCacheManager .............. SKIPPED
[INFO] Apache Hadoop YARN Timeline Plugin Storage ......... SKIPPED
[INFO] Apache Hadoop YARN Applications .................... SUCCESS [  0.035 s]
[INFO] Apache Hadoop YARN DistributedShell ................ SKIPPED
[INFO] Apache Hadoop YARN Unmanaged Am Launcher ........... SKIPPED
[INFO] Apache Hadoop YARN Site ............................ SUCCESS [  0.038 s]
[INFO] Apache Hadoop YARN Registry ........................ SUCCESS [01:46 min]
[INFO] Apache Hadoop YARN Project ......................... SKIPPED
[INFO] ------------------------------------------------------------------------
[INFO] BUILD FAILURE
[INFO] ------------------------------------------------------------------------
[INFO] Total time: 58:36 min
[INFO] Finished at: 2016-05-25T08:36:27+00:00
[INFO] Final Memory: 127M/4429M
[INFO] ------------------------------------------------------------------------
[WARNING] The requested profile "docs" could not be activated because it does not exist.
[WARNING] The requested profile "parallel-tests" could not be activated because it does not exist.
[ERROR] Failed to execute goal org.apache.maven.plugins:maven-surefire-plugin:2.17:test (default-test) on project hadoop-yarn-server-resourcemanager: There are test failures.
[ERROR] 
[ERROR] Please refer to <https://builds.apache.org/job/Hadoop-Yarn-trunk-Java8/ws/source/hadoop-yarn-project/hadoop-yarn/hadoop-yarn-server/hadoop-yarn-server-resourcemanager/target/surefire-reports> for the individual test results.
[ERROR] -> [Help 1]
[ERROR] 
[ERROR] To see the full stack trace of the errors, re-run Maven with the -e switch.
[ERROR] Re-run Maven using the -X switch to enable full debug logging.
[ERROR] 
[ERROR] For more information about the errors and possible solutions, please read the following articles:
[ERROR] [Help 1] http://cwiki.apache.org/confluence/display/MAVEN/MojoFailureException
[ERROR] 
[ERROR] After correcting the problems, you can resume the build with the command
[ERROR]   mvn <goals> -rf :hadoop-yarn-server-resourcemanager
Build step 'Execute shell' marked build as failure
Archiving artifacts
Setting LATEST1_8_HOME=/home/jenkins/jenkins-slave/tools/hudson.model.JDK/latest1.8
Setting MAVEN_3_3_3_HOME=/home/jenkins/jenkins-slave/tools/hudson.tasks.Maven_MavenInstallation/maven-3.3.3
Recording test results
Setting LATEST1_8_HOME=/home/jenkins/jenkins-slave/tools/hudson.model.JDK/latest1.8
Setting MAVEN_3_3_3_HOME=/home/jenkins/jenkins-slave/tools/hudson.tasks.Maven_MavenInstallation/maven-3.3.3
Setting LATEST1_8_HOME=/home/jenkins/jenkins-slave/tools/hudson.model.JDK/latest1.8
Setting MAVEN_3_3_3_HOME=/home/jenkins/jenkins-slave/tools/hudson.tasks.Maven_MavenInstallation/maven-3.3.3

---------------------------------------------------------------------
To unsubscribe, e-mail: yarn-dev-unsubscribe@hadoop.apache.org
For additional commands, e-mail: yarn-dev-help@hadoop.apache.org


Build failed in Jenkins: Hadoop-Yarn-trunk-Java8 #1493

Posted by Apache Jenkins Server <je...@builds.apache.org>.
See <https://builds.apache.org/job/Hadoop-Yarn-trunk-Java8/1493/changes>

Changes:

[rohithsharmaks] YARN-5024.

------------------------------------------
[...truncated 51392 lines...]
Generating <https://builds.apache.org/job/Hadoop-Yarn-trunk-Java8/ws/source/hadoop-yarn-project/hadoop-yarn/hadoop-yarn-registry/target/org/apache/hadoop/registry/client/impl/zk/class-use/RegistrySecurity.AclListInfo.html...>
Generating <https://builds.apache.org/job/Hadoop-Yarn-trunk-Java8/ws/source/hadoop-yarn-project/hadoop-yarn/hadoop-yarn-registry/target/org/apache/hadoop/registry/cli/package-use.html...>
Generating <https://builds.apache.org/job/Hadoop-Yarn-trunk-Java8/ws/source/hadoop-yarn-project/hadoop-yarn/hadoop-yarn-registry/target/org/apache/hadoop/registry/client/api/package-use.html...>
Generating <https://builds.apache.org/job/Hadoop-Yarn-trunk-Java8/ws/source/hadoop-yarn-project/hadoop-yarn/hadoop-yarn-registry/target/org/apache/hadoop/registry/client/binding/package-use.html...>
Generating <https://builds.apache.org/job/Hadoop-Yarn-trunk-Java8/ws/source/hadoop-yarn-project/hadoop-yarn/hadoop-yarn-registry/target/org/apache/hadoop/registry/client/exceptions/package-use.html...>
Generating <https://builds.apache.org/job/Hadoop-Yarn-trunk-Java8/ws/source/hadoop-yarn-project/hadoop-yarn/hadoop-yarn-registry/target/org/apache/hadoop/registry/client/impl/package-use.html...>
Generating <https://builds.apache.org/job/Hadoop-Yarn-trunk-Java8/ws/source/hadoop-yarn-project/hadoop-yarn/hadoop-yarn-registry/target/org/apache/hadoop/registry/client/impl/zk/package-use.html...>
Generating <https://builds.apache.org/job/Hadoop-Yarn-trunk-Java8/ws/source/hadoop-yarn-project/hadoop-yarn/hadoop-yarn-registry/target/org/apache/hadoop/registry/client/types/package-use.html...>
Generating <https://builds.apache.org/job/Hadoop-Yarn-trunk-Java8/ws/source/hadoop-yarn-project/hadoop-yarn/hadoop-yarn-registry/target/org/apache/hadoop/registry/client/types/yarn/package-use.html...>
Generating <https://builds.apache.org/job/Hadoop-Yarn-trunk-Java8/ws/source/hadoop-yarn-project/hadoop-yarn/hadoop-yarn-registry/target/org/apache/hadoop/registry/server/package-use.html...>
Generating <https://builds.apache.org/job/Hadoop-Yarn-trunk-Java8/ws/source/hadoop-yarn-project/hadoop-yarn/hadoop-yarn-registry/target/org/apache/hadoop/registry/server/integration/package-use.html...>
Generating <https://builds.apache.org/job/Hadoop-Yarn-trunk-Java8/ws/source/hadoop-yarn-project/hadoop-yarn/hadoop-yarn-registry/target/org/apache/hadoop/registry/server/services/package-use.html...>
Building index for all the packages and classes...
Generating <https://builds.apache.org/job/Hadoop-Yarn-trunk-Java8/ws/source/hadoop-yarn-project/hadoop-yarn/hadoop-yarn-registry/target/overview-tree.html...>
Generating <https://builds.apache.org/job/Hadoop-Yarn-trunk-Java8/ws/source/hadoop-yarn-project/hadoop-yarn/hadoop-yarn-registry/target/index-all.html...>
Generating <https://builds.apache.org/job/Hadoop-Yarn-trunk-Java8/ws/source/hadoop-yarn-project/hadoop-yarn/hadoop-yarn-registry/target/deprecated-list.html...>
Building index for all classes...
Generating <https://builds.apache.org/job/Hadoop-Yarn-trunk-Java8/ws/source/hadoop-yarn-project/hadoop-yarn/hadoop-yarn-registry/target/allclasses-frame.html...>
Generating <https://builds.apache.org/job/Hadoop-Yarn-trunk-Java8/ws/source/hadoop-yarn-project/hadoop-yarn/hadoop-yarn-registry/target/allclasses-noframe.html...>
Generating <https://builds.apache.org/job/Hadoop-Yarn-trunk-Java8/ws/source/hadoop-yarn-project/hadoop-yarn/hadoop-yarn-registry/target/index.html...>
Generating <https://builds.apache.org/job/Hadoop-Yarn-trunk-Java8/ws/source/hadoop-yarn-project/hadoop-yarn/hadoop-yarn-registry/target/overview-summary.html...>
Generating <https://builds.apache.org/job/Hadoop-Yarn-trunk-Java8/ws/source/hadoop-yarn-project/hadoop-yarn/hadoop-yarn-registry/target/help-doc.html...>
52 warnings
[WARNING] Javadoc Warnings
[WARNING] <https://builds.apache.org/job/Hadoop-Yarn-trunk-Java8/ws/source/hadoop-yarn-project/hadoop-yarn/hadoop-yarn-registry/src/main/java/org/apache/hadoop/registry/server/integration/RMRegistryOperationsService.java>:73: warning: no description for @throws
[WARNING] * @throws Exception
[WARNING] ^
[WARNING] <https://builds.apache.org/job/Hadoop-Yarn-trunk-Java8/ws/source/hadoop-yarn-project/hadoop-yarn/hadoop-yarn-registry/src/main/java/org/apache/hadoop/registry/server/services/RegistryAdminService.java>:174: warning: no description for @throws
[WARNING] * @throws IOException
[WARNING] ^
[WARNING] <https://builds.apache.org/job/Hadoop-Yarn-trunk-Java8/ws/source/hadoop-yarn-project/hadoop-yarn/hadoop-yarn-registry/src/main/java/org/apache/hadoop/registry/server/services/RegistryAdminService.java>:191: warning: no description for @throws
[WARNING] * @throws Exception
[WARNING] ^
[WARNING] <https://builds.apache.org/job/Hadoop-Yarn-trunk-Java8/ws/source/hadoop-yarn-project/hadoop-yarn/hadoop-yarn-registry/src/main/java/org/apache/hadoop/registry/server/services/RegistryAdminService.java>:208: warning: no description for @throws
[WARNING] * @throws Exception
[WARNING] ^
[WARNING] <https://builds.apache.org/job/Hadoop-Yarn-trunk-Java8/ws/source/hadoop-yarn-project/hadoop-yarn/hadoop-yarn-registry/src/main/java/org/apache/hadoop/registry/client/api/RegistryOperations.java>:118: warning: no description for @throws
[WARNING] * @throws IOException
[WARNING] ^
[WARNING] <https://builds.apache.org/job/Hadoop-Yarn-trunk-Java8/ws/source/hadoop-yarn-project/hadoop-yarn/hadoop-yarn-registry/src/main/java/org/apache/hadoop/registry/client/api/RegistryOperations.java>:128: warning: no description for @throws
[WARNING] * @throws PathNotFoundException
[WARNING] ^
[WARNING] <https://builds.apache.org/job/Hadoop-Yarn-trunk-Java8/ws/source/hadoop-yarn-project/hadoop-yarn/hadoop-yarn-registry/src/main/java/org/apache/hadoop/registry/client/api/RegistryOperations.java>:129: warning: no description for @throws
[WARNING] * @throws InvalidPathnameException
[WARNING] ^
[WARNING] <https://builds.apache.org/job/Hadoop-Yarn-trunk-Java8/ws/source/hadoop-yarn-project/hadoop-yarn/hadoop-yarn-registry/src/main/java/org/apache/hadoop/registry/client/api/RegistryOperations.java>:130: warning: no description for @throws
[WARNING] * @throws IOException
[WARNING] ^
[WARNING] <https://builds.apache.org/job/Hadoop-Yarn-trunk-Java8/ws/source/hadoop-yarn-project/hadoop-yarn/hadoop-yarn-registry/src/main/java/org/apache/hadoop/registry/client/impl/zk/CuratorService.java>:136: warning: no description for @throws
[WARNING] * @throws Exception
[WARNING] ^
[WARNING] <https://builds.apache.org/job/Hadoop-Yarn-trunk-Java8/ws/source/hadoop-yarn-project/hadoop-yarn/hadoop-yarn-registry/src/main/java/org/apache/hadoop/registry/client/impl/zk/CuratorService.java>:158: warning: no description for @throws
[WARNING] * @throws Exception
[WARNING] ^
[WARNING] <https://builds.apache.org/job/Hadoop-Yarn-trunk-Java8/ws/source/hadoop-yarn-project/hadoop-yarn/hadoop-yarn-registry/src/main/java/org/apache/hadoop/registry/client/impl/zk/CuratorService.java>:295: warning: no @throws for java.io.IOException
[WARNING] protected String createFullPath(String path) throws IOException {
[WARNING] ^
[WARNING] <https://builds.apache.org/job/Hadoop-Yarn-trunk-Java8/ws/source/hadoop-yarn-project/hadoop-yarn/hadoop-yarn-registry/src/main/java/org/apache/hadoop/registry/client/impl/zk/CuratorService.java>:370: warning: no @param for acls
[WARNING] protected IOException operationFailure(String path,
[WARNING] ^
[WARNING] <https://builds.apache.org/job/Hadoop-Yarn-trunk-Java8/ws/source/hadoop-yarn-project/hadoop-yarn/hadoop-yarn-registry/src/main/java/org/apache/hadoop/registry/client/impl/zk/CuratorService.java>:424: warning: no description for @throws
[WARNING] * @throws IOException
[WARNING] ^
[WARNING] <https://builds.apache.org/job/Hadoop-Yarn-trunk-Java8/ws/source/hadoop-yarn-project/hadoop-yarn/hadoop-yarn-registry/src/main/java/org/apache/hadoop/registry/client/impl/zk/CuratorService.java>:427: warning: no @param for mode
[WARNING] public boolean maybeCreate(String path,
[WARNING] ^
[WARNING] <https://builds.apache.org/job/Hadoop-Yarn-trunk-Java8/ws/source/hadoop-yarn-project/hadoop-yarn/hadoop-yarn-registry/src/main/java/org/apache/hadoop/registry/client/impl/zk/CuratorService.java>:463: warning: no description for @throws
[WARNING] * @throws IOException
[WARNING] ^
[WARNING] <https://builds.apache.org/job/Hadoop-Yarn-trunk-Java8/ws/source/hadoop-yarn-project/hadoop-yarn/hadoop-yarn-registry/src/main/java/org/apache/hadoop/registry/client/impl/zk/CuratorService.java>:509: warning: no description for @throws
[WARNING] * @throws IOException
[WARNING] ^
[WARNING] <https://builds.apache.org/job/Hadoop-Yarn-trunk-Java8/ws/source/hadoop-yarn-project/hadoop-yarn/hadoop-yarn-registry/src/main/java/org/apache/hadoop/registry/client/impl/zk/CuratorService.java>:511: warning: no @return
[WARNING] public String zkPathMustExist(String path) throws IOException {
[WARNING] ^
[WARNING] <https://builds.apache.org/job/Hadoop-Yarn-trunk-Java8/ws/source/hadoop-yarn-project/hadoop-yarn/hadoop-yarn-registry/src/main/java/org/apache/hadoop/registry/client/impl/zk/CuratorService.java>:524: warning: no @return
[WARNING] public boolean zkMkPath(String path,
[WARNING] ^
[WARNING] <https://builds.apache.org/job/Hadoop-Yarn-trunk-Java8/ws/source/hadoop-yarn-project/hadoop-yarn/hadoop-yarn-registry/src/main/java/org/apache/hadoop/registry/client/impl/zk/CuratorService.java>:580: warning: no description for @param
[WARNING] * @param acls
[WARNING] ^
[WARNING] <https://builds.apache.org/job/Hadoop-Yarn-trunk-Java8/ws/source/hadoop-yarn-project/hadoop-yarn/hadoop-yarn-registry/src/main/java/org/apache/hadoop/registry/client/impl/zk/CuratorService.java>:581: warning: no description for @throws
[WARNING] * @throws IOException
[WARNING] ^
[WARNING] <https://builds.apache.org/job/Hadoop-Yarn-trunk-Java8/ws/source/hadoop-yarn-project/hadoop-yarn/hadoop-yarn-registry/src/main/java/org/apache/hadoop/registry/client/impl/zk/CuratorService.java>:583: warning: no @param for mode
[WARNING] public void zkCreate(String path,
[WARNING] ^
[WARNING] <https://builds.apache.org/job/Hadoop-Yarn-trunk-Java8/ws/source/hadoop-yarn-project/hadoop-yarn/hadoop-yarn-registry/src/main/java/org/apache/hadoop/registry/client/impl/zk/CuratorService.java>:606: warning: no description for @throws
[WARNING] * @throws IOException
[WARNING] ^
[WARNING] <https://builds.apache.org/job/Hadoop-Yarn-trunk-Java8/ws/source/hadoop-yarn-project/hadoop-yarn/hadoop-yarn-registry/src/main/java/org/apache/hadoop/registry/client/impl/zk/CuratorService.java>:628: warning: no description for @throws
[WARNING] * @throws IOException
[WARNING] ^
[WARNING] <https://builds.apache.org/job/Hadoop-Yarn-trunk-Java8/ws/source/hadoop-yarn-project/hadoop-yarn/hadoop-yarn-registry/src/main/java/org/apache/hadoop/registry/client/impl/zk/CuratorService.java>:631: warning: no @param for mode
[WARNING] public boolean zkSet(String path,
[WARNING] ^
[WARNING] <https://builds.apache.org/job/Hadoop-Yarn-trunk-Java8/ws/source/hadoop-yarn-project/hadoop-yarn/hadoop-yarn-registry/src/main/java/org/apache/hadoop/registry/client/impl/zk/CuratorService.java>:688: warning: no description for @throws
[WARNING] * @throws IOException
[WARNING] ^
[WARNING] <https://builds.apache.org/job/Hadoop-Yarn-trunk-Java8/ws/source/hadoop-yarn-project/hadoop-yarn/hadoop-yarn-registry/src/main/java/org/apache/hadoop/registry/client/impl/zk/CuratorService.java>:741: warning: no @return
[WARNING] public boolean addWriteAccessor(String id, String pass) throws IOException {
[WARNING] ^
[WARNING] <https://builds.apache.org/job/Hadoop-Yarn-trunk-Java8/ws/source/hadoop-yarn-project/hadoop-yarn/hadoop-yarn-registry/src/main/java/org/apache/hadoop/registry/server/services/MicroZookeeperService.java>:130: warning: no description for @throws
[WARNING] * @throws Exception
[WARNING] ^
[WARNING] <https://builds.apache.org/job/Hadoop-Yarn-trunk-Java8/ws/source/hadoop-yarn-project/hadoop-yarn/hadoop-yarn-registry/src/main/java/org/apache/hadoop/registry/server/services/MicroZookeeperService.java>:196: warning: no @throws for java.io.IOException
[WARNING] public boolean setupSecurity() throws IOException {
[WARNING] ^
[WARNING] <https://builds.apache.org/job/Hadoop-Yarn-trunk-Java8/ws/source/hadoop-yarn-project/hadoop-yarn/hadoop-yarn-registry/src/main/java/org/apache/hadoop/registry/server/services/MicroZookeeperService.java>:223: warning: no description for @throws
[WARNING] * @throws Exception
[WARNING] ^
[WARNING] <https://builds.apache.org/job/Hadoop-Yarn-trunk-Java8/ws/source/hadoop-yarn-project/hadoop-yarn/hadoop-yarn-registry/src/main/java/org/apache/hadoop/registry/server/services/MicroZookeeperService.java>:263: warning: no description for @throws
[WARNING] * @throws Exception
[WARNING] ^
[WARNING] <https://builds.apache.org/job/Hadoop-Yarn-trunk-Java8/ws/source/hadoop-yarn-project/hadoop-yarn/hadoop-yarn-registry/src/main/java/org/apache/hadoop/registry/cli/RegistryCli.java>:124: warning: no description for @throws
[WARNING] * @throws IOException
[WARNING] ^
[WARNING] <https://builds.apache.org/job/Hadoop-Yarn-trunk-Java8/ws/source/hadoop-yarn-project/hadoop-yarn/hadoop-yarn-registry/src/main/java/org/apache/hadoop/registry/client/binding/JsonSerDeser.java>:101: warning: no @throws for org.codehaus.jackson.JsonParseException
[WARNING] public synchronized T fromJson(String json)
[WARNING] ^
[WARNING] <https://builds.apache.org/job/Hadoop-Yarn-trunk-Java8/ws/source/hadoop-yarn-project/hadoop-yarn/hadoop-yarn-registry/src/main/java/org/apache/hadoop/registry/client/binding/JsonSerDeser.java>:119: warning: no @throws for org.codehaus.jackson.JsonParseException
[WARNING] public synchronized T fromFile(File jsonFile)
[WARNING] ^
[WARNING] <https://builds.apache.org/job/Hadoop-Yarn-trunk-Java8/ws/source/hadoop-yarn-project/hadoop-yarn/hadoop-yarn-registry/src/main/java/org/apache/hadoop/registry/client/binding/JsonSerDeser.java>:137: warning: no @throws for org.codehaus.jackson.JsonParseException
[WARNING] public synchronized T fromResource(String resource)
[WARNING] ^
[WARNING] <https://builds.apache.org/job/Hadoop-Yarn-trunk-Java8/ws/source/hadoop-yarn-project/hadoop-yarn/hadoop-yarn-registry/src/main/java/org/apache/hadoop/registry/client/binding/JsonSerDeser.java>:195: warning: no @param for instance
[WARNING] public void save(FileSystem fs, Path path, T instance,
[WARNING] ^
[WARNING] <https://builds.apache.org/job/Hadoop-Yarn-trunk-Java8/ws/source/hadoop-yarn-project/hadoop-yarn/hadoop-yarn-registry/src/main/java/org/apache/hadoop/registry/client/binding/JsonSerDeser.java>:221: warning: no description for @throws
[WARNING] * @throws IOException
[WARNING] ^
[WARNING] <https://builds.apache.org/job/Hadoop-Yarn-trunk-Java8/ws/source/hadoop-yarn-project/hadoop-yarn/hadoop-yarn-registry/src/main/java/org/apache/hadoop/registry/client/binding/JsonSerDeser.java>:236: warning: no @return
[WARNING] public T fromBytes(String path, byte[] bytes) throws IOException,
[WARNING] ^
[WARNING] <https://builds.apache.org/job/Hadoop-Yarn-trunk-Java8/ws/source/hadoop-yarn-project/hadoop-yarn/hadoop-yarn-registry/src/main/java/org/apache/hadoop/registry/client/binding/JsonSerDeser.java>:287: warning: no @throws for org.codehaus.jackson.JsonGenerationException
[WARNING] public synchronized String toJson(T instance) throws IOException,
[WARNING] ^
[WARNING] <https://builds.apache.org/job/Hadoop-Yarn-trunk-Java8/ws/source/hadoop-yarn-project/hadoop-yarn/hadoop-yarn-registry/src/main/java/org/apache/hadoop/registry/client/binding/RegistryPathUtils.java>:91: warning: no @param for base
[WARNING] public static String createFullPath(String base, String path) throws
[WARNING] ^
[WARNING] <https://builds.apache.org/job/Hadoop-Yarn-trunk-Java8/ws/source/hadoop-yarn-project/hadoop-yarn/hadoop-yarn-registry/src/main/java/org/apache/hadoop/registry/client/binding/RegistryUtils.java>:170: warning: no description for @throws
[WARNING] * @throws IOException
[WARNING] ^
[WARNING] <https://builds.apache.org/job/Hadoop-Yarn-trunk-Java8/ws/source/hadoop-yarn-project/hadoop-yarn/hadoop-yarn-registry/src/main/java/org/apache/hadoop/registry/client/binding/RegistryUtils.java>:198: warning: no @param for registryOperations
[WARNING] public static Map<String, RegistryPathStatus> statChildren(
[WARNING] ^
[WARNING] <https://builds.apache.org/job/Hadoop-Yarn-trunk-Java8/ws/source/hadoop-yarn-project/hadoop-yarn/hadoop-yarn-registry/src/main/java/org/apache/hadoop/registry/client/binding/RegistryUtils.java>:350: warning: no @param for stats
[WARNING] public static Map<String, ServiceRecord> extractServiceRecords(
[WARNING] ^
[WARNING] <https://builds.apache.org/job/Hadoop-Yarn-trunk-Java8/ws/source/hadoop-yarn-project/hadoop-yarn/hadoop-yarn-registry/src/main/java/org/apache/hadoop/registry/client/types/Endpoint.java>:229: warning: no description for @throws
[WARNING] * @throws CloneNotSupportedException
[WARNING] ^
[WARNING] <https://builds.apache.org/job/Hadoop-Yarn-trunk-Java8/ws/source/hadoop-yarn-project/hadoop-yarn/hadoop-yarn-registry/src/main/java/org/apache/hadoop/registry/client/types/ServiceRecord.java>:241: warning: no description for @throws
[WARNING] * @throws CloneNotSupportedException
[WARNING] ^
[WARNING] <https://builds.apache.org/job/Hadoop-Yarn-trunk-Java8/ws/source/hadoop-yarn-project/hadoop-yarn/hadoop-yarn-registry/src/main/java/org/apache/hadoop/registry/client/impl/zk/RegistrySecurity.java>:187: warning: no description for @throws
[WARNING] * @throws Exception
[WARNING] ^
[WARNING] <https://builds.apache.org/job/Hadoop-Yarn-trunk-Java8/ws/source/hadoop-yarn-project/hadoop-yarn/hadoop-yarn-registry/src/main/java/org/apache/hadoop/registry/client/impl/zk/RegistrySecurity.java>:320: warning: no @return
[WARNING] public boolean addDigestACL(ACL acl) {
[WARNING] ^
[WARNING] <https://builds.apache.org/job/Hadoop-Yarn-trunk-Java8/ws/source/hadoop-yarn-project/hadoop-yarn/hadoop-yarn-registry/src/main/java/org/apache/hadoop/registry/client/impl/zk/RegistrySecurity.java>:378: warning: no description for @throws
[WARNING] * @throws IOException
[WARNING] ^
[WARNING] <https://builds.apache.org/job/Hadoop-Yarn-trunk-Java8/ws/source/hadoop-yarn-project/hadoop-yarn/hadoop-yarn-registry/src/main/java/org/apache/hadoop/registry/client/impl/zk/RegistrySecurity.java>:444: warning: no @throws for java.io.IOException
[WARNING] public String digest(String idPasswordPair) throws IOException {
[WARNING] ^
[WARNING] <https://builds.apache.org/job/Hadoop-Yarn-trunk-Java8/ws/source/hadoop-yarn-project/hadoop-yarn/hadoop-yarn-registry/src/main/java/org/apache/hadoop/registry/client/impl/zk/RegistrySecurity.java>:462: warning: no description for @throws
[WARNING] * @throws IOException
[WARNING] ^
[WARNING] <https://builds.apache.org/job/Hadoop-Yarn-trunk-Java8/ws/source/hadoop-yarn-project/hadoop-yarn/hadoop-yarn-registry/src/main/java/org/apache/hadoop/registry/client/impl/zk/RegistrySecurity.java>:482: warning: no description for @throws
[WARNING] * @throws IOException
[WARNING] ^
[WARNING] <https://builds.apache.org/job/Hadoop-Yarn-trunk-Java8/ws/source/hadoop-yarn-project/hadoop-yarn/hadoop-yarn-registry/src/main/java/org/apache/hadoop/registry/client/impl/zk/RegistrySecurity.java>:550: warning: no description for @throws
[WARNING] * @throws IOException
[WARNING] ^
[WARNING] <https://builds.apache.org/job/Hadoop-Yarn-trunk-Java8/ws/source/hadoop-yarn-project/hadoop-yarn/hadoop-yarn-registry/src/main/java/org/apache/hadoop/registry/client/impl/zk/RegistrySecurity.java>:923: warning: no @param for perms
[WARNING] public ACL createACLForUser(UserGroupInformation ugi, int perms) {
[WARNING] ^
[INFO] Building jar: <https://builds.apache.org/job/Hadoop-Yarn-trunk-Java8/ws/source/hadoop-yarn-project/hadoop-yarn/hadoop-yarn-registry/target/hadoop-yarn-registry-3.0.0-alpha1-SNAPSHOT-javadoc.jar>
[INFO] 
[INFO] --- maven-enforcer-plugin:1.3.1:enforce (depcheck) @ hadoop-yarn-registry ---
[INFO] 
[INFO] --- maven-checkstyle-plugin:2.15:checkstyle (default-cli) @ hadoop-yarn-registry ---
[INFO] There are 509 errors reported by Checkstyle 6.6 with checkstyle/checkstyle.xml ruleset.
[WARNING] Unable to locate Source XRef to link to - DISABLED
[INFO] 
[INFO] --- findbugs-maven-plugin:3.0.0:findbugs (default-cli) @ hadoop-yarn-registry ---
[INFO] Fork Value is true
[INFO] Done FindBugs Analysis....
[INFO]                                                                         
[INFO] ------------------------------------------------------------------------
[INFO] Skipping Apache Hadoop YARN Project
[INFO] This project has been banned from the build due to previous failures.
[INFO] ------------------------------------------------------------------------
[INFO] ------------------------------------------------------------------------
[INFO] Reactor Summary:
[INFO] 
[INFO] Apache Hadoop YARN ................................. SUCCESS [  2.723 s]
[INFO] Apache Hadoop YARN API ............................. SUCCESS [01:43 min]
[INFO] Apache Hadoop YARN Common .......................... SUCCESS [02:55 min]
[INFO] Apache Hadoop YARN Server .......................... SUCCESS [  0.060 s]
[INFO] Apache Hadoop YARN Server Common ................... SUCCESS [ 37.784 s]
[INFO] Apache Hadoop YARN NodeManager ..................... SUCCESS [11:55 min]
[INFO] Apache Hadoop YARN Web Proxy ....................... SUCCESS [ 18.584 s]
[INFO] Apache Hadoop YARN ApplicationHistoryService ....... SUCCESS [03:47 min]
[INFO] Apache Hadoop YARN ResourceManager ................. FAILURE [33:50 min]
[INFO] Apache Hadoop YARN Server Tests .................... SKIPPED
[INFO] Apache Hadoop YARN Client .......................... SKIPPED
[INFO] Apache Hadoop YARN SharedCacheManager .............. SKIPPED
[INFO] Apache Hadoop YARN Timeline Plugin Storage ......... SKIPPED
[INFO] Apache Hadoop YARN Applications .................... SUCCESS [  0.039 s]
[INFO] Apache Hadoop YARN DistributedShell ................ SKIPPED
[INFO] Apache Hadoop YARN Unmanaged Am Launcher ........... SKIPPED
[INFO] Apache Hadoop YARN Site ............................ SUCCESS [  0.039 s]
[INFO] Apache Hadoop YARN Registry ........................ SUCCESS [01:49 min]
[INFO] Apache Hadoop YARN Project ......................... SKIPPED
[INFO] ------------------------------------------------------------------------
[INFO] BUILD FAILURE
[INFO] ------------------------------------------------------------------------
[INFO] Total time: 57:03 min
[INFO] Finished at: 2016-05-25T06:34:31+00:00
[INFO] Final Memory: 128M/4743M
[INFO] ------------------------------------------------------------------------
[WARNING] The requested profile "docs" could not be activated because it does not exist.
[WARNING] The requested profile "parallel-tests" could not be activated because it does not exist.
[ERROR] Failed to execute goal org.apache.maven.plugins:maven-surefire-plugin:2.17:test (default-test) on project hadoop-yarn-server-resourcemanager: There are test failures.
[ERROR] 
[ERROR] Please refer to <https://builds.apache.org/job/Hadoop-Yarn-trunk-Java8/ws/source/hadoop-yarn-project/hadoop-yarn/hadoop-yarn-server/hadoop-yarn-server-resourcemanager/target/surefire-reports> for the individual test results.
[ERROR] -> [Help 1]
[ERROR] 
[ERROR] To see the full stack trace of the errors, re-run Maven with the -e switch.
[ERROR] Re-run Maven using the -X switch to enable full debug logging.
[ERROR] 
[ERROR] For more information about the errors and possible solutions, please read the following articles:
[ERROR] [Help 1] http://cwiki.apache.org/confluence/display/MAVEN/MojoFailureException
[ERROR] 
[ERROR] After correcting the problems, you can resume the build with the command
[ERROR]   mvn <goals> -rf :hadoop-yarn-server-resourcemanager
Build step 'Execute shell' marked build as failure
Archiving artifacts
Setting LATEST1_8_HOME=/home/jenkins/jenkins-slave/tools/hudson.model.JDK/latest1.8
Setting MAVEN_3_3_3_HOME=/home/jenkins/jenkins-slave/tools/hudson.tasks.Maven_MavenInstallation/maven-3.3.3
Recording test results
Setting LATEST1_8_HOME=/home/jenkins/jenkins-slave/tools/hudson.model.JDK/latest1.8
Setting MAVEN_3_3_3_HOME=/home/jenkins/jenkins-slave/tools/hudson.tasks.Maven_MavenInstallation/maven-3.3.3
Setting LATEST1_8_HOME=/home/jenkins/jenkins-slave/tools/hudson.model.JDK/latest1.8
Setting MAVEN_3_3_3_HOME=/home/jenkins/jenkins-slave/tools/hudson.tasks.Maven_MavenInstallation/maven-3.3.3

---------------------------------------------------------------------
To unsubscribe, e-mail: yarn-dev-unsubscribe@hadoop.apache.org
For additional commands, e-mail: yarn-dev-help@hadoop.apache.org


Hadoop-Yarn-trunk-Java8 - Build # 1493 - Still Failing

Posted by Apache Jenkins Server <je...@builds.apache.org>.
See https://builds.apache.org/job/Hadoop-Yarn-trunk-Java8/1493/

###################################################################################
########################## LAST 60 LINES OF THE CONSOLE ###########################
[...truncated 51589 lines...]
[INFO] Reactor Summary:
[INFO] 
[INFO] Apache Hadoop YARN ................................. SUCCESS [  2.723 s]
[INFO] Apache Hadoop YARN API ............................. SUCCESS [01:43 min]
[INFO] Apache Hadoop YARN Common .......................... SUCCESS [02:55 min]
[INFO] Apache Hadoop YARN Server .......................... SUCCESS [  0.060 s]
[INFO] Apache Hadoop YARN Server Common ................... SUCCESS [ 37.784 s]
[INFO] Apache Hadoop YARN NodeManager ..................... SUCCESS [11:55 min]
[INFO] Apache Hadoop YARN Web Proxy ....................... SUCCESS [ 18.584 s]
[INFO] Apache Hadoop YARN ApplicationHistoryService ....... SUCCESS [03:47 min]
[INFO] Apache Hadoop YARN ResourceManager ................. FAILURE [33:50 min]
[INFO] Apache Hadoop YARN Server Tests .................... SKIPPED
[INFO] Apache Hadoop YARN Client .......................... SKIPPED
[INFO] Apache Hadoop YARN SharedCacheManager .............. SKIPPED
[INFO] Apache Hadoop YARN Timeline Plugin Storage ......... SKIPPED
[INFO] Apache Hadoop YARN Applications .................... SUCCESS [  0.039 s]
[INFO] Apache Hadoop YARN DistributedShell ................ SKIPPED
[INFO] Apache Hadoop YARN Unmanaged Am Launcher ........... SKIPPED
[INFO] Apache Hadoop YARN Site ............................ SUCCESS [  0.039 s]
[INFO] Apache Hadoop YARN Registry ........................ SUCCESS [01:49 min]
[INFO] Apache Hadoop YARN Project ......................... SKIPPED
[INFO] ------------------------------------------------------------------------
[INFO] BUILD FAILURE
[INFO] ------------------------------------------------------------------------
[INFO] Total time: 57:03 min
[INFO] Finished at: 2016-05-25T06:34:31+00:00
[INFO] Final Memory: 128M/4743M
[INFO] ------------------------------------------------------------------------
[WARNING] The requested profile "docs" could not be activated because it does not exist.
[WARNING] The requested profile "parallel-tests" could not be activated because it does not exist.
[ERROR] Failed to execute goal org.apache.maven.plugins:maven-surefire-plugin:2.17:test (default-test) on project hadoop-yarn-server-resourcemanager: There are test failures.
[ERROR] 
[ERROR] Please refer to /home/jenkins/jenkins-slave/workspace/Hadoop-Yarn-trunk-Java8/source/hadoop-yarn-project/hadoop-yarn/hadoop-yarn-server/hadoop-yarn-server-resourcemanager/target/surefire-reports for the individual test results.
[ERROR] -> [Help 1]
[ERROR] 
[ERROR] To see the full stack trace of the errors, re-run Maven with the -e switch.
[ERROR] Re-run Maven using the -X switch to enable full debug logging.
[ERROR] 
[ERROR] For more information about the errors and possible solutions, please read the following articles:
[ERROR] [Help 1] http://cwiki.apache.org/confluence/display/MAVEN/MojoFailureException
[ERROR] 
[ERROR] After correcting the problems, you can resume the build with the command
[ERROR]   mvn <goals> -rf :hadoop-yarn-server-resourcemanager
Build step 'Execute shell' marked build as failure
Archiving artifacts
Setting LATEST1_8_HOME=/home/jenkins/jenkins-slave/tools/hudson.model.JDK/latest1.8
Setting MAVEN_3_3_3_HOME=/home/jenkins/jenkins-slave/tools/hudson.tasks.Maven_MavenInstallation/maven-3.3.3
Recording test results
Setting LATEST1_8_HOME=/home/jenkins/jenkins-slave/tools/hudson.model.JDK/latest1.8
Setting MAVEN_3_3_3_HOME=/home/jenkins/jenkins-slave/tools/hudson.tasks.Maven_MavenInstallation/maven-3.3.3
Setting LATEST1_8_HOME=/home/jenkins/jenkins-slave/tools/hudson.model.JDK/latest1.8
Setting MAVEN_3_3_3_HOME=/home/jenkins/jenkins-slave/tools/hudson.tasks.Maven_MavenInstallation/maven-3.3.3
Sending e-mails to: yarn-dev@hadoop.apache.org
Email was triggered for: Failure - Any
Sending email for trigger: Failure - Any
Setting LATEST1_8_HOME=/home/jenkins/jenkins-slave/tools/hudson.model.JDK/latest1.8
Setting MAVEN_3_3_3_HOME=/home/jenkins/jenkins-slave/tools/hudson.tasks.Maven_MavenInstallation/maven-3.3.3
Setting LATEST1_8_HOME=/home/jenkins/jenkins-slave/tools/hudson.model.JDK/latest1.8
Setting MAVEN_3_3_3_HOME=/home/jenkins/jenkins-slave/tools/hudson.tasks.Maven_MavenInstallation/maven-3.3.3



###################################################################################
############################## FAILED TESTS (if any) ##############################
1 tests failed.
FAILED:  org.apache.hadoop.yarn.server.resourcemanager.TestRMRestart.testQueueMetricsOnRMRestart

Error Message:
expected:<2> but was:<1>

Stack Trace:
java.lang.AssertionError: expected:<2> but was:<1>
	at org.junit.Assert.fail(Assert.java:88)
	at org.junit.Assert.failNotEquals(Assert.java:743)
	at org.junit.Assert.assertEquals(Assert.java:118)
	at org.junit.Assert.assertEquals(Assert.java:555)
	at org.junit.Assert.assertEquals(Assert.java:542)
	at org.apache.hadoop.yarn.server.resourcemanager.TestRMRestart.assertQueueMetrics(TestRMRestart.java:1874)
	at org.apache.hadoop.yarn.server.resourcemanager.TestRMRestart.testQueueMetricsOnRMRestart(TestRMRestart.java:1849)




Build failed in Jenkins: Hadoop-Yarn-trunk-Java8 #1492

Posted by Apache Jenkins Server <je...@builds.apache.org>.
See <https://builds.apache.org/job/Hadoop-Yarn-trunk-Java8/1492/changes>

Changes:

[jianhe] MAPREDUCE-6703. Add flag to allow MapReduce AM to request for

------------------------------------------
[...truncated 51470 lines...]
Generating <https://builds.apache.org/job/Hadoop-Yarn-trunk-Java8/ws/source/hadoop-yarn-project/hadoop-yarn/hadoop-yarn-registry/target/org/apache/hadoop/registry/client/impl/zk/class-use/RegistrySecurity.AclListInfo.html...>
Generating <https://builds.apache.org/job/Hadoop-Yarn-trunk-Java8/ws/source/hadoop-yarn-project/hadoop-yarn/hadoop-yarn-registry/target/org/apache/hadoop/registry/cli/package-use.html...>
Generating <https://builds.apache.org/job/Hadoop-Yarn-trunk-Java8/ws/source/hadoop-yarn-project/hadoop-yarn/hadoop-yarn-registry/target/org/apache/hadoop/registry/client/api/package-use.html...>
Generating <https://builds.apache.org/job/Hadoop-Yarn-trunk-Java8/ws/source/hadoop-yarn-project/hadoop-yarn/hadoop-yarn-registry/target/org/apache/hadoop/registry/client/binding/package-use.html...>
Generating <https://builds.apache.org/job/Hadoop-Yarn-trunk-Java8/ws/source/hadoop-yarn-project/hadoop-yarn/hadoop-yarn-registry/target/org/apache/hadoop/registry/client/exceptions/package-use.html...>
Generating <https://builds.apache.org/job/Hadoop-Yarn-trunk-Java8/ws/source/hadoop-yarn-project/hadoop-yarn/hadoop-yarn-registry/target/org/apache/hadoop/registry/client/impl/package-use.html...>
Generating <https://builds.apache.org/job/Hadoop-Yarn-trunk-Java8/ws/source/hadoop-yarn-project/hadoop-yarn/hadoop-yarn-registry/target/org/apache/hadoop/registry/client/impl/zk/package-use.html...>
Generating <https://builds.apache.org/job/Hadoop-Yarn-trunk-Java8/ws/source/hadoop-yarn-project/hadoop-yarn/hadoop-yarn-registry/target/org/apache/hadoop/registry/client/types/package-use.html...>
Generating <https://builds.apache.org/job/Hadoop-Yarn-trunk-Java8/ws/source/hadoop-yarn-project/hadoop-yarn/hadoop-yarn-registry/target/org/apache/hadoop/registry/client/types/yarn/package-use.html...>
Generating <https://builds.apache.org/job/Hadoop-Yarn-trunk-Java8/ws/source/hadoop-yarn-project/hadoop-yarn/hadoop-yarn-registry/target/org/apache/hadoop/registry/server/package-use.html...>
Generating <https://builds.apache.org/job/Hadoop-Yarn-trunk-Java8/ws/source/hadoop-yarn-project/hadoop-yarn/hadoop-yarn-registry/target/org/apache/hadoop/registry/server/integration/package-use.html...>
Generating <https://builds.apache.org/job/Hadoop-Yarn-trunk-Java8/ws/source/hadoop-yarn-project/hadoop-yarn/hadoop-yarn-registry/target/org/apache/hadoop/registry/server/services/package-use.html...>
Building index for all the packages and classes...
Generating <https://builds.apache.org/job/Hadoop-Yarn-trunk-Java8/ws/source/hadoop-yarn-project/hadoop-yarn/hadoop-yarn-registry/target/overview-tree.html...>
Generating <https://builds.apache.org/job/Hadoop-Yarn-trunk-Java8/ws/source/hadoop-yarn-project/hadoop-yarn/hadoop-yarn-registry/target/index-all.html...>
Generating <https://builds.apache.org/job/Hadoop-Yarn-trunk-Java8/ws/source/hadoop-yarn-project/hadoop-yarn/hadoop-yarn-registry/target/deprecated-list.html...>
Building index for all classes...
Generating <https://builds.apache.org/job/Hadoop-Yarn-trunk-Java8/ws/source/hadoop-yarn-project/hadoop-yarn/hadoop-yarn-registry/target/allclasses-frame.html...>
Generating <https://builds.apache.org/job/Hadoop-Yarn-trunk-Java8/ws/source/hadoop-yarn-project/hadoop-yarn/hadoop-yarn-registry/target/allclasses-noframe.html...>
Generating <https://builds.apache.org/job/Hadoop-Yarn-trunk-Java8/ws/source/hadoop-yarn-project/hadoop-yarn/hadoop-yarn-registry/target/index.html...>
Generating <https://builds.apache.org/job/Hadoop-Yarn-trunk-Java8/ws/source/hadoop-yarn-project/hadoop-yarn/hadoop-yarn-registry/target/overview-summary.html...>
Generating <https://builds.apache.org/job/Hadoop-Yarn-trunk-Java8/ws/source/hadoop-yarn-project/hadoop-yarn/hadoop-yarn-registry/target/help-doc.html...>
52 warnings
[WARNING] Javadoc Warnings
[WARNING] <https://builds.apache.org/job/Hadoop-Yarn-trunk-Java8/ws/source/hadoop-yarn-project/hadoop-yarn/hadoop-yarn-registry/src/main/java/org/apache/hadoop/registry/server/integration/RMRegistryOperationsService.java>:73: warning: no description for @throws
[WARNING] * @throws Exception
[WARNING] ^
[WARNING] <https://builds.apache.org/job/Hadoop-Yarn-trunk-Java8/ws/source/hadoop-yarn-project/hadoop-yarn/hadoop-yarn-registry/src/main/java/org/apache/hadoop/registry/server/services/RegistryAdminService.java>:174: warning: no description for @throws
[WARNING] * @throws IOException
[WARNING] ^
[WARNING] <https://builds.apache.org/job/Hadoop-Yarn-trunk-Java8/ws/source/hadoop-yarn-project/hadoop-yarn/hadoop-yarn-registry/src/main/java/org/apache/hadoop/registry/server/services/RegistryAdminService.java>:191: warning: no description for @throws
[WARNING] * @throws Exception
[WARNING] ^
[WARNING] <https://builds.apache.org/job/Hadoop-Yarn-trunk-Java8/ws/source/hadoop-yarn-project/hadoop-yarn/hadoop-yarn-registry/src/main/java/org/apache/hadoop/registry/server/services/RegistryAdminService.java>:208: warning: no description for @throws
[WARNING] * @throws Exception
[WARNING] ^
[WARNING] <https://builds.apache.org/job/Hadoop-Yarn-trunk-Java8/ws/source/hadoop-yarn-project/hadoop-yarn/hadoop-yarn-registry/src/main/java/org/apache/hadoop/registry/client/api/RegistryOperations.java>:118: warning: no description for @throws
[WARNING] * @throws IOException
[WARNING] ^
[WARNING] <https://builds.apache.org/job/Hadoop-Yarn-trunk-Java8/ws/source/hadoop-yarn-project/hadoop-yarn/hadoop-yarn-registry/src/main/java/org/apache/hadoop/registry/client/api/RegistryOperations.java>:128: warning: no description for @throws
[WARNING] * @throws PathNotFoundException
[WARNING] ^
[WARNING] <https://builds.apache.org/job/Hadoop-Yarn-trunk-Java8/ws/source/hadoop-yarn-project/hadoop-yarn/hadoop-yarn-registry/src/main/java/org/apache/hadoop/registry/client/api/RegistryOperations.java>:129: warning: no description for @throws
[WARNING] * @throws InvalidPathnameException
[WARNING] ^
[WARNING] <https://builds.apache.org/job/Hadoop-Yarn-trunk-Java8/ws/source/hadoop-yarn-project/hadoop-yarn/hadoop-yarn-registry/src/main/java/org/apache/hadoop/registry/client/api/RegistryOperations.java>:130: warning: no description for @throws
[WARNING] * @throws IOException
[WARNING] ^
[WARNING] <https://builds.apache.org/job/Hadoop-Yarn-trunk-Java8/ws/source/hadoop-yarn-project/hadoop-yarn/hadoop-yarn-registry/src/main/java/org/apache/hadoop/registry/client/impl/zk/CuratorService.java>:136: warning: no description for @throws
[WARNING] * @throws Exception
[WARNING] ^
[WARNING] <https://builds.apache.org/job/Hadoop-Yarn-trunk-Java8/ws/source/hadoop-yarn-project/hadoop-yarn/hadoop-yarn-registry/src/main/java/org/apache/hadoop/registry/client/impl/zk/CuratorService.java>:158: warning: no description for @throws
[WARNING] * @throws Exception
[WARNING] ^
[WARNING] <https://builds.apache.org/job/Hadoop-Yarn-trunk-Java8/ws/source/hadoop-yarn-project/hadoop-yarn/hadoop-yarn-registry/src/main/java/org/apache/hadoop/registry/client/impl/zk/CuratorService.java>:295: warning: no @throws for java.io.IOException
[WARNING] protected String createFullPath(String path) throws IOException {
[WARNING] ^
[WARNING] <https://builds.apache.org/job/Hadoop-Yarn-trunk-Java8/ws/source/hadoop-yarn-project/hadoop-yarn/hadoop-yarn-registry/src/main/java/org/apache/hadoop/registry/client/impl/zk/CuratorService.java>:370: warning: no @param for acls
[WARNING] protected IOException operationFailure(String path,
[WARNING] ^
[WARNING] <https://builds.apache.org/job/Hadoop-Yarn-trunk-Java8/ws/source/hadoop-yarn-project/hadoop-yarn/hadoop-yarn-registry/src/main/java/org/apache/hadoop/registry/client/impl/zk/CuratorService.java>:424: warning: no description for @throws
[WARNING] * @throws IOException
[WARNING] ^
[WARNING] <https://builds.apache.org/job/Hadoop-Yarn-trunk-Java8/ws/source/hadoop-yarn-project/hadoop-yarn/hadoop-yarn-registry/src/main/java/org/apache/hadoop/registry/client/impl/zk/CuratorService.java>:427: warning: no @param for mode
[WARNING] public boolean maybeCreate(String path,
[WARNING] ^
[WARNING] <https://builds.apache.org/job/Hadoop-Yarn-trunk-Java8/ws/source/hadoop-yarn-project/hadoop-yarn/hadoop-yarn-registry/src/main/java/org/apache/hadoop/registry/client/impl/zk/CuratorService.java>:463: warning: no description for @throws
[WARNING] * @throws IOException
[WARNING] ^
[WARNING] <https://builds.apache.org/job/Hadoop-Yarn-trunk-Java8/ws/source/hadoop-yarn-project/hadoop-yarn/hadoop-yarn-registry/src/main/java/org/apache/hadoop/registry/client/impl/zk/CuratorService.java>:509: warning: no description for @throws
[WARNING] * @throws IOException
[WARNING] ^
[WARNING] <https://builds.apache.org/job/Hadoop-Yarn-trunk-Java8/ws/source/hadoop-yarn-project/hadoop-yarn/hadoop-yarn-registry/src/main/java/org/apache/hadoop/registry/client/impl/zk/CuratorService.java>:511: warning: no @return
[WARNING] public String zkPathMustExist(String path) throws IOException {
[WARNING] ^
[WARNING] <https://builds.apache.org/job/Hadoop-Yarn-trunk-Java8/ws/source/hadoop-yarn-project/hadoop-yarn/hadoop-yarn-registry/src/main/java/org/apache/hadoop/registry/client/impl/zk/CuratorService.java>:524: warning: no @return
[WARNING] public boolean zkMkPath(String path,
[WARNING] ^
[WARNING] <https://builds.apache.org/job/Hadoop-Yarn-trunk-Java8/ws/source/hadoop-yarn-project/hadoop-yarn/hadoop-yarn-registry/src/main/java/org/apache/hadoop/registry/client/impl/zk/CuratorService.java>:580: warning: no description for @param
[WARNING] * @param acls
[WARNING] ^
[WARNING] <https://builds.apache.org/job/Hadoop-Yarn-trunk-Java8/ws/source/hadoop-yarn-project/hadoop-yarn/hadoop-yarn-registry/src/main/java/org/apache/hadoop/registry/client/impl/zk/CuratorService.java>:581: warning: no description for @throws
[WARNING] * @throws IOException
[WARNING] ^
[WARNING] <https://builds.apache.org/job/Hadoop-Yarn-trunk-Java8/ws/source/hadoop-yarn-project/hadoop-yarn/hadoop-yarn-registry/src/main/java/org/apache/hadoop/registry/client/impl/zk/CuratorService.java>:583: warning: no @param for mode
[WARNING] public void zkCreate(String path,
[WARNING] ^
[WARNING] <https://builds.apache.org/job/Hadoop-Yarn-trunk-Java8/ws/source/hadoop-yarn-project/hadoop-yarn/hadoop-yarn-registry/src/main/java/org/apache/hadoop/registry/client/impl/zk/CuratorService.java>:606: warning: no description for @throws
[WARNING] * @throws IOException
[WARNING] ^
[WARNING] <https://builds.apache.org/job/Hadoop-Yarn-trunk-Java8/ws/source/hadoop-yarn-project/hadoop-yarn/hadoop-yarn-registry/src/main/java/org/apache/hadoop/registry/client/impl/zk/CuratorService.java>:628: warning: no description for @throws
[WARNING] * @throws IOException
[WARNING] ^
[WARNING] <https://builds.apache.org/job/Hadoop-Yarn-trunk-Java8/ws/source/hadoop-yarn-project/hadoop-yarn/hadoop-yarn-registry/src/main/java/org/apache/hadoop/registry/client/impl/zk/CuratorService.java>:631: warning: no @param for mode
[WARNING] public boolean zkSet(String path,
[WARNING] ^
[WARNING] <https://builds.apache.org/job/Hadoop-Yarn-trunk-Java8/ws/source/hadoop-yarn-project/hadoop-yarn/hadoop-yarn-registry/src/main/java/org/apache/hadoop/registry/client/impl/zk/CuratorService.java>:688: warning: no description for @throws
[WARNING] * @throws IOException
[WARNING] ^
[WARNING] <https://builds.apache.org/job/Hadoop-Yarn-trunk-Java8/ws/source/hadoop-yarn-project/hadoop-yarn/hadoop-yarn-registry/src/main/java/org/apache/hadoop/registry/client/impl/zk/CuratorService.java>:741: warning: no @return
[WARNING] public boolean addWriteAccessor(String id, String pass) throws IOException {
[WARNING] ^
[WARNING] <https://builds.apache.org/job/Hadoop-Yarn-trunk-Java8/ws/source/hadoop-yarn-project/hadoop-yarn/hadoop-yarn-registry/src/main/java/org/apache/hadoop/registry/server/services/MicroZookeeperService.java>:130: warning: no description for @throws
[WARNING] * @throws Exception
[WARNING] ^
[WARNING] <https://builds.apache.org/job/Hadoop-Yarn-trunk-Java8/ws/source/hadoop-yarn-project/hadoop-yarn/hadoop-yarn-registry/src/main/java/org/apache/hadoop/registry/server/services/MicroZookeeperService.java>:196: warning: no @throws for java.io.IOException
[WARNING] public boolean setupSecurity() throws IOException {
[WARNING] ^
[WARNING] <https://builds.apache.org/job/Hadoop-Yarn-trunk-Java8/ws/source/hadoop-yarn-project/hadoop-yarn/hadoop-yarn-registry/src/main/java/org/apache/hadoop/registry/server/services/MicroZookeeperService.java>:223: warning: no description for @throws
[WARNING] * @throws Exception
[WARNING] ^
[WARNING] <https://builds.apache.org/job/Hadoop-Yarn-trunk-Java8/ws/source/hadoop-yarn-project/hadoop-yarn/hadoop-yarn-registry/src/main/java/org/apache/hadoop/registry/server/services/MicroZookeeperService.java>:263: warning: no description for @throws
[WARNING] * @throws Exception
[WARNING] ^
[WARNING] <https://builds.apache.org/job/Hadoop-Yarn-trunk-Java8/ws/source/hadoop-yarn-project/hadoop-yarn/hadoop-yarn-registry/src/main/java/org/apache/hadoop/registry/cli/RegistryCli.java>:124: warning: no description for @throws
[WARNING] * @throws IOException
[WARNING] ^
[WARNING] <https://builds.apache.org/job/Hadoop-Yarn-trunk-Java8/ws/source/hadoop-yarn-project/hadoop-yarn/hadoop-yarn-registry/src/main/java/org/apache/hadoop/registry/client/binding/JsonSerDeser.java>:101: warning: no @throws for org.codehaus.jackson.JsonParseException
[WARNING] public synchronized T fromJson(String json)
[WARNING] ^
[WARNING] <https://builds.apache.org/job/Hadoop-Yarn-trunk-Java8/ws/source/hadoop-yarn-project/hadoop-yarn/hadoop-yarn-registry/src/main/java/org/apache/hadoop/registry/client/binding/JsonSerDeser.java>:119: warning: no @throws for org.codehaus.jackson.JsonParseException
[WARNING] public synchronized T fromFile(File jsonFile)
[WARNING] ^
[WARNING] <https://builds.apache.org/job/Hadoop-Yarn-trunk-Java8/ws/source/hadoop-yarn-project/hadoop-yarn/hadoop-yarn-registry/src/main/java/org/apache/hadoop/registry/client/binding/JsonSerDeser.java>:137: warning: no @throws for org.codehaus.jackson.JsonParseException
[WARNING] public synchronized T fromResource(String resource)
[WARNING] ^
[WARNING] <https://builds.apache.org/job/Hadoop-Yarn-trunk-Java8/ws/source/hadoop-yarn-project/hadoop-yarn/hadoop-yarn-registry/src/main/java/org/apache/hadoop/registry/client/binding/JsonSerDeser.java>:195: warning: no @param for instance
[WARNING] public void save(FileSystem fs, Path path, T instance,
[WARNING] ^
[WARNING] <https://builds.apache.org/job/Hadoop-Yarn-trunk-Java8/ws/source/hadoop-yarn-project/hadoop-yarn/hadoop-yarn-registry/src/main/java/org/apache/hadoop/registry/client/binding/JsonSerDeser.java>:221: warning: no description for @throws
[WARNING] * @throws IOException
[WARNING] ^
[WARNING] <https://builds.apache.org/job/Hadoop-Yarn-trunk-Java8/ws/source/hadoop-yarn-project/hadoop-yarn/hadoop-yarn-registry/src/main/java/org/apache/hadoop/registry/client/binding/JsonSerDeser.java>:236: warning: no @return
[WARNING] public T fromBytes(String path, byte[] bytes) throws IOException,
[WARNING] ^
[WARNING] <https://builds.apache.org/job/Hadoop-Yarn-trunk-Java8/ws/source/hadoop-yarn-project/hadoop-yarn/hadoop-yarn-registry/src/main/java/org/apache/hadoop/registry/client/binding/JsonSerDeser.java>:287: warning: no @throws for org.codehaus.jackson.JsonGenerationException
[WARNING] public synchronized String toJson(T instance) throws IOException,
[WARNING] ^
[WARNING] <https://builds.apache.org/job/Hadoop-Yarn-trunk-Java8/ws/source/hadoop-yarn-project/hadoop-yarn/hadoop-yarn-registry/src/main/java/org/apache/hadoop/registry/client/binding/RegistryPathUtils.java>:91: warning: no @param for base
[WARNING] public static String createFullPath(String base, String path) throws
[WARNING] ^
[WARNING] <https://builds.apache.org/job/Hadoop-Yarn-trunk-Java8/ws/source/hadoop-yarn-project/hadoop-yarn/hadoop-yarn-registry/src/main/java/org/apache/hadoop/registry/client/binding/RegistryUtils.java>:170: warning: no description for @throws
[WARNING] * @throws IOException
[WARNING] ^
[WARNING] <https://builds.apache.org/job/Hadoop-Yarn-trunk-Java8/ws/source/hadoop-yarn-project/hadoop-yarn/hadoop-yarn-registry/src/main/java/org/apache/hadoop/registry/client/binding/RegistryUtils.java>:198: warning: no @param for registryOperations
[WARNING] public static Map<String, RegistryPathStatus> statChildren(
[WARNING] ^
[WARNING] <https://builds.apache.org/job/Hadoop-Yarn-trunk-Java8/ws/source/hadoop-yarn-project/hadoop-yarn/hadoop-yarn-registry/src/main/java/org/apache/hadoop/registry/client/binding/RegistryUtils.java>:350: warning: no @param for stats
[WARNING] public static Map<String, ServiceRecord> extractServiceRecords(
[WARNING] ^
[WARNING] <https://builds.apache.org/job/Hadoop-Yarn-trunk-Java8/ws/source/hadoop-yarn-project/hadoop-yarn/hadoop-yarn-registry/src/main/java/org/apache/hadoop/registry/client/types/Endpoint.java>:229: warning: no description for @throws
[WARNING] * @throws CloneNotSupportedException
[WARNING] ^
[WARNING] <https://builds.apache.org/job/Hadoop-Yarn-trunk-Java8/ws/source/hadoop-yarn-project/hadoop-yarn/hadoop-yarn-registry/src/main/java/org/apache/hadoop/registry/client/types/ServiceRecord.java>:241: warning: no description for @throws
[WARNING] * @throws CloneNotSupportedException
[WARNING] ^
[WARNING] <https://builds.apache.org/job/Hadoop-Yarn-trunk-Java8/ws/source/hadoop-yarn-project/hadoop-yarn/hadoop-yarn-registry/src/main/java/org/apache/hadoop/registry/client/impl/zk/RegistrySecurity.java>:187: warning: no description for @throws
[WARNING] * @throws Exception
[WARNING] ^
[WARNING] <https://builds.apache.org/job/Hadoop-Yarn-trunk-Java8/ws/source/hadoop-yarn-project/hadoop-yarn/hadoop-yarn-registry/src/main/java/org/apache/hadoop/registry/client/impl/zk/RegistrySecurity.java>:320: warning: no @return
[WARNING] public boolean addDigestACL(ACL acl) {
[WARNING] ^
[WARNING] <https://builds.apache.org/job/Hadoop-Yarn-trunk-Java8/ws/source/hadoop-yarn-project/hadoop-yarn/hadoop-yarn-registry/src/main/java/org/apache/hadoop/registry/client/impl/zk/RegistrySecurity.java>:378: warning: no description for @throws
[WARNING] * @throws IOException
[WARNING] ^
[WARNING] <https://builds.apache.org/job/Hadoop-Yarn-trunk-Java8/ws/source/hadoop-yarn-project/hadoop-yarn/hadoop-yarn-registry/src/main/java/org/apache/hadoop/registry/client/impl/zk/RegistrySecurity.java>:444: warning: no @throws for java.io.IOException
[WARNING] public String digest(String idPasswordPair) throws IOException {
[WARNING] ^
[WARNING] <https://builds.apache.org/job/Hadoop-Yarn-trunk-Java8/ws/source/hadoop-yarn-project/hadoop-yarn/hadoop-yarn-registry/src/main/java/org/apache/hadoop/registry/client/impl/zk/RegistrySecurity.java>:462: warning: no description for @throws
[WARNING] * @throws IOException
[WARNING] ^
[WARNING] <https://builds.apache.org/job/Hadoop-Yarn-trunk-Java8/ws/source/hadoop-yarn-project/hadoop-yarn/hadoop-yarn-registry/src/main/java/org/apache/hadoop/registry/client/impl/zk/RegistrySecurity.java>:482: warning: no description for @throws
[WARNING] * @throws IOException
[WARNING] ^
[WARNING] <https://builds.apache.org/job/Hadoop-Yarn-trunk-Java8/ws/source/hadoop-yarn-project/hadoop-yarn/hadoop-yarn-registry/src/main/java/org/apache/hadoop/registry/client/impl/zk/RegistrySecurity.java>:550: warning: no description for @throws
[WARNING] * @throws IOException
[WARNING] ^
[WARNING] <https://builds.apache.org/job/Hadoop-Yarn-trunk-Java8/ws/source/hadoop-yarn-project/hadoop-yarn/hadoop-yarn-registry/src/main/java/org/apache/hadoop/registry/client/impl/zk/RegistrySecurity.java>:923: warning: no @param for perms
[WARNING] public ACL createACLForUser(UserGroupInformation ugi, int perms) {
[WARNING] ^
[INFO] Building jar: <https://builds.apache.org/job/Hadoop-Yarn-trunk-Java8/ws/source/hadoop-yarn-project/hadoop-yarn/hadoop-yarn-registry/target/hadoop-yarn-registry-3.0.0-alpha1-SNAPSHOT-javadoc.jar>
[INFO] 
[INFO] --- maven-enforcer-plugin:1.3.1:enforce (depcheck) @ hadoop-yarn-registry ---
[INFO] 
[INFO] --- maven-checkstyle-plugin:2.15:checkstyle (default-cli) @ hadoop-yarn-registry ---
[INFO] There are 509 errors reported by Checkstyle 6.6 with checkstyle/checkstyle.xml ruleset.
[WARNING] Unable to locate Source XRef to link to - DISABLED
[INFO] 
[INFO] --- findbugs-maven-plugin:3.0.0:findbugs (default-cli) @ hadoop-yarn-registry ---
[INFO] Fork Value is true
[INFO] Done FindBugs Analysis....
[INFO]                                                                         
[INFO] ------------------------------------------------------------------------
[INFO] Skipping Apache Hadoop YARN Project
[INFO] This project has been banned from the build due to previous failures.
[INFO] ------------------------------------------------------------------------
[INFO] ------------------------------------------------------------------------
[INFO] Reactor Summary:
[INFO] 
[INFO] Apache Hadoop YARN ................................. SUCCESS [  2.697 s]
[INFO] Apache Hadoop YARN API ............................. SUCCESS [01:51 min]
[INFO] Apache Hadoop YARN Common .......................... SUCCESS [02:57 min]
[INFO] Apache Hadoop YARN Server .......................... SUCCESS [  0.054 s]
[INFO] Apache Hadoop YARN Server Common ................... SUCCESS [ 39.491 s]
[INFO] Apache Hadoop YARN NodeManager ..................... SUCCESS [12:02 min]
[INFO] Apache Hadoop YARN Web Proxy ....................... SUCCESS [ 18.852 s]
[INFO] Apache Hadoop YARN ApplicationHistoryService ....... SUCCESS [04:11 min]
[INFO] Apache Hadoop YARN ResourceManager ................. FAILURE [37:14 min]
[INFO] Apache Hadoop YARN Server Tests .................... SKIPPED
[INFO] Apache Hadoop YARN Client .......................... SKIPPED
[INFO] Apache Hadoop YARN SharedCacheManager .............. SKIPPED
[INFO] Apache Hadoop YARN Timeline Plugin Storage ......... SKIPPED
[INFO] Apache Hadoop YARN Applications .................... SUCCESS [  0.036 s]
[INFO] Apache Hadoop YARN DistributedShell ................ SKIPPED
[INFO] Apache Hadoop YARN Unmanaged Am Launcher ........... SKIPPED
[INFO] Apache Hadoop YARN Site ............................ SUCCESS [  0.038 s]
[INFO] Apache Hadoop YARN Registry ........................ SUCCESS [01:53 min]
[INFO] Apache Hadoop YARN Project ......................... SKIPPED
[INFO] ------------------------------------------------------------------------
[INFO] BUILD FAILURE
[INFO] ------------------------------------------------------------------------
[INFO] Total time: 01:01 h
[INFO] Finished at: 2016-05-25T04:38:59+00:00
[INFO] Final Memory: 124M/3842M
[INFO] ------------------------------------------------------------------------
[WARNING] The requested profile "docs" could not be activated because it does not exist.
[WARNING] The requested profile "parallel-tests" could not be activated because it does not exist.
[ERROR] Failed to execute goal org.apache.maven.plugins:maven-surefire-plugin:2.17:test (default-test) on project hadoop-yarn-server-resourcemanager: There are test failures.
[ERROR] 
[ERROR] Please refer to <https://builds.apache.org/job/Hadoop-Yarn-trunk-Java8/ws/source/hadoop-yarn-project/hadoop-yarn/hadoop-yarn-server/hadoop-yarn-server-resourcemanager/target/surefire-reports> for the individual test results.
[ERROR] -> [Help 1]
[ERROR] 
[ERROR] To see the full stack trace of the errors, re-run Maven with the -e switch.
[ERROR] Re-run Maven using the -X switch to enable full debug logging.
[ERROR] 
[ERROR] For more information about the errors and possible solutions, please read the following articles:
[ERROR] [Help 1] http://cwiki.apache.org/confluence/display/MAVEN/MojoFailureException
[ERROR] 
[ERROR] After correcting the problems, you can resume the build with the command
[ERROR]   mvn <goals> -rf :hadoop-yarn-server-resourcemanager
Build step 'Execute shell' marked build as failure
Archiving artifacts
Setting LATEST1_8_HOME=/home/jenkins/jenkins-slave/tools/hudson.model.JDK/latest1.8
Setting MAVEN_3_3_3_HOME=/home/jenkins/jenkins-slave/tools/hudson.tasks.Maven_MavenInstallation/maven-3.3.3
Recording test results
Setting LATEST1_8_HOME=/home/jenkins/jenkins-slave/tools/hudson.model.JDK/latest1.8
Setting MAVEN_3_3_3_HOME=/home/jenkins/jenkins-slave/tools/hudson.tasks.Maven_MavenInstallation/maven-3.3.3
Setting LATEST1_8_HOME=/home/jenkins/jenkins-slave/tools/hudson.model.JDK/latest1.8
Setting MAVEN_3_3_3_HOME=/home/jenkins/jenkins-slave/tools/hudson.tasks.Maven_MavenInstallation/maven-3.3.3

---------------------------------------------------------------------
To unsubscribe, e-mail: yarn-dev-unsubscribe@hadoop.apache.org
For additional commands, e-mail: yarn-dev-help@hadoop.apache.org


Hadoop-Yarn-trunk-Java8 - Build # 1492 - Still Failing

Posted by Apache Jenkins Server <je...@builds.apache.org>.
See https://builds.apache.org/job/Hadoop-Yarn-trunk-Java8/1492/

###################################################################################
########################## LAST 60 LINES OF THE CONSOLE ###########################
[...truncated 51667 lines...]
[INFO] Reactor Summary:
[INFO] 
[INFO] Apache Hadoop YARN ................................. SUCCESS [  2.697 s]
[INFO] Apache Hadoop YARN API ............................. SUCCESS [01:51 min]
[INFO] Apache Hadoop YARN Common .......................... SUCCESS [02:57 min]
[INFO] Apache Hadoop YARN Server .......................... SUCCESS [  0.054 s]
[INFO] Apache Hadoop YARN Server Common ................... SUCCESS [ 39.491 s]
[INFO] Apache Hadoop YARN NodeManager ..................... SUCCESS [12:02 min]
[INFO] Apache Hadoop YARN Web Proxy ....................... SUCCESS [ 18.852 s]
[INFO] Apache Hadoop YARN ApplicationHistoryService ....... SUCCESS [04:11 min]
[INFO] Apache Hadoop YARN ResourceManager ................. FAILURE [37:14 min]
[INFO] Apache Hadoop YARN Server Tests .................... SKIPPED
[INFO] Apache Hadoop YARN Client .......................... SKIPPED
[INFO] Apache Hadoop YARN SharedCacheManager .............. SKIPPED
[INFO] Apache Hadoop YARN Timeline Plugin Storage ......... SKIPPED
[INFO] Apache Hadoop YARN Applications .................... SUCCESS [  0.036 s]
[INFO] Apache Hadoop YARN DistributedShell ................ SKIPPED
[INFO] Apache Hadoop YARN Unmanaged Am Launcher ........... SKIPPED
[INFO] Apache Hadoop YARN Site ............................ SUCCESS [  0.038 s]
[INFO] Apache Hadoop YARN Registry ........................ SUCCESS [01:53 min]
[INFO] Apache Hadoop YARN Project ......................... SKIPPED
[INFO] ------------------------------------------------------------------------
[INFO] BUILD FAILURE
[INFO] ------------------------------------------------------------------------
[INFO] Total time: 01:01 h
[INFO] Finished at: 2016-05-25T04:38:59+00:00
[INFO] Final Memory: 124M/3842M
[INFO] ------------------------------------------------------------------------
[WARNING] The requested profile "docs" could not be activated because it does not exist.
[WARNING] The requested profile "parallel-tests" could not be activated because it does not exist.
[ERROR] Failed to execute goal org.apache.maven.plugins:maven-surefire-plugin:2.17:test (default-test) on project hadoop-yarn-server-resourcemanager: There are test failures.
[ERROR] 
[ERROR] Please refer to /home/jenkins/jenkins-slave/workspace/Hadoop-Yarn-trunk-Java8/source/hadoop-yarn-project/hadoop-yarn/hadoop-yarn-server/hadoop-yarn-server-resourcemanager/target/surefire-reports for the individual test results.
[ERROR] -> [Help 1]
[ERROR] 
[ERROR] To see the full stack trace of the errors, re-run Maven with the -e switch.
[ERROR] Re-run Maven using the -X switch to enable full debug logging.
[ERROR] 
[ERROR] For more information about the errors and possible solutions, please read the following articles:
[ERROR] [Help 1] http://cwiki.apache.org/confluence/display/MAVEN/MojoFailureException
[ERROR] 
[ERROR] After correcting the problems, you can resume the build with the command
[ERROR]   mvn <goals> -rf :hadoop-yarn-server-resourcemanager
Build step 'Execute shell' marked build as failure
Archiving artifacts
Setting LATEST1_8_HOME=/home/jenkins/jenkins-slave/tools/hudson.model.JDK/latest1.8
Setting MAVEN_3_3_3_HOME=/home/jenkins/jenkins-slave/tools/hudson.tasks.Maven_MavenInstallation/maven-3.3.3
Recording test results
Setting LATEST1_8_HOME=/home/jenkins/jenkins-slave/tools/hudson.model.JDK/latest1.8
Setting MAVEN_3_3_3_HOME=/home/jenkins/jenkins-slave/tools/hudson.tasks.Maven_MavenInstallation/maven-3.3.3
Setting LATEST1_8_HOME=/home/jenkins/jenkins-slave/tools/hudson.model.JDK/latest1.8
Setting MAVEN_3_3_3_HOME=/home/jenkins/jenkins-slave/tools/hudson.tasks.Maven_MavenInstallation/maven-3.3.3
Sending e-mails to: yarn-dev@hadoop.apache.org
Email was triggered for: Failure - Any
Sending email for trigger: Failure - Any
Setting LATEST1_8_HOME=/home/jenkins/jenkins-slave/tools/hudson.model.JDK/latest1.8
Setting MAVEN_3_3_3_HOME=/home/jenkins/jenkins-slave/tools/hudson.tasks.Maven_MavenInstallation/maven-3.3.3
Setting LATEST1_8_HOME=/home/jenkins/jenkins-slave/tools/hudson.model.JDK/latest1.8
Setting MAVEN_3_3_3_HOME=/home/jenkins/jenkins-slave/tools/hudson.tasks.Maven_MavenInstallation/maven-3.3.3



###################################################################################
############################## FAILED TESTS (if any) ##############################
1 tests failed.
FAILED:  org.apache.hadoop.yarn.server.resourcemanager.security.TestDelegationTokenRenewer.testCancelWithMultipleAppSubmissions

Error Message:
null

Stack Trace:
java.lang.AssertionError: null
	at org.junit.Assert.fail(Assert.java:86)
	at org.junit.Assert.assertTrue(Assert.java:41)
	at org.junit.Assert.assertFalse(Assert.java:64)
	at org.junit.Assert.assertFalse(Assert.java:74)
	at org.apache.hadoop.yarn.server.resourcemanager.security.TestDelegationTokenRenewer.testCancelWithMultipleAppSubmissions(TestDelegationTokenRenewer.java:1134)