You are viewing a plain text version of this content. The canonical link for it is here.
Posted to mapreduce-dev@hadoop.apache.org by Apache Jenkins Server <je...@builds.apache.org> on 2011/12/13 10:40:11 UTC
Hadoop-Mapreduce-0.23-Commit - Build # 289 - Still Failing
See https://builds.apache.org/job/Hadoop-Mapreduce-0.23-Commit/289/
###################################################################################
########################## LAST 60 LINES OF THE CONSOLE ###########################
[...truncated 14176 lines...]
[exec] make[1]: Leaving directory `/home/jenkins/jenkins-slave/workspace/Hadoop-Mapreduce-0.23-Commit/trunk/hadoop-mapreduce-project/build/c++-build/Linux-i386-32/examples/pipes'
compile-c++-examples:
compile-examples:
ivy-resolve-test:
[ivy:resolve] downloading /home/jenkins/.m2/repository/org/apache/hadoop/hadoop-hdfs/0.23.1-SNAPSHOT/hadoop-hdfs-0.23.1-SNAPSHOT-tests.jar ...
[ivy:resolve] ................... (1094kB)
[ivy:resolve] [SUCCESSFUL ] org.apache.hadoop#hadoop-hdfs;0.23.1-SNAPSHOT!hadoop-hdfs.jar(tests) (4ms)
[ivy:resolve] downloading /home/jenkins/.m2/repository/junit/junit/4.8.1/junit-4.8.1.jar ...
[ivy:resolve] ..... (231kB)
[ivy:resolve] .. (0kB)
[ivy:resolve] [SUCCESSFUL ] junit#junit;4.8.1!junit.jar (4ms)
[ivy:resolve] downloading http://repo1.maven.org/maven2/org/mockito/mockito-all/1.8.2/mockito-all-1.8.2.jar ...
[ivy:resolve] .................................................................................................................................................................................................................................................................................................................................................................................................................................................................................................................................................................................................................................................................................................................................................................................................................................................................................................................................................................................................................................................................................................................................................................................................................................................................................................................................................................................................................................................................................................................................................................................................................................................................................................................................................................................................................................................................................................................................................................................................................................................................................................................................................................................................................................................................................................................................................................................................................................................................................................................... (1315kB)
[ivy:resolve] .. (0kB)
[ivy:resolve] [SUCCESSFUL ] org.mockito#mockito-all;1.8.2!mockito-all.jar (1657ms)
[ivy:resolve] downloading http://repo1.maven.org/maven2/org/mortbay/jetty/jetty-servlet-tester/6.1.14/jetty-servlet-tester-6.1.14.jar ...
[ivy:resolve] ................ (8kB)
[ivy:resolve] .. (0kB)
[ivy:resolve] [SUCCESSFUL ] org.mortbay.jetty#jetty-servlet-tester;6.1.14!jetty-servlet-tester.jar (957ms)
[ivy:resolve] downloading /home/jenkins/.m2/repository/log4j/log4j/1.2.15/log4j-1.2.15.jar ...
[ivy:resolve] ....... (382kB)
[ivy:resolve] .. (0kB)
[ivy:resolve] [SUCCESSFUL ] log4j#log4j;1.2.15!log4j.jar (7ms)
[ivy:resolve] downloading /home/jenkins/.m2/repository/org/slf4j/slf4j-api/1.5.11/slf4j-api-1.5.11.jar ...
[ivy:resolve] .. (23kB)
[ivy:resolve] .. (0kB)
[ivy:resolve] [SUCCESSFUL ] org.slf4j#slf4j-api;1.5.11!slf4j-api.jar (1ms)
[ivy:resolve] downloading /home/jenkins/.m2/repository/org/slf4j/slf4j-log4j12/1.5.11/slf4j-log4j12-1.5.11.jar ...
[ivy:resolve] .. (9kB)
[ivy:resolve] .. (0kB)
[ivy:resolve] [SUCCESSFUL ] org.slf4j#slf4j-log4j12;1.5.11!slf4j-log4j12.jar (1ms)
ivy-retrieve-test:
compile-mapred-test:
[mkdir] Created dir: /home/jenkins/jenkins-slave/workspace/Hadoop-Mapreduce-0.23-Commit/trunk/hadoop-mapreduce-project/build/test/mapred/classes
[mkdir] Created dir: /home/jenkins/jenkins-slave/workspace/Hadoop-Mapreduce-0.23-Commit/trunk/hadoop-mapreduce-project/build/test/mapred/testjar
[mkdir] Created dir: /home/jenkins/jenkins-slave/workspace/Hadoop-Mapreduce-0.23-Commit/trunk/hadoop-mapreduce-project/build/test/mapred/testshell
[javac] Compiling 305 source files to /home/jenkins/jenkins-slave/workspace/Hadoop-Mapreduce-0.23-Commit/trunk/hadoop-mapreduce-project/build/test/mapred/classes
[javac] /home/jenkins/jenkins-slave/workspace/Hadoop-Mapreduce-0.23-Commit/trunk/hadoop-mapreduce-project/src/test/mapred/org/apache/hadoop/mapred/TestJobQueueClient.java:80: printJobQueueInfo(org.apache.hadoop.mapred.JobQueueInfo,java.io.Writer,java.lang.String) in org.apache.hadoop.mapred.JobQueueClient cannot be applied to (org.apache.hadoop.mapred.JobQueueInfo,java.io.StringWriter)
[javac] client.printJobQueueInfo(root, writer);
[javac] ^
[javac] Note: Some input files use or override a deprecated API.
[javac] Note: Recompile with -Xlint:deprecation for details.
[javac] 1 error
BUILD FAILED
/home/jenkins/jenkins-slave/workspace/Hadoop-Mapreduce-0.23-Commit/trunk/hadoop-mapreduce-project/build.xml:526: The following error occurred while executing this line:
/home/jenkins/jenkins-slave/workspace/Hadoop-Mapreduce-0.23-Commit/trunk/hadoop-mapreduce-project/build.xml:603: Compile failed; see the compiler error output for details.
Total time: 1 minute 34 seconds
Build step 'Execute shell' marked build as failure
Recording test results
Updating HADOOP-7914
Email was triggered for: Failure
Sending email for trigger: Failure
###################################################################################
############################## FAILED TESTS (if any) ##############################
All tests passed
Hadoop-Mapreduce-0.23-Commit - Build # 299 - Still Failing
Posted by Apache Jenkins Server <je...@builds.apache.org>.
See https://builds.apache.org/job/Hadoop-Mapreduce-0.23-Commit/299/
###################################################################################
########################## LAST 60 LINES OF THE CONSOLE ###########################
[...truncated 14340 lines...]
[exec] make[1]: Leaving directory `/home/jenkins/jenkins-slave/workspace/Hadoop-Mapreduce-0.23-Commit/trunk/hadoop-mapreduce-project/build/c++-build/Linux-i386-32/examples/pipes'
compile-c++-examples:
compile-examples:
ivy-resolve-test:
[ivy:resolve] downloading /home/jenkins/.m2/repository/org/apache/hadoop/hadoop-hdfs/0.23.1-SNAPSHOT/hadoop-hdfs-0.23.1-SNAPSHOT-tests.jar ...
[ivy:resolve] ................... (1098kB)
[ivy:resolve] [SUCCESSFUL ] org.apache.hadoop#hadoop-hdfs;0.23.1-SNAPSHOT!hadoop-hdfs.jar(tests) (3ms)
[ivy:resolve] downloading /home/jenkins/.m2/repository/junit/junit/4.8.1/junit-4.8.1.jar ...
[ivy:resolve] ..... (231kB)
[ivy:resolve] .. (0kB)
[ivy:resolve] [SUCCESSFUL ] junit#junit;4.8.1!junit.jar (31ms)
[ivy:resolve] downloading http://repo1.maven.org/maven2/org/mockito/mockito-all/1.8.2/mockito-all-1.8.2.jar ...
[ivy:resolve] .................................................................................................................................................................................................................................................................................................................................................................................................................................................................................................................................................................................................................................................................................................................................................................................................................................................................................................................................................................................................................................................................................................................................................................................................................................................................................................................................................................................................................................................................................................................................................................................................................................................................................................................................................................................................................................................................................................................................................................................................................................................................................................................................................................................................................................................................................................................................................................................................................................................................................................................. (1315kB)
[ivy:resolve] .. (0kB)
[ivy:resolve] [SUCCESSFUL ] org.mockito#mockito-all;1.8.2!mockito-all.jar (1668ms)
[ivy:resolve] downloading http://repo1.maven.org/maven2/org/mortbay/jetty/jetty-servlet-tester/6.1.14/jetty-servlet-tester-6.1.14.jar ...
[ivy:resolve] ................ (8kB)
[ivy:resolve] .. (0kB)
[ivy:resolve] [SUCCESSFUL ] org.mortbay.jetty#jetty-servlet-tester;6.1.14!jetty-servlet-tester.jar (983ms)
[ivy:resolve] downloading /home/jenkins/.m2/repository/log4j/log4j/1.2.15/log4j-1.2.15.jar ...
[ivy:resolve] ....... (382kB)
[ivy:resolve] .. (0kB)
[ivy:resolve] [SUCCESSFUL ] log4j#log4j;1.2.15!log4j.jar (6ms)
[ivy:resolve] downloading /home/jenkins/.m2/repository/org/slf4j/slf4j-api/1.5.11/slf4j-api-1.5.11.jar ...
[ivy:resolve] .. (23kB)
[ivy:resolve] .. (0kB)
[ivy:resolve] [SUCCESSFUL ] org.slf4j#slf4j-api;1.5.11!slf4j-api.jar (2ms)
[ivy:resolve] downloading /home/jenkins/.m2/repository/org/slf4j/slf4j-log4j12/1.5.11/slf4j-log4j12-1.5.11.jar ...
[ivy:resolve] .. (9kB)
[ivy:resolve] .. (0kB)
[ivy:resolve] [SUCCESSFUL ] org.slf4j#slf4j-log4j12;1.5.11!slf4j-log4j12.jar (2ms)
ivy-retrieve-test:
compile-mapred-test:
[mkdir] Created dir: /home/jenkins/jenkins-slave/workspace/Hadoop-Mapreduce-0.23-Commit/trunk/hadoop-mapreduce-project/build/test/mapred/classes
[mkdir] Created dir: /home/jenkins/jenkins-slave/workspace/Hadoop-Mapreduce-0.23-Commit/trunk/hadoop-mapreduce-project/build/test/mapred/testjar
[mkdir] Created dir: /home/jenkins/jenkins-slave/workspace/Hadoop-Mapreduce-0.23-Commit/trunk/hadoop-mapreduce-project/build/test/mapred/testshell
[javac] Compiling 303 source files to /home/jenkins/jenkins-slave/workspace/Hadoop-Mapreduce-0.23-Commit/trunk/hadoop-mapreduce-project/build/test/mapred/classes
[javac] /home/jenkins/jenkins-slave/workspace/Hadoop-Mapreduce-0.23-Commit/trunk/hadoop-mapreduce-project/src/test/mapred/org/apache/hadoop/mapred/TestJobQueueClient.java:80: printJobQueueInfo(org.apache.hadoop.mapred.JobQueueInfo,java.io.Writer,java.lang.String) in org.apache.hadoop.mapred.JobQueueClient cannot be applied to (org.apache.hadoop.mapred.JobQueueInfo,java.io.StringWriter)
[javac] client.printJobQueueInfo(root, writer);
[javac] ^
[javac] Note: Some input files use or override a deprecated API.
[javac] Note: Recompile with -Xlint:deprecation for details.
[javac] 1 error
BUILD FAILED
/home/jenkins/jenkins-slave/workspace/Hadoop-Mapreduce-0.23-Commit/trunk/hadoop-mapreduce-project/build.xml:526: The following error occurred while executing this line:
/home/jenkins/jenkins-slave/workspace/Hadoop-Mapreduce-0.23-Commit/trunk/hadoop-mapreduce-project/build.xml:603: Compile failed; see the compiler error output for details.
Total time: 1 minute 35 seconds
Build step 'Execute shell' marked build as failure
Recording test results
Updating MAPREDUCE-3557
Email was triggered for: Failure
Sending email for trigger: Failure
###################################################################################
############################## FAILED TESTS (if any) ##############################
All tests passed
Hadoop-Mapreduce-0.23-Commit - Build # 298 - Still Failing
Posted by Apache Jenkins Server <je...@builds.apache.org>.
See https://builds.apache.org/job/Hadoop-Mapreduce-0.23-Commit/298/
###################################################################################
########################## LAST 60 LINES OF THE CONSOLE ###########################
[...truncated 14398 lines...]
[javac] HadoopArchives archive = new HadoopArchives(jobConf);
[javac] ^
[javac] /home/jenkins/jenkins-slave/workspace/Hadoop-Mapreduce-0.23-Commit/trunk/hadoop-mapreduce-project/src/test/mapred/org/apache/hadoop/mapred/TestJobQueueClient.java:80: printJobQueueInfo(org.apache.hadoop.mapred.JobQueueInfo,java.io.Writer,java.lang.String) in org.apache.hadoop.mapred.JobQueueClient cannot be applied to (org.apache.hadoop.mapred.JobQueueInfo,java.io.StringWriter)
[javac] client.printJobQueueInfo(root, writer);
[javac] ^
[javac] /home/jenkins/jenkins-slave/workspace/Hadoop-Mapreduce-0.23-Commit/trunk/hadoop-mapreduce-project/src/test/mapred/org/apache/hadoop/tools/TestHarFileSystem.java:177: cannot find symbol
[javac] symbol : class HadoopArchives
[javac] location: class org.apache.hadoop.tools.TestHarFileSystem
[javac] HadoopArchives har = new HadoopArchives(conf);
[javac] ^
[javac] /home/jenkins/jenkins-slave/workspace/Hadoop-Mapreduce-0.23-Commit/trunk/hadoop-mapreduce-project/src/test/mapred/org/apache/hadoop/tools/TestHarFileSystem.java:177: cannot find symbol
[javac] symbol : class HadoopArchives
[javac] location: class org.apache.hadoop.tools.TestHarFileSystem
[javac] HadoopArchives har = new HadoopArchives(conf);
[javac] ^
[javac] /home/jenkins/jenkins-slave/workspace/Hadoop-Mapreduce-0.23-Commit/trunk/hadoop-mapreduce-project/src/test/mapred/org/apache/hadoop/tools/TestHarFileSystem.java:257: cannot find symbol
[javac] symbol : class HadoopArchives
[javac] location: class org.apache.hadoop.tools.TestHarFileSystem
[javac] HadoopArchives har = new HadoopArchives(conf);
[javac] ^
[javac] /home/jenkins/jenkins-slave/workspace/Hadoop-Mapreduce-0.23-Commit/trunk/hadoop-mapreduce-project/src/test/mapred/org/apache/hadoop/tools/TestHarFileSystem.java:257: cannot find symbol
[javac] symbol : class HadoopArchives
[javac] location: class org.apache.hadoop.tools.TestHarFileSystem
[javac] HadoopArchives har = new HadoopArchives(conf);
[javac] ^
[javac] /home/jenkins/jenkins-slave/workspace/Hadoop-Mapreduce-0.23-Commit/trunk/hadoop-mapreduce-project/src/test/mapred/org/apache/hadoop/tools/TestHarFileSystem.java:375: cannot find symbol
[javac] symbol : class HadoopArchives
[javac] location: class org.apache.hadoop.tools.TestHarFileSystem
[javac] HadoopArchives har = new HadoopArchives(conf);
[javac] ^
[javac] /home/jenkins/jenkins-slave/workspace/Hadoop-Mapreduce-0.23-Commit/trunk/hadoop-mapreduce-project/src/test/mapred/org/apache/hadoop/tools/TestHarFileSystem.java:375: cannot find symbol
[javac] symbol : class HadoopArchives
[javac] location: class org.apache.hadoop.tools.TestHarFileSystem
[javac] HadoopArchives har = new HadoopArchives(conf);
[javac] ^
[javac] /home/jenkins/jenkins-slave/workspace/Hadoop-Mapreduce-0.23-Commit/trunk/hadoop-mapreduce-project/src/test/mapred/org/apache/hadoop/tools/TestHarFileSystem.java:409: cannot find symbol
[javac] symbol : class HadoopArchives
[javac] location: class org.apache.hadoop.tools.TestHarFileSystem
[javac] HadoopArchives har = new HadoopArchives(conf);
[javac] ^
[javac] /home/jenkins/jenkins-slave/workspace/Hadoop-Mapreduce-0.23-Commit/trunk/hadoop-mapreduce-project/src/test/mapred/org/apache/hadoop/tools/TestHarFileSystem.java:409: cannot find symbol
[javac] symbol : class HadoopArchives
[javac] location: class org.apache.hadoop.tools.TestHarFileSystem
[javac] HadoopArchives har = new HadoopArchives(conf);
[javac] ^
[javac] Note: Some input files use or override a deprecated API.
[javac] Note: Recompile with -Xlint:deprecation for details.
[javac] 13 errors
BUILD FAILED
/home/jenkins/jenkins-slave/workspace/Hadoop-Mapreduce-0.23-Commit/trunk/hadoop-mapreduce-project/build.xml:526: The following error occurred while executing this line:
/home/jenkins/jenkins-slave/workspace/Hadoop-Mapreduce-0.23-Commit/trunk/hadoop-mapreduce-project/build.xml:603: Compile failed; see the compiler error output for details.
Total time: 1 minute 35 seconds
Build step 'Execute shell' marked build as failure
Recording test results
Updating HDFS-2675
Email was triggered for: Failure
Sending email for trigger: Failure
###################################################################################
############################## FAILED TESTS (if any) ##############################
All tests passed
Hadoop-Mapreduce-0.23-Commit - Build # 297 - Still Failing
Posted by Apache Jenkins Server <je...@builds.apache.org>.
See https://builds.apache.org/job/Hadoop-Mapreduce-0.23-Commit/297/
###################################################################################
########################## LAST 60 LINES OF THE CONSOLE ###########################
[...truncated 14398 lines...]
[javac] HadoopArchives archive = new HadoopArchives(jobConf);
[javac] ^
[javac] /home/jenkins/jenkins-slave/workspace/Hadoop-Mapreduce-0.23-Commit/trunk/hadoop-mapreduce-project/src/test/mapred/org/apache/hadoop/mapred/TestJobQueueClient.java:80: printJobQueueInfo(org.apache.hadoop.mapred.JobQueueInfo,java.io.Writer,java.lang.String) in org.apache.hadoop.mapred.JobQueueClient cannot be applied to (org.apache.hadoop.mapred.JobQueueInfo,java.io.StringWriter)
[javac] client.printJobQueueInfo(root, writer);
[javac] ^
[javac] /home/jenkins/jenkins-slave/workspace/Hadoop-Mapreduce-0.23-Commit/trunk/hadoop-mapreduce-project/src/test/mapred/org/apache/hadoop/tools/TestHarFileSystem.java:177: cannot find symbol
[javac] symbol : class HadoopArchives
[javac] location: class org.apache.hadoop.tools.TestHarFileSystem
[javac] HadoopArchives har = new HadoopArchives(conf);
[javac] ^
[javac] /home/jenkins/jenkins-slave/workspace/Hadoop-Mapreduce-0.23-Commit/trunk/hadoop-mapreduce-project/src/test/mapred/org/apache/hadoop/tools/TestHarFileSystem.java:177: cannot find symbol
[javac] symbol : class HadoopArchives
[javac] location: class org.apache.hadoop.tools.TestHarFileSystem
[javac] HadoopArchives har = new HadoopArchives(conf);
[javac] ^
[javac] /home/jenkins/jenkins-slave/workspace/Hadoop-Mapreduce-0.23-Commit/trunk/hadoop-mapreduce-project/src/test/mapred/org/apache/hadoop/tools/TestHarFileSystem.java:257: cannot find symbol
[javac] symbol : class HadoopArchives
[javac] location: class org.apache.hadoop.tools.TestHarFileSystem
[javac] HadoopArchives har = new HadoopArchives(conf);
[javac] ^
[javac] /home/jenkins/jenkins-slave/workspace/Hadoop-Mapreduce-0.23-Commit/trunk/hadoop-mapreduce-project/src/test/mapred/org/apache/hadoop/tools/TestHarFileSystem.java:257: cannot find symbol
[javac] symbol : class HadoopArchives
[javac] location: class org.apache.hadoop.tools.TestHarFileSystem
[javac] HadoopArchives har = new HadoopArchives(conf);
[javac] ^
[javac] /home/jenkins/jenkins-slave/workspace/Hadoop-Mapreduce-0.23-Commit/trunk/hadoop-mapreduce-project/src/test/mapred/org/apache/hadoop/tools/TestHarFileSystem.java:375: cannot find symbol
[javac] symbol : class HadoopArchives
[javac] location: class org.apache.hadoop.tools.TestHarFileSystem
[javac] HadoopArchives har = new HadoopArchives(conf);
[javac] ^
[javac] /home/jenkins/jenkins-slave/workspace/Hadoop-Mapreduce-0.23-Commit/trunk/hadoop-mapreduce-project/src/test/mapred/org/apache/hadoop/tools/TestHarFileSystem.java:375: cannot find symbol
[javac] symbol : class HadoopArchives
[javac] location: class org.apache.hadoop.tools.TestHarFileSystem
[javac] HadoopArchives har = new HadoopArchives(conf);
[javac] ^
[javac] /home/jenkins/jenkins-slave/workspace/Hadoop-Mapreduce-0.23-Commit/trunk/hadoop-mapreduce-project/src/test/mapred/org/apache/hadoop/tools/TestHarFileSystem.java:409: cannot find symbol
[javac] symbol : class HadoopArchives
[javac] location: class org.apache.hadoop.tools.TestHarFileSystem
[javac] HadoopArchives har = new HadoopArchives(conf);
[javac] ^
[javac] /home/jenkins/jenkins-slave/workspace/Hadoop-Mapreduce-0.23-Commit/trunk/hadoop-mapreduce-project/src/test/mapred/org/apache/hadoop/tools/TestHarFileSystem.java:409: cannot find symbol
[javac] symbol : class HadoopArchives
[javac] location: class org.apache.hadoop.tools.TestHarFileSystem
[javac] HadoopArchives har = new HadoopArchives(conf);
[javac] ^
[javac] Note: Some input files use or override a deprecated API.
[javac] Note: Recompile with -Xlint:deprecation for details.
[javac] 13 errors
BUILD FAILED
/home/jenkins/jenkins-slave/workspace/Hadoop-Mapreduce-0.23-Commit/trunk/hadoop-mapreduce-project/build.xml:526: The following error occurred while executing this line:
/home/jenkins/jenkins-slave/workspace/Hadoop-Mapreduce-0.23-Commit/trunk/hadoop-mapreduce-project/build.xml:603: Compile failed; see the compiler error output for details.
Total time: 1 minute 35 seconds
Build step 'Execute shell' marked build as failure
Recording test results
Updating MAPREDUCE-2950
Email was triggered for: Failure
Sending email for trigger: Failure
###################################################################################
############################## FAILED TESTS (if any) ##############################
All tests passed
Hadoop-Mapreduce-0.23-Commit - Build # 296 - Still Failing
Posted by Apache Jenkins Server <je...@builds.apache.org>.
See https://builds.apache.org/job/Hadoop-Mapreduce-0.23-Commit/296/
###################################################################################
########################## LAST 60 LINES OF THE CONSOLE ###########################
[...truncated 14397 lines...]
[javac] HadoopArchives archive = new HadoopArchives(jobConf);
[javac] ^
[javac] /home/jenkins/jenkins-slave/workspace/Hadoop-Mapreduce-0.23-Commit/trunk/hadoop-mapreduce-project/src/test/mapred/org/apache/hadoop/mapred/TestJobQueueClient.java:80: printJobQueueInfo(org.apache.hadoop.mapred.JobQueueInfo,java.io.Writer,java.lang.String) in org.apache.hadoop.mapred.JobQueueClient cannot be applied to (org.apache.hadoop.mapred.JobQueueInfo,java.io.StringWriter)
[javac] client.printJobQueueInfo(root, writer);
[javac] ^
[javac] /home/jenkins/jenkins-slave/workspace/Hadoop-Mapreduce-0.23-Commit/trunk/hadoop-mapreduce-project/src/test/mapred/org/apache/hadoop/tools/TestHarFileSystem.java:177: cannot find symbol
[javac] symbol : class HadoopArchives
[javac] location: class org.apache.hadoop.tools.TestHarFileSystem
[javac] HadoopArchives har = new HadoopArchives(conf);
[javac] ^
[javac] /home/jenkins/jenkins-slave/workspace/Hadoop-Mapreduce-0.23-Commit/trunk/hadoop-mapreduce-project/src/test/mapred/org/apache/hadoop/tools/TestHarFileSystem.java:177: cannot find symbol
[javac] symbol : class HadoopArchives
[javac] location: class org.apache.hadoop.tools.TestHarFileSystem
[javac] HadoopArchives har = new HadoopArchives(conf);
[javac] ^
[javac] /home/jenkins/jenkins-slave/workspace/Hadoop-Mapreduce-0.23-Commit/trunk/hadoop-mapreduce-project/src/test/mapred/org/apache/hadoop/tools/TestHarFileSystem.java:257: cannot find symbol
[javac] symbol : class HadoopArchives
[javac] location: class org.apache.hadoop.tools.TestHarFileSystem
[javac] HadoopArchives har = new HadoopArchives(conf);
[javac] ^
[javac] /home/jenkins/jenkins-slave/workspace/Hadoop-Mapreduce-0.23-Commit/trunk/hadoop-mapreduce-project/src/test/mapred/org/apache/hadoop/tools/TestHarFileSystem.java:257: cannot find symbol
[javac] symbol : class HadoopArchives
[javac] location: class org.apache.hadoop.tools.TestHarFileSystem
[javac] HadoopArchives har = new HadoopArchives(conf);
[javac] ^
[javac] /home/jenkins/jenkins-slave/workspace/Hadoop-Mapreduce-0.23-Commit/trunk/hadoop-mapreduce-project/src/test/mapred/org/apache/hadoop/tools/TestHarFileSystem.java:375: cannot find symbol
[javac] symbol : class HadoopArchives
[javac] location: class org.apache.hadoop.tools.TestHarFileSystem
[javac] HadoopArchives har = new HadoopArchives(conf);
[javac] ^
[javac] /home/jenkins/jenkins-slave/workspace/Hadoop-Mapreduce-0.23-Commit/trunk/hadoop-mapreduce-project/src/test/mapred/org/apache/hadoop/tools/TestHarFileSystem.java:375: cannot find symbol
[javac] symbol : class HadoopArchives
[javac] location: class org.apache.hadoop.tools.TestHarFileSystem
[javac] HadoopArchives har = new HadoopArchives(conf);
[javac] ^
[javac] /home/jenkins/jenkins-slave/workspace/Hadoop-Mapreduce-0.23-Commit/trunk/hadoop-mapreduce-project/src/test/mapred/org/apache/hadoop/tools/TestHarFileSystem.java:409: cannot find symbol
[javac] symbol : class HadoopArchives
[javac] location: class org.apache.hadoop.tools.TestHarFileSystem
[javac] HadoopArchives har = new HadoopArchives(conf);
[javac] ^
[javac] /home/jenkins/jenkins-slave/workspace/Hadoop-Mapreduce-0.23-Commit/trunk/hadoop-mapreduce-project/src/test/mapred/org/apache/hadoop/tools/TestHarFileSystem.java:409: cannot find symbol
[javac] symbol : class HadoopArchives
[javac] location: class org.apache.hadoop.tools.TestHarFileSystem
[javac] HadoopArchives har = new HadoopArchives(conf);
[javac] ^
[javac] Note: Some input files use or override a deprecated API.
[javac] Note: Recompile with -Xlint:deprecation for details.
[javac] 13 errors
BUILD FAILED
/home/jenkins/jenkins-slave/workspace/Hadoop-Mapreduce-0.23-Commit/trunk/hadoop-mapreduce-project/build.xml:526: The following error occurred while executing this line:
/home/jenkins/jenkins-slave/workspace/Hadoop-Mapreduce-0.23-Commit/trunk/hadoop-mapreduce-project/build.xml:603: Compile failed; see the compiler error output for details.
Total time: 1 minute 36 seconds
Build step 'Execute shell' marked build as failure
Recording test results
Updating HDFS-2649
Email was triggered for: Failure
Sending email for trigger: Failure
###################################################################################
############################## FAILED TESTS (if any) ##############################
All tests passed
Hadoop-Mapreduce-0.23-Commit - Build # 295 - Still Failing
Posted by Apache Jenkins Server <je...@builds.apache.org>.
See https://builds.apache.org/job/Hadoop-Mapreduce-0.23-Commit/295/
###################################################################################
########################## LAST 60 LINES OF THE CONSOLE ###########################
[...truncated 14397 lines...]
[javac] HadoopArchives archive = new HadoopArchives(jobConf);
[javac] ^
[javac] /home/jenkins/jenkins-slave/workspace/Hadoop-Mapreduce-0.23-Commit/trunk/hadoop-mapreduce-project/src/test/mapred/org/apache/hadoop/mapred/TestJobQueueClient.java:80: printJobQueueInfo(org.apache.hadoop.mapred.JobQueueInfo,java.io.Writer,java.lang.String) in org.apache.hadoop.mapred.JobQueueClient cannot be applied to (org.apache.hadoop.mapred.JobQueueInfo,java.io.StringWriter)
[javac] client.printJobQueueInfo(root, writer);
[javac] ^
[javac] /home/jenkins/jenkins-slave/workspace/Hadoop-Mapreduce-0.23-Commit/trunk/hadoop-mapreduce-project/src/test/mapred/org/apache/hadoop/tools/TestHarFileSystem.java:177: cannot find symbol
[javac] symbol : class HadoopArchives
[javac] location: class org.apache.hadoop.tools.TestHarFileSystem
[javac] HadoopArchives har = new HadoopArchives(conf);
[javac] ^
[javac] /home/jenkins/jenkins-slave/workspace/Hadoop-Mapreduce-0.23-Commit/trunk/hadoop-mapreduce-project/src/test/mapred/org/apache/hadoop/tools/TestHarFileSystem.java:177: cannot find symbol
[javac] symbol : class HadoopArchives
[javac] location: class org.apache.hadoop.tools.TestHarFileSystem
[javac] HadoopArchives har = new HadoopArchives(conf);
[javac] ^
[javac] /home/jenkins/jenkins-slave/workspace/Hadoop-Mapreduce-0.23-Commit/trunk/hadoop-mapreduce-project/src/test/mapred/org/apache/hadoop/tools/TestHarFileSystem.java:257: cannot find symbol
[javac] symbol : class HadoopArchives
[javac] location: class org.apache.hadoop.tools.TestHarFileSystem
[javac] HadoopArchives har = new HadoopArchives(conf);
[javac] ^
[javac] /home/jenkins/jenkins-slave/workspace/Hadoop-Mapreduce-0.23-Commit/trunk/hadoop-mapreduce-project/src/test/mapred/org/apache/hadoop/tools/TestHarFileSystem.java:257: cannot find symbol
[javac] symbol : class HadoopArchives
[javac] location: class org.apache.hadoop.tools.TestHarFileSystem
[javac] HadoopArchives har = new HadoopArchives(conf);
[javac] ^
[javac] /home/jenkins/jenkins-slave/workspace/Hadoop-Mapreduce-0.23-Commit/trunk/hadoop-mapreduce-project/src/test/mapred/org/apache/hadoop/tools/TestHarFileSystem.java:375: cannot find symbol
[javac] symbol : class HadoopArchives
[javac] location: class org.apache.hadoop.tools.TestHarFileSystem
[javac] HadoopArchives har = new HadoopArchives(conf);
[javac] ^
[javac] /home/jenkins/jenkins-slave/workspace/Hadoop-Mapreduce-0.23-Commit/trunk/hadoop-mapreduce-project/src/test/mapred/org/apache/hadoop/tools/TestHarFileSystem.java:375: cannot find symbol
[javac] symbol : class HadoopArchives
[javac] location: class org.apache.hadoop.tools.TestHarFileSystem
[javac] HadoopArchives har = new HadoopArchives(conf);
[javac] ^
[javac] /home/jenkins/jenkins-slave/workspace/Hadoop-Mapreduce-0.23-Commit/trunk/hadoop-mapreduce-project/src/test/mapred/org/apache/hadoop/tools/TestHarFileSystem.java:409: cannot find symbol
[javac] symbol : class HadoopArchives
[javac] location: class org.apache.hadoop.tools.TestHarFileSystem
[javac] HadoopArchives har = new HadoopArchives(conf);
[javac] ^
[javac] /home/jenkins/jenkins-slave/workspace/Hadoop-Mapreduce-0.23-Commit/trunk/hadoop-mapreduce-project/src/test/mapred/org/apache/hadoop/tools/TestHarFileSystem.java:409: cannot find symbol
[javac] symbol : class HadoopArchives
[javac] location: class org.apache.hadoop.tools.TestHarFileSystem
[javac] HadoopArchives har = new HadoopArchives(conf);
[javac] ^
[javac] Note: Some input files use or override a deprecated API.
[javac] Note: Recompile with -Xlint:deprecation for details.
[javac] 13 errors
BUILD FAILED
/home/jenkins/jenkins-slave/workspace/Hadoop-Mapreduce-0.23-Commit/trunk/hadoop-mapreduce-project/build.xml:526: The following error occurred while executing this line:
/home/jenkins/jenkins-slave/workspace/Hadoop-Mapreduce-0.23-Commit/trunk/hadoop-mapreduce-project/build.xml:603: Compile failed; see the compiler error output for details.
Total time: 1 minute 34 seconds
Build step 'Execute shell' marked build as failure
Recording test results
Updating HDFS-2545
Email was triggered for: Failure
Sending email for trigger: Failure
###################################################################################
############################## FAILED TESTS (if any) ##############################
All tests passed
Hadoop-Mapreduce-0.23-Commit - Build # 294 - Still Failing
Posted by Apache Jenkins Server <je...@builds.apache.org>.
See https://builds.apache.org/job/Hadoop-Mapreduce-0.23-Commit/294/
###################################################################################
########################## LAST 60 LINES OF THE CONSOLE ###########################
[...truncated 14394 lines...]
[javac] HadoopArchives archive = new HadoopArchives(jobConf);
[javac] ^
[javac] /home/jenkins/jenkins-slave/workspace/Hadoop-Mapreduce-0.23-Commit/trunk/hadoop-mapreduce-project/src/test/mapred/org/apache/hadoop/mapred/TestJobQueueClient.java:80: printJobQueueInfo(org.apache.hadoop.mapred.JobQueueInfo,java.io.Writer,java.lang.String) in org.apache.hadoop.mapred.JobQueueClient cannot be applied to (org.apache.hadoop.mapred.JobQueueInfo,java.io.StringWriter)
[javac] client.printJobQueueInfo(root, writer);
[javac] ^
[javac] /home/jenkins/jenkins-slave/workspace/Hadoop-Mapreduce-0.23-Commit/trunk/hadoop-mapreduce-project/src/test/mapred/org/apache/hadoop/tools/TestHarFileSystem.java:177: cannot find symbol
[javac] symbol : class HadoopArchives
[javac] location: class org.apache.hadoop.tools.TestHarFileSystem
[javac] HadoopArchives har = new HadoopArchives(conf);
[javac] ^
[javac] /home/jenkins/jenkins-slave/workspace/Hadoop-Mapreduce-0.23-Commit/trunk/hadoop-mapreduce-project/src/test/mapred/org/apache/hadoop/tools/TestHarFileSystem.java:177: cannot find symbol
[javac] symbol : class HadoopArchives
[javac] location: class org.apache.hadoop.tools.TestHarFileSystem
[javac] HadoopArchives har = new HadoopArchives(conf);
[javac] ^
[javac] /home/jenkins/jenkins-slave/workspace/Hadoop-Mapreduce-0.23-Commit/trunk/hadoop-mapreduce-project/src/test/mapred/org/apache/hadoop/tools/TestHarFileSystem.java:257: cannot find symbol
[javac] symbol : class HadoopArchives
[javac] location: class org.apache.hadoop.tools.TestHarFileSystem
[javac] HadoopArchives har = new HadoopArchives(conf);
[javac] ^
[javac] /home/jenkins/jenkins-slave/workspace/Hadoop-Mapreduce-0.23-Commit/trunk/hadoop-mapreduce-project/src/test/mapred/org/apache/hadoop/tools/TestHarFileSystem.java:257: cannot find symbol
[javac] symbol : class HadoopArchives
[javac] location: class org.apache.hadoop.tools.TestHarFileSystem
[javac] HadoopArchives har = new HadoopArchives(conf);
[javac] ^
[javac] /home/jenkins/jenkins-slave/workspace/Hadoop-Mapreduce-0.23-Commit/trunk/hadoop-mapreduce-project/src/test/mapred/org/apache/hadoop/tools/TestHarFileSystem.java:375: cannot find symbol
[javac] symbol : class HadoopArchives
[javac] location: class org.apache.hadoop.tools.TestHarFileSystem
[javac] HadoopArchives har = new HadoopArchives(conf);
[javac] ^
[javac] /home/jenkins/jenkins-slave/workspace/Hadoop-Mapreduce-0.23-Commit/trunk/hadoop-mapreduce-project/src/test/mapred/org/apache/hadoop/tools/TestHarFileSystem.java:375: cannot find symbol
[javac] symbol : class HadoopArchives
[javac] location: class org.apache.hadoop.tools.TestHarFileSystem
[javac] HadoopArchives har = new HadoopArchives(conf);
[javac] ^
[javac] /home/jenkins/jenkins-slave/workspace/Hadoop-Mapreduce-0.23-Commit/trunk/hadoop-mapreduce-project/src/test/mapred/org/apache/hadoop/tools/TestHarFileSystem.java:409: cannot find symbol
[javac] symbol : class HadoopArchives
[javac] location: class org.apache.hadoop.tools.TestHarFileSystem
[javac] HadoopArchives har = new HadoopArchives(conf);
[javac] ^
[javac] /home/jenkins/jenkins-slave/workspace/Hadoop-Mapreduce-0.23-Commit/trunk/hadoop-mapreduce-project/src/test/mapred/org/apache/hadoop/tools/TestHarFileSystem.java:409: cannot find symbol
[javac] symbol : class HadoopArchives
[javac] location: class org.apache.hadoop.tools.TestHarFileSystem
[javac] HadoopArchives har = new HadoopArchives(conf);
[javac] ^
[javac] Note: Some input files use or override a deprecated API.
[javac] Note: Recompile with -Xlint:deprecation for details.
[javac] 13 errors
BUILD FAILED
/home/jenkins/jenkins-slave/workspace/Hadoop-Mapreduce-0.23-Commit/trunk/hadoop-mapreduce-project/build.xml:526: The following error occurred while executing this line:
/home/jenkins/jenkins-slave/workspace/Hadoop-Mapreduce-0.23-Commit/trunk/hadoop-mapreduce-project/build.xml:603: Compile failed; see the compiler error output for details.
Total time: 1 minute 36 seconds
Build step 'Execute shell' marked build as failure
Recording test results
Updating MAPREDUCE-3544
Email was triggered for: Failure
Sending email for trigger: Failure
###################################################################################
############################## FAILED TESTS (if any) ##############################
All tests passed
Hadoop-Mapreduce-0.23-Commit - Build # 293 - Still Failing
Posted by Apache Jenkins Server <je...@builds.apache.org>.
See https://builds.apache.org/job/Hadoop-Mapreduce-0.23-Commit/293/
###################################################################################
########################## LAST 60 LINES OF THE CONSOLE ###########################
[...truncated 14450 lines...]
[javac] HadoopArchives archive = new HadoopArchives(jobConf);
[javac] ^
[javac] /home/jenkins/jenkins-slave/workspace/Hadoop-Mapreduce-0.23-Commit/trunk/hadoop-mapreduce-project/src/test/mapred/org/apache/hadoop/mapred/TestJobQueueClient.java:80: printJobQueueInfo(org.apache.hadoop.mapred.JobQueueInfo,java.io.Writer,java.lang.String) in org.apache.hadoop.mapred.JobQueueClient cannot be applied to (org.apache.hadoop.mapred.JobQueueInfo,java.io.StringWriter)
[javac] client.printJobQueueInfo(root, writer);
[javac] ^
[javac] /home/jenkins/jenkins-slave/workspace/Hadoop-Mapreduce-0.23-Commit/trunk/hadoop-mapreduce-project/src/test/mapred/org/apache/hadoop/tools/TestHarFileSystem.java:177: cannot find symbol
[javac] symbol : class HadoopArchives
[javac] location: class org.apache.hadoop.tools.TestHarFileSystem
[javac] HadoopArchives har = new HadoopArchives(conf);
[javac] ^
[javac] /home/jenkins/jenkins-slave/workspace/Hadoop-Mapreduce-0.23-Commit/trunk/hadoop-mapreduce-project/src/test/mapred/org/apache/hadoop/tools/TestHarFileSystem.java:177: cannot find symbol
[javac] symbol : class HadoopArchives
[javac] location: class org.apache.hadoop.tools.TestHarFileSystem
[javac] HadoopArchives har = new HadoopArchives(conf);
[javac] ^
[javac] /home/jenkins/jenkins-slave/workspace/Hadoop-Mapreduce-0.23-Commit/trunk/hadoop-mapreduce-project/src/test/mapred/org/apache/hadoop/tools/TestHarFileSystem.java:257: cannot find symbol
[javac] symbol : class HadoopArchives
[javac] location: class org.apache.hadoop.tools.TestHarFileSystem
[javac] HadoopArchives har = new HadoopArchives(conf);
[javac] ^
[javac] /home/jenkins/jenkins-slave/workspace/Hadoop-Mapreduce-0.23-Commit/trunk/hadoop-mapreduce-project/src/test/mapred/org/apache/hadoop/tools/TestHarFileSystem.java:257: cannot find symbol
[javac] symbol : class HadoopArchives
[javac] location: class org.apache.hadoop.tools.TestHarFileSystem
[javac] HadoopArchives har = new HadoopArchives(conf);
[javac] ^
[javac] /home/jenkins/jenkins-slave/workspace/Hadoop-Mapreduce-0.23-Commit/trunk/hadoop-mapreduce-project/src/test/mapred/org/apache/hadoop/tools/TestHarFileSystem.java:375: cannot find symbol
[javac] symbol : class HadoopArchives
[javac] location: class org.apache.hadoop.tools.TestHarFileSystem
[javac] HadoopArchives har = new HadoopArchives(conf);
[javac] ^
[javac] /home/jenkins/jenkins-slave/workspace/Hadoop-Mapreduce-0.23-Commit/trunk/hadoop-mapreduce-project/src/test/mapred/org/apache/hadoop/tools/TestHarFileSystem.java:375: cannot find symbol
[javac] symbol : class HadoopArchives
[javac] location: class org.apache.hadoop.tools.TestHarFileSystem
[javac] HadoopArchives har = new HadoopArchives(conf);
[javac] ^
[javac] /home/jenkins/jenkins-slave/workspace/Hadoop-Mapreduce-0.23-Commit/trunk/hadoop-mapreduce-project/src/test/mapred/org/apache/hadoop/tools/TestHarFileSystem.java:409: cannot find symbol
[javac] symbol : class HadoopArchives
[javac] location: class org.apache.hadoop.tools.TestHarFileSystem
[javac] HadoopArchives har = new HadoopArchives(conf);
[javac] ^
[javac] /home/jenkins/jenkins-slave/workspace/Hadoop-Mapreduce-0.23-Commit/trunk/hadoop-mapreduce-project/src/test/mapred/org/apache/hadoop/tools/TestHarFileSystem.java:409: cannot find symbol
[javac] symbol : class HadoopArchives
[javac] location: class org.apache.hadoop.tools.TestHarFileSystem
[javac] HadoopArchives har = new HadoopArchives(conf);
[javac] ^
[javac] Note: Some input files use or override a deprecated API.
[javac] Note: Recompile with -Xlint:deprecation for details.
[javac] 13 errors
BUILD FAILED
/home/jenkins/jenkins-slave/workspace/Hadoop-Mapreduce-0.23-Commit/trunk/hadoop-mapreduce-project/build.xml:526: The following error occurred while executing this line:
/home/jenkins/jenkins-slave/workspace/Hadoop-Mapreduce-0.23-Commit/trunk/hadoop-mapreduce-project/build.xml:603: Compile failed; see the compiler error output for details.
Total time: 1 minute 36 seconds
Build step 'Execute shell' marked build as failure
Recording test results
Updating MAPREDUCE-3426
Email was triggered for: Failure
Sending email for trigger: Failure
###################################################################################
############################## FAILED TESTS (if any) ##############################
All tests passed
Hadoop-Mapreduce-0.23-Commit - Build # 292 - Still Failing
Posted by Apache Jenkins Server <je...@builds.apache.org>.
See https://builds.apache.org/job/Hadoop-Mapreduce-0.23-Commit/292/
###################################################################################
########################## LAST 60 LINES OF THE CONSOLE ###########################
[...truncated 19946 lines...]
[javac] HadoopArchives archive = new HadoopArchives(jobConf);
[javac] ^
[javac] /home/jenkins/jenkins-slave/workspace/Hadoop-Mapreduce-0.23-Commit/trunk/hadoop-mapreduce-project/src/test/mapred/org/apache/hadoop/mapred/TestJobQueueClient.java:80: printJobQueueInfo(org.apache.hadoop.mapred.JobQueueInfo,java.io.Writer,java.lang.String) in org.apache.hadoop.mapred.JobQueueClient cannot be applied to (org.apache.hadoop.mapred.JobQueueInfo,java.io.StringWriter)
[javac] client.printJobQueueInfo(root, writer);
[javac] ^
[javac] /home/jenkins/jenkins-slave/workspace/Hadoop-Mapreduce-0.23-Commit/trunk/hadoop-mapreduce-project/src/test/mapred/org/apache/hadoop/tools/TestHarFileSystem.java:177: cannot find symbol
[javac] symbol : class HadoopArchives
[javac] location: class org.apache.hadoop.tools.TestHarFileSystem
[javac] HadoopArchives har = new HadoopArchives(conf);
[javac] ^
[javac] /home/jenkins/jenkins-slave/workspace/Hadoop-Mapreduce-0.23-Commit/trunk/hadoop-mapreduce-project/src/test/mapred/org/apache/hadoop/tools/TestHarFileSystem.java:177: cannot find symbol
[javac] symbol : class HadoopArchives
[javac] location: class org.apache.hadoop.tools.TestHarFileSystem
[javac] HadoopArchives har = new HadoopArchives(conf);
[javac] ^
[javac] /home/jenkins/jenkins-slave/workspace/Hadoop-Mapreduce-0.23-Commit/trunk/hadoop-mapreduce-project/src/test/mapred/org/apache/hadoop/tools/TestHarFileSystem.java:257: cannot find symbol
[javac] symbol : class HadoopArchives
[javac] location: class org.apache.hadoop.tools.TestHarFileSystem
[javac] HadoopArchives har = new HadoopArchives(conf);
[javac] ^
[javac] /home/jenkins/jenkins-slave/workspace/Hadoop-Mapreduce-0.23-Commit/trunk/hadoop-mapreduce-project/src/test/mapred/org/apache/hadoop/tools/TestHarFileSystem.java:257: cannot find symbol
[javac] symbol : class HadoopArchives
[javac] location: class org.apache.hadoop.tools.TestHarFileSystem
[javac] HadoopArchives har = new HadoopArchives(conf);
[javac] ^
[javac] /home/jenkins/jenkins-slave/workspace/Hadoop-Mapreduce-0.23-Commit/trunk/hadoop-mapreduce-project/src/test/mapred/org/apache/hadoop/tools/TestHarFileSystem.java:375: cannot find symbol
[javac] symbol : class HadoopArchives
[javac] location: class org.apache.hadoop.tools.TestHarFileSystem
[javac] HadoopArchives har = new HadoopArchives(conf);
[javac] ^
[javac] /home/jenkins/jenkins-slave/workspace/Hadoop-Mapreduce-0.23-Commit/trunk/hadoop-mapreduce-project/src/test/mapred/org/apache/hadoop/tools/TestHarFileSystem.java:375: cannot find symbol
[javac] symbol : class HadoopArchives
[javac] location: class org.apache.hadoop.tools.TestHarFileSystem
[javac] HadoopArchives har = new HadoopArchives(conf);
[javac] ^
[javac] /home/jenkins/jenkins-slave/workspace/Hadoop-Mapreduce-0.23-Commit/trunk/hadoop-mapreduce-project/src/test/mapred/org/apache/hadoop/tools/TestHarFileSystem.java:409: cannot find symbol
[javac] symbol : class HadoopArchives
[javac] location: class org.apache.hadoop.tools.TestHarFileSystem
[javac] HadoopArchives har = new HadoopArchives(conf);
[javac] ^
[javac] /home/jenkins/jenkins-slave/workspace/Hadoop-Mapreduce-0.23-Commit/trunk/hadoop-mapreduce-project/src/test/mapred/org/apache/hadoop/tools/TestHarFileSystem.java:409: cannot find symbol
[javac] symbol : class HadoopArchives
[javac] location: class org.apache.hadoop.tools.TestHarFileSystem
[javac] HadoopArchives har = new HadoopArchives(conf);
[javac] ^
[javac] Note: Some input files use or override a deprecated API.
[javac] Note: Recompile with -Xlint:deprecation for details.
[javac] 13 errors
BUILD FAILED
/home/jenkins/jenkins-slave/workspace/Hadoop-Mapreduce-0.23-Commit/trunk/hadoop-mapreduce-project/build.xml:526: The following error occurred while executing this line:
/home/jenkins/jenkins-slave/workspace/Hadoop-Mapreduce-0.23-Commit/trunk/hadoop-mapreduce-project/build.xml:603: Compile failed; see the compiler error output for details.
Total time: 1 minute 35 seconds
Build step 'Execute shell' marked build as failure
Recording test results
Updating MAPREDUCE-2863
Email was triggered for: Failure
Sending email for trigger: Failure
###################################################################################
############################## FAILED TESTS (if any) ##############################
All tests passed
Hadoop-Mapreduce-0.23-Commit - Build # 291 - Still Failing
Posted by Apache Jenkins Server <je...@builds.apache.org>.
See https://builds.apache.org/job/Hadoop-Mapreduce-0.23-Commit/291/
###################################################################################
########################## LAST 60 LINES OF THE CONSOLE ###########################
[...truncated 14302 lines...]
[javac] HadoopArchives archive = new HadoopArchives(jobConf);
[javac] ^
[javac] /home/jenkins/jenkins-slave/workspace/Hadoop-Mapreduce-0.23-Commit/trunk/hadoop-mapreduce-project/src/test/mapred/org/apache/hadoop/mapred/TestJobQueueClient.java:80: printJobQueueInfo(org.apache.hadoop.mapred.JobQueueInfo,java.io.Writer,java.lang.String) in org.apache.hadoop.mapred.JobQueueClient cannot be applied to (org.apache.hadoop.mapred.JobQueueInfo,java.io.StringWriter)
[javac] client.printJobQueueInfo(root, writer);
[javac] ^
[javac] /home/jenkins/jenkins-slave/workspace/Hadoop-Mapreduce-0.23-Commit/trunk/hadoop-mapreduce-project/src/test/mapred/org/apache/hadoop/tools/TestHarFileSystem.java:177: cannot find symbol
[javac] symbol : class HadoopArchives
[javac] location: class org.apache.hadoop.tools.TestHarFileSystem
[javac] HadoopArchives har = new HadoopArchives(conf);
[javac] ^
[javac] /home/jenkins/jenkins-slave/workspace/Hadoop-Mapreduce-0.23-Commit/trunk/hadoop-mapreduce-project/src/test/mapred/org/apache/hadoop/tools/TestHarFileSystem.java:177: cannot find symbol
[javac] symbol : class HadoopArchives
[javac] location: class org.apache.hadoop.tools.TestHarFileSystem
[javac] HadoopArchives har = new HadoopArchives(conf);
[javac] ^
[javac] /home/jenkins/jenkins-slave/workspace/Hadoop-Mapreduce-0.23-Commit/trunk/hadoop-mapreduce-project/src/test/mapred/org/apache/hadoop/tools/TestHarFileSystem.java:257: cannot find symbol
[javac] symbol : class HadoopArchives
[javac] location: class org.apache.hadoop.tools.TestHarFileSystem
[javac] HadoopArchives har = new HadoopArchives(conf);
[javac] ^
[javac] /home/jenkins/jenkins-slave/workspace/Hadoop-Mapreduce-0.23-Commit/trunk/hadoop-mapreduce-project/src/test/mapred/org/apache/hadoop/tools/TestHarFileSystem.java:257: cannot find symbol
[javac] symbol : class HadoopArchives
[javac] location: class org.apache.hadoop.tools.TestHarFileSystem
[javac] HadoopArchives har = new HadoopArchives(conf);
[javac] ^
[javac] /home/jenkins/jenkins-slave/workspace/Hadoop-Mapreduce-0.23-Commit/trunk/hadoop-mapreduce-project/src/test/mapred/org/apache/hadoop/tools/TestHarFileSystem.java:375: cannot find symbol
[javac] symbol : class HadoopArchives
[javac] location: class org.apache.hadoop.tools.TestHarFileSystem
[javac] HadoopArchives har = new HadoopArchives(conf);
[javac] ^
[javac] /home/jenkins/jenkins-slave/workspace/Hadoop-Mapreduce-0.23-Commit/trunk/hadoop-mapreduce-project/src/test/mapred/org/apache/hadoop/tools/TestHarFileSystem.java:375: cannot find symbol
[javac] symbol : class HadoopArchives
[javac] location: class org.apache.hadoop.tools.TestHarFileSystem
[javac] HadoopArchives har = new HadoopArchives(conf);
[javac] ^
[javac] /home/jenkins/jenkins-slave/workspace/Hadoop-Mapreduce-0.23-Commit/trunk/hadoop-mapreduce-project/src/test/mapred/org/apache/hadoop/tools/TestHarFileSystem.java:409: cannot find symbol
[javac] symbol : class HadoopArchives
[javac] location: class org.apache.hadoop.tools.TestHarFileSystem
[javac] HadoopArchives har = new HadoopArchives(conf);
[javac] ^
[javac] /home/jenkins/jenkins-slave/workspace/Hadoop-Mapreduce-0.23-Commit/trunk/hadoop-mapreduce-project/src/test/mapred/org/apache/hadoop/tools/TestHarFileSystem.java:409: cannot find symbol
[javac] symbol : class HadoopArchives
[javac] location: class org.apache.hadoop.tools.TestHarFileSystem
[javac] HadoopArchives har = new HadoopArchives(conf);
[javac] ^
[javac] Note: Some input files use or override a deprecated API.
[javac] Note: Recompile with -Xlint:deprecation for details.
[javac] 13 errors
BUILD FAILED
/home/jenkins/jenkins-slave/workspace/Hadoop-Mapreduce-0.23-Commit/trunk/hadoop-mapreduce-project/build.xml:526: The following error occurred while executing this line:
/home/jenkins/jenkins-slave/workspace/Hadoop-Mapreduce-0.23-Commit/trunk/hadoop-mapreduce-project/build.xml:603: Compile failed; see the compiler error output for details.
Total time: 1 minute 35 seconds
Build step 'Execute shell' marked build as failure
Recording test results
Updating HADOOP-7810
Email was triggered for: Failure
Sending email for trigger: Failure
###################################################################################
############################## FAILED TESTS (if any) ##############################
All tests passed
Hadoop-Mapreduce-0.23-Commit - Build # 290 - Still Failing
Posted by Apache Jenkins Server <je...@builds.apache.org>.
See https://builds.apache.org/job/Hadoop-Mapreduce-0.23-Commit/290/
###################################################################################
########################## LAST 60 LINES OF THE CONSOLE ###########################
[...truncated 14176 lines...]
[exec] make[1]: Nothing to be done for `install-data-am'.
[exec] make[1]: Leaving directory `/home/jenkins/jenkins-slave/workspace/Hadoop-Mapreduce-0.23-Commit/trunk/hadoop-mapreduce-project/build/c++-build/Linux-i386-32/examples/pipes'
compile-c++-examples:
compile-examples:
ivy-resolve-test:
[ivy:resolve] downloading /home/jenkins/.m2/repository/org/apache/hadoop/hadoop-hdfs/0.23.1-SNAPSHOT/hadoop-hdfs-0.23.1-SNAPSHOT-tests.jar ...
[ivy:resolve] ................... (1094kB)
[ivy:resolve] [SUCCESSFUL ] org.apache.hadoop#hadoop-hdfs;0.23.1-SNAPSHOT!hadoop-hdfs.jar(tests) (3ms)
[ivy:resolve] downloading /home/jenkins/.m2/repository/junit/junit/4.8.1/junit-4.8.1.jar ...
[ivy:resolve] ..... (231kB)
[ivy:resolve] .. (0kB)
[ivy:resolve] [SUCCESSFUL ] junit#junit;4.8.1!junit.jar (4ms)
[ivy:resolve] downloading http://repo1.maven.org/maven2/org/mockito/mockito-all/1.8.2/mockito-all-1.8.2.jar ...
[ivy:resolve] ...................................................................................................................................................................................................................................................................................................................................................................................................................................................................................................................................................................................................................................................................................................................................................................................................................................................................................................................................................................................................................................................................................................................................................................................................................................................................................................................................................................................................................................................................................................................................................................................................................................................................................................................................................................................................................................................................................................................................................................................................................................................................................................................................................................................................................................................................................................................................................................................................................................................................................................................... (1315kB)
[ivy:resolve] .. (0kB)
[ivy:resolve] [SUCCESSFUL ] org.mockito#mockito-all;1.8.2!mockito-all.jar (1600ms)
[ivy:resolve] downloading http://repo1.maven.org/maven2/org/mortbay/jetty/jetty-servlet-tester/6.1.14/jetty-servlet-tester-6.1.14.jar ...
[ivy:resolve] ................ (8kB)
[ivy:resolve] .. (0kB)
[ivy:resolve] [SUCCESSFUL ] org.mortbay.jetty#jetty-servlet-tester;6.1.14!jetty-servlet-tester.jar (1004ms)
[ivy:resolve] downloading /home/jenkins/.m2/repository/log4j/log4j/1.2.15/log4j-1.2.15.jar ...
[ivy:resolve] ....... (382kB)
[ivy:resolve] .. (0kB)
[ivy:resolve] [SUCCESSFUL ] log4j#log4j;1.2.15!log4j.jar (6ms)
[ivy:resolve] downloading /home/jenkins/.m2/repository/org/slf4j/slf4j-api/1.5.11/slf4j-api-1.5.11.jar ...
[ivy:resolve] .. (23kB)
[ivy:resolve] .. (0kB)
[ivy:resolve] [SUCCESSFUL ] org.slf4j#slf4j-api;1.5.11!slf4j-api.jar (2ms)
[ivy:resolve] downloading /home/jenkins/.m2/repository/org/slf4j/slf4j-log4j12/1.5.11/slf4j-log4j12-1.5.11.jar ...
[ivy:resolve] .. (9kB)
[ivy:resolve] .. (0kB)
[ivy:resolve] [SUCCESSFUL ] org.slf4j#slf4j-log4j12;1.5.11!slf4j-log4j12.jar (2ms)
ivy-retrieve-test:
compile-mapred-test:
[mkdir] Created dir: /home/jenkins/jenkins-slave/workspace/Hadoop-Mapreduce-0.23-Commit/trunk/hadoop-mapreduce-project/build/test/mapred/classes
[mkdir] Created dir: /home/jenkins/jenkins-slave/workspace/Hadoop-Mapreduce-0.23-Commit/trunk/hadoop-mapreduce-project/build/test/mapred/testjar
[mkdir] Created dir: /home/jenkins/jenkins-slave/workspace/Hadoop-Mapreduce-0.23-Commit/trunk/hadoop-mapreduce-project/build/test/mapred/testshell
[javac] Compiling 305 source files to /home/jenkins/jenkins-slave/workspace/Hadoop-Mapreduce-0.23-Commit/trunk/hadoop-mapreduce-project/build/test/mapred/classes
[javac] /home/jenkins/jenkins-slave/workspace/Hadoop-Mapreduce-0.23-Commit/trunk/hadoop-mapreduce-project/src/test/mapred/org/apache/hadoop/mapred/TestJobQueueClient.java:80: printJobQueueInfo(org.apache.hadoop.mapred.JobQueueInfo,java.io.Writer,java.lang.String) in org.apache.hadoop.mapred.JobQueueClient cannot be applied to (org.apache.hadoop.mapred.JobQueueInfo,java.io.StringWriter)
[javac] client.printJobQueueInfo(root, writer);
[javac] ^
[javac] Note: Some input files use or override a deprecated API.
[javac] Note: Recompile with -Xlint:deprecation for details.
[javac] 1 error
BUILD FAILED
/home/jenkins/jenkins-slave/workspace/Hadoop-Mapreduce-0.23-Commit/trunk/hadoop-mapreduce-project/build.xml:526: The following error occurred while executing this line:
/home/jenkins/jenkins-slave/workspace/Hadoop-Mapreduce-0.23-Commit/trunk/hadoop-mapreduce-project/build.xml:603: Compile failed; see the compiler error output for details.
Total time: 1 minute 39 seconds
Build step 'Execute shell' marked build as failure
Recording test results
Email was triggered for: Failure
Sending email for trigger: Failure
###################################################################################
############################## FAILED TESTS (if any) ##############################
All tests passed