You are viewing a plain text version of this content. The canonical link for it is here.
Posted to yarn-dev@hadoop.apache.org by Apache Jenkins Server <je...@builds.apache.org> on 2014/11/26 02:50:42 UTC

Failed: YARN-221 PreCommit Build #5940

Jira: https://issues.apache.org/jira/browse/YARN-221
Build: https://builds.apache.org/job/PreCommit-YARN-Build/5940/

###################################################################################
########################## LAST 60 LINES OF THE CONSOLE ###########################
[...truncated 19 lines...]
[PreCommit-YARN-Build] $ /bin/bash /tmp/hudson6467458843795973229.sh
Running in Jenkins mode


======================================================================
======================================================================
    Testing patch for YARN-221.
======================================================================
======================================================================


HEAD is now at a655973 Revert "MAPREDUCE-5785. Derive heap size or mapreduce.*.memory.mb automatically. (Gera Shegalov and Karthik Kambatla via kasha)"
Switched to branch 'trunk'
Your branch is up-to-date with 'origin/trunk'.
Current branch trunk is up to date.
YARN-221 patch is being downloaded at Wed Nov 26 01:50:30 UTC 2014 from
http://issues.apache.org/jira/secure/attachment/12637905/YARN-221-trunk-v2.patch
cp: cannot stat '/home/jenkins/buildSupport/lib/*': No such file or directory
The patch does not appear to apply with p0 to p2
PATCH APPLICATION FAILED




{color:red}-1 overall{color}.  Here are the results of testing the latest attachment 
  http://issues.apache.org/jira/secure/attachment/12637905/YARN-221-trunk-v2.patch
  against trunk revision a655973.

    {color:red}-1 patch{color}.  The patch command could not apply the patch.

Console output: https://builds.apache.org/job/PreCommit-YARN-Build/5940//console

This message is automatically generated.


======================================================================
======================================================================
    Adding comment to Jira.
======================================================================
======================================================================


Comment added.
3355ac65d8e9fab02502ca598842a52119d427ba logged out


======================================================================
======================================================================
    Finished build.
======================================================================
======================================================================


Build step 'Execute shell' marked build as failure
Archiving artifacts
Description set: MAPREDUCE-5785
Recording test results
Email was triggered for: Failure
Sending email for trigger: Failure



###################################################################################
############################## FAILED TESTS (if any) ##############################
No tests ran.

Failed: YARN-2136 PreCommit Build #5943

Posted by Apache Jenkins Server <je...@builds.apache.org>.
Jira: https://issues.apache.org/jira/browse/YARN-2136
Build: https://builds.apache.org/job/PreCommit-YARN-Build/5943/

###################################################################################
########################## LAST 60 LINES OF THE CONSOLE ###########################
[...truncated 3599 lines...]
  against trunk revision aa7dac3.

    {color:green}+1 @author{color}.  The patch does not contain any @author tags.

    {color:green}+1 tests included{color}.  The patch appears to include 1 new or modified test files.

    {color:green}+1 javac{color}.  The applied patch does not increase the total number of javac compiler warnings.

    {color:green}+1 javadoc{color}.  There were no new javadoc warning messages.

    {color:green}+1 eclipse:eclipse{color}.  The patch built with eclipse:eclipse.

    {color:green}+1 findbugs{color}.  The patch does not introduce any new Findbugs (version 2.0.3) warnings.

    {color:green}+1 release audit{color}.  The applied patch does not increase the total number of release audit warnings.

    {color:red}-1 core tests{color}.  The patch failed these unit tests in hadoop-yarn-project/hadoop-yarn/hadoop-yarn-server/hadoop-yarn-server-resourcemanager:

                  org.apache.hadoop.yarn.server.resourcemanager.TestRM
                  org.apache.hadoop.yarn.server.resourcemanager.TestWorkPreservingRMRestart

    {color:green}+1 contrib tests{color}.  The patch passed contrib unit tests.

Test results: https://builds.apache.org/job/PreCommit-YARN-Build/5943//testReport/
Console output: https://builds.apache.org/job/PreCommit-YARN-Build/5943//console

This message is automatically generated.


======================================================================
======================================================================
    Adding comment to Jira.
======================================================================
======================================================================


Comment added.
66fb14289ccb8998847c35b09733f7e4ebb6a136 logged out


======================================================================
======================================================================
    Finished build.
======================================================================
======================================================================


Build step 'Execute shell' marked build as failure
Archiving artifacts
Sending artifact delta relative to PreCommit-YARN-Build #4749
Archived 15 artifacts
Archive block size is 32768
Received 0 blocks and 9046177 bytes
Compression is 0.0%
Took 2.9 sec
[description-setter] Could not determine description.
Recording test results
Email was triggered for: Failure
Sending email for trigger: Failure



###################################################################################
############################## FAILED TESTS (if any) ##############################
No tests ran.

Failed: YARN-2907 PreCommit Build #5942

Posted by Apache Jenkins Server <je...@builds.apache.org>.
Jira: https://issues.apache.org/jira/browse/YARN-2907
Build: https://builds.apache.org/job/PreCommit-YARN-Build/5942/

###################################################################################
########################## LAST 60 LINES OF THE CONSOLE ###########################
[...truncated 3465 lines...]

    {color:green}+1 @author{color}.  The patch does not contain any @author tags.

    {color:red}-1 tests included{color}.  The patch doesn't appear to include any new or modified tests.
                        Please justify why no new tests are needed for this patch.
                        Also please list what manual steps were performed to verify this patch.

    {color:green}+1 javac{color}.  The applied patch does not increase the total number of javac compiler warnings.

    {color:green}+1 javadoc{color}.  There were no new javadoc warning messages.

    {color:green}+1 eclipse:eclipse{color}.  The patch built with eclipse:eclipse.

    {color:green}+1 findbugs{color}.  The patch does not introduce any new Findbugs (version 2.0.3) warnings.

    {color:green}+1 release audit{color}.  The applied patch does not increase the total number of release audit warnings.

    {color:red}-1 core tests{color}.  The patch failed these unit tests in hadoop-yarn-project/hadoop-yarn/hadoop-yarn-server/hadoop-yarn-server-resourcemanager:

                  org.apache.hadoop.yarn.server.resourcemanager.TestRM

    {color:green}+1 contrib tests{color}.  The patch passed contrib unit tests.

Test results: https://builds.apache.org/job/PreCommit-YARN-Build/5942//testReport/
Console output: https://builds.apache.org/job/PreCommit-YARN-Build/5942//console

This message is automatically generated.


======================================================================
======================================================================
    Adding comment to Jira.
======================================================================
======================================================================


Comment added.
05901cb9e65d413fff065602c3e26bdd9c4f376d logged out


======================================================================
======================================================================
    Finished build.
======================================================================
======================================================================


Build step 'Execute shell' marked build as failure
Archiving artifacts
Sending artifact delta relative to PreCommit-YARN-Build #4749
Archived 15 artifacts
Archive block size is 32768
Received 0 blocks and 9037637 bytes
Compression is 0.0%
Took 2.8 sec
[description-setter] Could not determine description.
Recording test results
Email was triggered for: Failure
Sending email for trigger: Failure



###################################################################################
############################## FAILED TESTS (if any) ##############################
No tests ran.

Failed: YARN-2892 PreCommit Build #5941

Posted by Apache Jenkins Server <je...@builds.apache.org>.
Jira: https://issues.apache.org/jira/browse/YARN-2892
Build: https://builds.apache.org/job/PreCommit-YARN-Build/5941/

###################################################################################
########################## LAST 60 LINES OF THE CONSOLE ###########################
[...truncated 3312 lines...]
{color:green}+1 overall{color}.  Here are the results of testing the latest attachment 
  http://issues.apache.org/jira/secure/attachment/12683754/YARN-2892.patch
  against trunk revision a655973.

    {color:green}+1 @author{color}.  The patch does not contain any @author tags.

    {color:green}+1 tests included{color}.  The patch appears to include 1 new or modified test files.

    {color:green}+1 javac{color}.  The applied patch does not increase the total number of javac compiler warnings.

    {color:green}+1 javadoc{color}.  There were no new javadoc warning messages.

    {color:green}+1 eclipse:eclipse{color}.  The patch built with eclipse:eclipse.

    {color:green}+1 findbugs{color}.  The patch does not introduce any new Findbugs (version 2.0.3) warnings.

    {color:green}+1 release audit{color}.  The applied patch does not increase the total number of release audit warnings.

    {color:green}+1 core tests{color}.  The patch passed unit tests in hadoop-yarn-project/hadoop-yarn/hadoop-yarn-server/hadoop-yarn-server-resourcemanager.

    {color:green}+1 contrib tests{color}.  The patch passed contrib unit tests.

Test results: https://builds.apache.org/job/PreCommit-YARN-Build/5941//testReport/
Console output: https://builds.apache.org/job/PreCommit-YARN-Build/5941//console

This message is automatically generated.


======================================================================
======================================================================
    Adding comment to Jira.
======================================================================
======================================================================


Comment added.
3c4aaf509419473c8bcd31b4d0dd9a10183e21f3 logged out


======================================================================
======================================================================
    Finished build.
======================================================================
======================================================================


Archiving artifacts
Sending artifact delta relative to PreCommit-YARN-Build #4749
Archived 15 artifacts
Archive block size is 32768
Received 0 blocks and 9029132 bytes
Compression is 0.0%
Took 3 sec
Description set: YARN-2892
Recording test results
No test report files were found. Configuration error?
Build step 'Publish JUnit test result report' changed build result to FAILURE
Email was triggered for: Failure
Sending email for trigger: Failure



###################################################################################
############################## FAILED TESTS (if any) ##############################
No tests ran.