You are viewing a plain text version of this content. The canonical link for it is here.
Posted to commits@phoenix.apache.org by Apache Jenkins Server <je...@builds.apache.org> on 2015/11/09 21:15:06 UTC
Build failed in Jenkins: Phoenix | Master #943
See <https://builds.apache.org/job/Phoenix-master/943/changes>
Changes:
[jtaylor] PHOENIX-2389 Adding/dropping multiple columns to table in one DDL
------------------------------------------
[...truncated 7340 lines...]
Tests run: 8, Failures: 0, Errors: 0, Skipped: 0, Time elapsed: 41.478 sec - in org.apache.phoenix.end2end.TenantSpecificViewIndexIT
Running org.apache.phoenix.end2end.LnLogFunctionEnd2EndIT
Tests run: 1, Failures: 0, Errors: 0, Skipped: 0, Time elapsed: 7.059 sec - in org.apache.phoenix.end2end.GetSetByteBitFunctionEnd2EndIT
Running org.apache.phoenix.end2end.SpooledTmpFileDeleteIT
Tests run: 1, Failures: 0, Errors: 0, Skipped: 0, Time elapsed: 7.071 sec - in org.apache.phoenix.end2end.SpooledTmpFileDeleteIT
Running org.apache.phoenix.end2end.SkipScanQueryIT
Tests run: 1, Failures: 0, Errors: 0, Skipped: 0, Time elapsed: 16.654 sec - in org.apache.phoenix.end2end.LnLogFunctionEnd2EndIT
Running org.apache.phoenix.end2end.ArrayConcatFunctionIT
Tests run: 30, Failures: 0, Errors: 0, Skipped: 0, Time elapsed: 27.691 sec - in org.apache.phoenix.end2end.ArrayConcatFunctionIT
Running org.apache.phoenix.end2end.DateTimeIT
Tests run: 108, Failures: 0, Errors: 0, Skipped: 0, Time elapsed: 266.014 sec - in org.apache.phoenix.end2end.SortMergeJoinIT
Tests run: 9, Failures: 0, Errors: 0, Skipped: 0, Time elapsed: 45.926 sec - in org.apache.phoenix.end2end.SkipScanQueryIT
Running org.apache.phoenix.end2end.ArrayFillFunctionIT
Running org.apache.phoenix.end2end.QueryExecWithoutSCNIT
Tests run: 19, Failures: 0, Errors: 0, Skipped: 0, Time elapsed: 20.513 sec - in org.apache.phoenix.end2end.DateTimeIT
Running org.apache.phoenix.end2end.SubqueryIT
Tests run: 1, Failures: 0, Errors: 0, Skipped: 0, Time elapsed: 8.001 sec - in org.apache.phoenix.end2end.QueryExecWithoutSCNIT
Running org.apache.phoenix.trace.PhoenixTracingEndToEndIT
Tests run: 26, Failures: 0, Errors: 0, Skipped: 0, Time elapsed: 25.752 sec - in org.apache.phoenix.end2end.ArrayFillFunctionIT
Running org.apache.phoenix.trace.PhoenixTraceReaderIT
Tests run: 2, Failures: 0, Errors: 0, Skipped: 0, Time elapsed: 2.982 sec - in org.apache.phoenix.trace.PhoenixTraceReaderIT
Running org.apache.phoenix.trace.PhoenixTableMetricsWriterIT
Tests run: 2, Failures: 0, Errors: 0, Skipped: 0, Time elapsed: 0.532 sec - in org.apache.phoenix.trace.PhoenixTableMetricsWriterIT
Tests run: 6, Failures: 0, Errors: 0, Skipped: 0, Time elapsed: 92.708 sec - in org.apache.phoenix.end2end.UpgradeIT
Tests run: 6, Failures: 0, Errors: 0, Skipped: 0, Time elapsed: 96.917 sec - in org.apache.phoenix.trace.PhoenixTracingEndToEndIT
Tests run: 21, Failures: 0, Errors: 0, Skipped: 0, Time elapsed: 105.713 sec - in org.apache.phoenix.end2end.SubqueryIT
Tests run: 108, Failures: 0, Errors: 0, Skipped: 0, Time elapsed: 483.445 sec - in org.apache.phoenix.end2end.HashJoinIT
Results :
Tests run: 1176, Failures: 0, Errors: 0, Skipped: 0
[INFO]
[INFO] --- maven-failsafe-plugin:2.18:integration-test (NeedTheirOwnClusterTests) @ phoenix-core ---
[INFO] Failsafe report directory: <https://builds.apache.org/job/Phoenix-master/ws/phoenix-core/target/failsafe-reports>
[INFO] parallel='none', perCoreThreadCount=true, threadCount=0, useUnlimitedThreads=false, threadCountSuites=0, threadCountClasses=0, threadCountMethods=0, parallelOptimized=true
-------------------------------------------------------
T E S T S
-------------------------------------------------------
Running org.apache.phoenix.rpc.PhoenixClientRpcIT
Running org.apache.phoenix.rpc.PhoenixServerRpcIT
Running org.apache.phoenix.iterate.RoundRobinResultIteratorWithStatsIT
Running org.apache.phoenix.monitoring.PhoenixMetricsIT
Tests run: 2, Failures: 0, Errors: 0, Skipped: 0, Time elapsed: 13.012 sec - in org.apache.phoenix.rpc.PhoenixClientRpcIT
Tests run: 1, Failures: 0, Errors: 0, Skipped: 0, Time elapsed: 12.188 sec - in org.apache.phoenix.iterate.RoundRobinResultIteratorWithStatsIT
Running org.apache.phoenix.mapreduce.CsvBulkLoadToolIT
Tests run: 2, Failures: 0, Errors: 0, Skipped: 0, Time elapsed: 22.899 sec - in org.apache.phoenix.rpc.PhoenixServerRpcIT
Running org.apache.phoenix.end2end.ConnectionUtilIT
Running org.apache.phoenix.mapreduce.IndexToolIT
Running org.apache.phoenix.end2end.MultiCfQueryExecIT
Tests run: 1, Failures: 0, Errors: 0, Skipped: 0, Time elapsed: 28.102 sec - in org.apache.phoenix.end2end.ConnectionUtilIT
Tests run: 7, Failures: 0, Errors: 0, Skipped: 0, Time elapsed: 20.777 sec - in org.apache.phoenix.end2end.MultiCfQueryExecIT
Running org.apache.phoenix.end2end.ViewIT
Running org.apache.phoenix.end2end.SaltedViewIT
Tests run: 17, Failures: 0, Errors: 0, Skipped: 0, Time elapsed: 84.794 sec - in org.apache.phoenix.monitoring.PhoenixMetricsIT
Tests run: 2, Failures: 0, Errors: 0, Skipped: 0, Time elapsed: 14.845 sec - in org.apache.phoenix.end2end.SaltedViewIT
Running org.apache.phoenix.end2end.StatsCollectorIT
Running org.apache.phoenix.end2end.ParallelIteratorsIT
Tests run: 22, Failures: 0, Errors: 0, Skipped: 0, Time elapsed: 81.11 sec - in org.apache.phoenix.end2end.ViewIT
Tests run: 3, Failures: 0, Errors: 0, Skipped: 0, Time elapsed: 44.044 sec - in org.apache.phoenix.end2end.ParallelIteratorsIT
Tests run: 4, Failures: 0, Errors: 0, Skipped: 0, Time elapsed: 59.982 sec - in org.apache.phoenix.end2end.StatsCollectorIT
Running org.apache.phoenix.end2end.QueryWithLimitIT
Running org.apache.phoenix.end2end.QueryTimeoutIT
Tests run: 1, Failures: 0, Errors: 0, Skipped: 0, Time elapsed: 14.15 sec - in org.apache.phoenix.end2end.QueryTimeoutIT
Running org.apache.phoenix.end2end.ContextClassloaderIT
Tests run: 2, Failures: 0, Errors: 0, Skipped: 0, Time elapsed: 24.768 sec - in org.apache.phoenix.end2end.QueryWithLimitIT
Running org.apache.phoenix.end2end.index.MutableIndexFailureIT
Tests run: 5, Failures: 0, Errors: 0, Skipped: 0, Time elapsed: 194.228 sec - in org.apache.phoenix.mapreduce.CsvBulkLoadToolIT
Tests run: 3, Failures: 0, Errors: 0, Skipped: 0, Time elapsed: 10.208 sec - in org.apache.phoenix.end2end.ContextClassloaderIT
Running org.apache.phoenix.end2end.index.ImmutableIndexWithStatsIT
Tests run: 1, Failures: 0, Errors: 0, Skipped: 0, Time elapsed: 12.818 sec - in org.apache.phoenix.end2end.index.ImmutableIndexWithStatsIT
Running org.apache.phoenix.end2end.index.MutableIndexReplicationIT
Running org.apache.phoenix.end2end.UserDefinedFunctionsIT
Running org.apache.phoenix.end2end.AlterTableIT
Tests run: 3, Failures: 0, Errors: 0, Skipped: 2, Time elapsed: 54.418 sec - in org.apache.phoenix.end2end.index.MutableIndexFailureIT
Tests run: 1, Failures: 0, Errors: 0, Skipped: 0, Time elapsed: 35.489 sec - in org.apache.phoenix.end2end.index.MutableIndexReplicationIT
Running org.apache.phoenix.end2end.UnionAllIT
Tests run: 13, Failures: 0, Errors: 0, Skipped: 0, Time elapsed: 45.883 sec - in org.apache.phoenix.end2end.UserDefinedFunctionsIT
Running org.apache.phoenix.end2end.TenantSpecificTablesDDLIT
Running org.apache.phoenix.end2end.KeyOnlyIT
Tests run: 12, Failures: 0, Errors: 0, Skipped: 0, Time elapsed: 34.927 sec - in org.apache.phoenix.end2end.UnionAllIT
Tests run: 3, Failures: 0, Errors: 0, Skipped: 0, Time elapsed: 22.471 sec - in org.apache.phoenix.end2end.KeyOnlyIT
Running org.apache.phoenix.end2end.CountDistinctCompressionIT
Tests run: 1, Failures: 0, Errors: 0, Skipped: 0, Time elapsed: 13.902 sec - in org.apache.phoenix.end2end.CountDistinctCompressionIT
Running org.apache.phoenix.end2end.SpillableGroupByIT
Tests run: 17, Failures: 0, Errors: 0, Skipped: 0, Time elapsed: 62.69 sec - in org.apache.phoenix.end2end.TenantSpecificTablesDDLIT
Running org.apache.phoenix.end2end.TenantSpecificTablesDMLIT
Tests run: 1, Failures: 0, Errors: 0, Skipped: 0, Time elapsed: 12.112 sec - in org.apache.phoenix.end2end.SpillableGroupByIT
Running org.apache.phoenix.hbase.index.FailForUnsupportedHBaseVersionsIT
Running org.apache.phoenix.end2end.StatsCollectorWithSplitsAndMultiCFIT
Tests run: 2, Failures: 0, Errors: 0, Skipped: 0, Time elapsed: 17.713 sec - in org.apache.phoenix.hbase.index.FailForUnsupportedHBaseVersionsIT
Running org.apache.phoenix.hbase.index.covered.EndToEndCoveredColumnsIndexBuilderIT
Tests run: 2, Failures: 0, Errors: 0, Skipped: 0, Time elapsed: 19.08 sec - in org.apache.phoenix.hbase.index.covered.EndToEndCoveredColumnsIndexBuilderIT
Tests run: 16, Failures: 0, Errors: 0, Skipped: 0, Time elapsed: 55.794 sec - in org.apache.phoenix.end2end.TenantSpecificTablesDMLIT
Running org.apache.phoenix.hbase.index.covered.example.FailWithoutRetriesIT
Tests run: 2, Failures: 0, Errors: 0, Skipped: 0, Time elapsed: 39.673 sec - in org.apache.phoenix.end2end.StatsCollectorWithSplitsAndMultiCFIT
Running org.apache.phoenix.hbase.index.covered.example.EndtoEndIndexingWithCompressionIT
Tests run: 1, Failures: 0, Errors: 0, Skipped: 0, Time elapsed: 9.222 sec - in org.apache.phoenix.hbase.index.covered.example.FailWithoutRetriesIT
Running org.apache.phoenix.hbase.index.covered.example.EndToEndCoveredIndexingIT
Running org.apache.phoenix.hbase.index.balancer.IndexLoadBalancerIT
Tests run: 9, Failures: 0, Errors: 0, Skipped: 0, Time elapsed: 412.915 sec - in org.apache.phoenix.mapreduce.IndexToolIT
Running org.apache.phoenix.execute.PartialCommitIT
Tests run: 6, Failures: 0, Errors: 0, Skipped: 0, Time elapsed: 3.467 sec - in org.apache.phoenix.execute.PartialCommitIT
Running org.apache.hadoop.hbase.regionserver.wal.WALReplayWithIndexWritesAndUncompressedWALInHBase_094_9_IT
Tests run: 1, Failures: 0, Errors: 0, Skipped: 0, Time elapsed: 27.331 sec - in org.apache.hadoop.hbase.regionserver.wal.WALReplayWithIndexWritesAndUncompressedWALInHBase_094_9_IT
Running org.apache.hadoop.hbase.regionserver.wal.WALReplayWithIndexWritesAndCompressedWALIT
Tests run: 1, Failures: 0, Errors: 0, Skipped: 0, Time elapsed: 27.34 sec - in org.apache.hadoop.hbase.regionserver.wal.WALReplayWithIndexWritesAndCompressedWALIT
Tests run: 11, Failures: 0, Errors: 0, Skipped: 0, Time elapsed: 158.457 sec - in org.apache.phoenix.hbase.index.covered.example.EndToEndCoveredIndexingIT
Tests run: 11, Failures: 0, Errors: 0, Skipped: 0, Time elapsed: 167.878 sec - in org.apache.phoenix.hbase.index.covered.example.EndtoEndIndexingWithCompressionIT
Tests run: 9, Failures: 0, Errors: 0, Skipped: 0, Time elapsed: 222.394 sec - in org.apache.phoenix.hbase.index.balancer.IndexLoadBalancerIT
Tests run: 55, Failures: 0, Errors: 4, Skipped: 0, Time elapsed: 465.336 sec <<< FAILURE! - in org.apache.phoenix.end2end.AlterTableIT
testDropMultipleColumns(org.apache.phoenix.end2end.AlterTableIT) Time elapsed: 5.474 sec <<< ERROR!
java.sql.SQLException: ERROR 2009 (INT11): Unknown error code 0
at org.apache.phoenix.exception.SQLExceptionCode$Factory$1.newException(SQLExceptionCode.java:396)
at org.apache.phoenix.exception.SQLExceptionInfo.buildException(SQLExceptionInfo.java:145)
at org.apache.phoenix.exception.SQLExceptionCode.fromErrorCode(SQLExceptionCode.java:424)
at org.apache.phoenix.util.ServerUtil.parseRemoteException(ServerUtil.java:127)
at org.apache.phoenix.util.ServerUtil.parseServerExceptionOrNull(ServerUtil.java:115)
at org.apache.phoenix.util.ServerUtil.parseServerException(ServerUtil.java:104)
at org.apache.phoenix.query.ConnectionQueryServicesImpl.metaDataCoprocessorExec(ConnectionQueryServicesImpl.java:1053)
at org.apache.phoenix.query.ConnectionQueryServicesImpl.metaDataCoprocessorExec(ConnectionQueryServicesImpl.java:1016)
at org.apache.phoenix.query.ConnectionQueryServicesImpl.dropColumn(ConnectionQueryServicesImpl.java:1819)
at org.apache.phoenix.schema.MetaDataClient.dropColumn(MetaDataClient.java:2880)
at org.apache.phoenix.jdbc.PhoenixStatement$ExecutableDropColumnStatement$1.execute(PhoenixStatement.java:1147)
at org.apache.phoenix.jdbc.PhoenixStatement$2.call(PhoenixStatement.java:322)
at org.apache.phoenix.jdbc.PhoenixStatement$2.call(PhoenixStatement.java:314)
at org.apache.phoenix.call.CallRunner.run(CallRunner.java:53)
at org.apache.phoenix.jdbc.PhoenixStatement.executeMutation(PhoenixStatement.java:312)
at org.apache.phoenix.jdbc.PhoenixStatement.execute(PhoenixStatement.java:1435)
at org.apache.phoenix.end2end.AlterTableIT.testDropMultipleColumns(AlterTableIT.java:1039)
testDropIndexedColumn(org.apache.phoenix.end2end.AlterTableIT) Time elapsed: 9.984 sec <<< ERROR!
java.sql.SQLException: ERROR 2009 (INT11): Unknown error code 0
at org.apache.phoenix.exception.SQLExceptionCode$Factory$1.newException(SQLExceptionCode.java:396)
at org.apache.phoenix.exception.SQLExceptionInfo.buildException(SQLExceptionInfo.java:145)
at org.apache.phoenix.exception.SQLExceptionCode.fromErrorCode(SQLExceptionCode.java:424)
at org.apache.phoenix.util.ServerUtil.parseRemoteException(ServerUtil.java:127)
at org.apache.phoenix.util.ServerUtil.parseServerExceptionOrNull(ServerUtil.java:115)
at org.apache.phoenix.util.ServerUtil.parseServerException(ServerUtil.java:104)
at org.apache.phoenix.query.ConnectionQueryServicesImpl.metaDataCoprocessorExec(ConnectionQueryServicesImpl.java:1053)
at org.apache.phoenix.query.ConnectionQueryServicesImpl.metaDataCoprocessorExec(ConnectionQueryServicesImpl.java:1016)
at org.apache.phoenix.query.ConnectionQueryServicesImpl.dropColumn(ConnectionQueryServicesImpl.java:1819)
at org.apache.phoenix.schema.MetaDataClient.dropColumn(MetaDataClient.java:2880)
at org.apache.phoenix.jdbc.PhoenixStatement$ExecutableDropColumnStatement$1.execute(PhoenixStatement.java:1147)
at org.apache.phoenix.jdbc.PhoenixStatement$2.call(PhoenixStatement.java:322)
at org.apache.phoenix.jdbc.PhoenixStatement$2.call(PhoenixStatement.java:314)
at org.apache.phoenix.call.CallRunner.run(CallRunner.java:53)
at org.apache.phoenix.jdbc.PhoenixStatement.executeMutation(PhoenixStatement.java:312)
at org.apache.phoenix.jdbc.PhoenixStatement.execute(PhoenixStatement.java:1435)
at org.apache.phoenix.end2end.AlterTableIT.testDropIndexedColumn(AlterTableIT.java:285)
testDropCoveredColumn(org.apache.phoenix.end2end.AlterTableIT) Time elapsed: 7.65 sec <<< ERROR!
java.sql.SQLException: ERROR 2009 (INT11): Unknown error code 0
at org.apache.phoenix.exception.SQLExceptionCode$Factory$1.newException(SQLExceptionCode.java:396)
at org.apache.phoenix.exception.SQLExceptionInfo.buildException(SQLExceptionInfo.java:145)
at org.apache.phoenix.exception.SQLExceptionCode.fromErrorCode(SQLExceptionCode.java:424)
at org.apache.phoenix.util.ServerUtil.parseRemoteException(ServerUtil.java:127)
at org.apache.phoenix.util.ServerUtil.parseServerExceptionOrNull(ServerUtil.java:115)
at org.apache.phoenix.util.ServerUtil.parseServerException(ServerUtil.java:104)
at org.apache.phoenix.query.ConnectionQueryServicesImpl.metaDataCoprocessorExec(ConnectionQueryServicesImpl.java:1053)
at org.apache.phoenix.query.ConnectionQueryServicesImpl.metaDataCoprocessorExec(ConnectionQueryServicesImpl.java:1016)
at org.apache.phoenix.query.ConnectionQueryServicesImpl.dropColumn(ConnectionQueryServicesImpl.java:1819)
at org.apache.phoenix.schema.MetaDataClient.dropColumn(MetaDataClient.java:2880)
at org.apache.phoenix.jdbc.PhoenixStatement$ExecutableDropColumnStatement$1.execute(PhoenixStatement.java:1147)
at org.apache.phoenix.jdbc.PhoenixStatement$2.call(PhoenixStatement.java:322)
at org.apache.phoenix.jdbc.PhoenixStatement$2.call(PhoenixStatement.java:314)
at org.apache.phoenix.call.CallRunner.run(CallRunner.java:53)
at org.apache.phoenix.jdbc.PhoenixStatement.executeMutation(PhoenixStatement.java:312)
at org.apache.phoenix.jdbc.PhoenixStatement.execute(PhoenixStatement.java:1435)
at org.apache.phoenix.end2end.AlterTableIT.testDropCoveredColumn(AlterTableIT.java:350)
testDropColumnsWithImutability(org.apache.phoenix.end2end.AlterTableIT) Time elapsed: 13.712 sec <<< ERROR!
java.sql.SQLException: ERROR 2009 (INT11): Unknown error code 0
at org.apache.phoenix.exception.SQLExceptionCode$Factory$1.newException(SQLExceptionCode.java:396)
at org.apache.phoenix.exception.SQLExceptionInfo.buildException(SQLExceptionInfo.java:145)
at org.apache.phoenix.exception.SQLExceptionCode.fromErrorCode(SQLExceptionCode.java:424)
at org.apache.phoenix.util.ServerUtil.parseRemoteException(ServerUtil.java:127)
at org.apache.phoenix.util.ServerUtil.parseServerExceptionOrNull(ServerUtil.java:115)
at org.apache.phoenix.util.ServerUtil.parseServerException(ServerUtil.java:104)
at org.apache.phoenix.query.ConnectionQueryServicesImpl.metaDataCoprocessorExec(ConnectionQueryServicesImpl.java:1053)
at org.apache.phoenix.query.ConnectionQueryServicesImpl.metaDataCoprocessorExec(ConnectionQueryServicesImpl.java:1016)
at org.apache.phoenix.query.ConnectionQueryServicesImpl.dropColumn(ConnectionQueryServicesImpl.java:1819)
at org.apache.phoenix.schema.MetaDataClient.dropColumn(MetaDataClient.java:2880)
at org.apache.phoenix.jdbc.PhoenixStatement$ExecutableDropColumnStatement$1.execute(PhoenixStatement.java:1147)
at org.apache.phoenix.jdbc.PhoenixStatement$2.call(PhoenixStatement.java:322)
at org.apache.phoenix.jdbc.PhoenixStatement$2.call(PhoenixStatement.java:314)
at org.apache.phoenix.call.CallRunner.run(CallRunner.java:53)
at org.apache.phoenix.jdbc.PhoenixStatement.executeMutation(PhoenixStatement.java:312)
at org.apache.phoenix.jdbc.PhoenixStatement.execute(PhoenixStatement.java:1435)
at org.apache.phoenix.end2end.AlterTableIT.testDropColumnsWithImutability(AlterTableIT.java:874)
Results :
Tests in error:
AlterTableIT.testDropColumnsWithImutability:874 » SQL ERROR 2009 (INT11): Unkn...
AlterTableIT.testDropCoveredColumn:350 » SQL ERROR 2009 (INT11): Unknown error...
AlterTableIT.testDropIndexedColumn:285 » SQL ERROR 2009 (INT11): Unknown error...
AlterTableIT.testDropMultipleColumns:1039 » SQL ERROR 2009 (INT11): Unknown er...
Tests run: 250, Failures: 0, Errors: 4, Skipped: 2
[INFO]
[INFO] --- maven-failsafe-plugin:2.18:verify (ClientManagedTimeTests) @ phoenix-core ---
[INFO] Failsafe report directory: <https://builds.apache.org/job/Phoenix-master/ws/phoenix-core/target/failsafe-reports>
[INFO] ------------------------------------------------------------------------
[INFO] Reactor Summary:
[INFO]
[INFO] Apache Phoenix .................................... SUCCESS [3.554s]
[INFO] Phoenix Core ...................................... FAILURE [47:04.713s]
[INFO] Phoenix - Flume ................................... SKIPPED
[INFO] Phoenix - Pig ..................................... SKIPPED
[INFO] Phoenix Query Server Client ....................... SKIPPED
[INFO] Phoenix Query Server .............................. SKIPPED
[INFO] Phoenix - Pherf ................................... SKIPPED
[INFO] Phoenix - Spark ................................... SKIPPED
[INFO] Phoenix Assembly .................................. SKIPPED
[INFO] Phoenix - Tracing Web Application ................. SKIPPED
[INFO] ------------------------------------------------------------------------
[INFO] BUILD FAILURE
[INFO] ------------------------------------------------------------------------
[INFO] Total time: 47:08.919s
[INFO] Finished at: Mon Nov 09 20:11:43 UTC 2015
[INFO] Final Memory: 62M/1173M
[INFO] ------------------------------------------------------------------------
[ERROR] Failed to execute goal org.apache.maven.plugins:maven-failsafe-plugin:2.18:verify (ClientManagedTimeTests) on project phoenix-core: There are test failures.
[ERROR]
[ERROR] Please refer to <https://builds.apache.org/job/Phoenix-master/ws/phoenix-core/target/failsafe-reports> for the individual test results.
[ERROR] -> [Help 1]
[ERROR]
[ERROR] To see the full stack trace of the errors, re-run Maven with the -e switch.
[ERROR] Re-run Maven using the -X switch to enable full debug logging.
[ERROR]
[ERROR] For more information about the errors and possible solutions, please read the following articles:
[ERROR] [Help 1] http://cwiki.apache.org/confluence/display/MAVEN/MojoFailureException
[ERROR]
[ERROR] After correcting the problems, you can resume the build with the command
[ERROR] mvn <goals> -rf :phoenix-core
Build step 'Invoke top-level Maven targets' marked build as failure
Archiving artifacts
Compressed 1.23 GB of artifacts by 52.5% relative to #942
Updating PHOENIX-2389
Recording test results
Jenkins build is back to normal : Phoenix | Master #949
Posted by Apache Jenkins Server <je...@builds.apache.org>.
See <https://builds.apache.org/job/Phoenix-master/949/changes>
Build failed in Jenkins: Phoenix | Master #948
Posted by Apache Jenkins Server <je...@builds.apache.org>.
See <https://builds.apache.org/job/Phoenix-master/948/changes>
Changes:
[jtaylor] PHOENIX-2399 Server is sometimes unable to find Phoenix driver
------------------------------------------
[...truncated 7251 lines...]
Running org.apache.phoenix.end2end.AbsFunctionEnd2EndIT
Tests run: 1, Failures: 0, Errors: 0, Skipped: 0, Time elapsed: 5.152 sec - in org.apache.phoenix.end2end.AbsFunctionEnd2EndIT
Running org.apache.phoenix.end2end.ToDateFunctionIT
Tests run: 4, Failures: 0, Errors: 0, Skipped: 0, Time elapsed: 19.747 sec - in org.apache.phoenix.end2end.UpsertBigValuesIT
Running org.apache.phoenix.end2end.DynamicFamilyIT
Tests run: 4, Failures: 0, Errors: 0, Skipped: 0, Time elapsed: 18.878 sec - in org.apache.phoenix.end2end.TenantSpecificViewIndexSaltedIT
Running org.apache.phoenix.end2end.CSVCommonsLoaderIT
Tests run: 11, Failures: 0, Errors: 0, Skipped: 0, Time elapsed: 11.314 sec - in org.apache.phoenix.end2end.ToDateFunctionIT
Running org.apache.phoenix.end2end.SortMergeJoinIT
Tests run: 4, Failures: 0, Errors: 0, Skipped: 0, Time elapsed: 10.168 sec - in org.apache.phoenix.end2end.DynamicFamilyIT
Running org.apache.phoenix.end2end.ReadOnlyIT
Tests run: 1, Failures: 0, Errors: 0, Skipped: 0, Time elapsed: 10.898 sec - in org.apache.phoenix.end2end.ReadOnlyIT
Running org.apache.phoenix.end2end.FirstValueFunctionIT
Tests run: 7, Failures: 0, Errors: 0, Skipped: 0, Time elapsed: 6.096 sec - in org.apache.phoenix.end2end.FirstValueFunctionIT
Running org.apache.phoenix.end2end.StringToArrayFunctionIT
Tests run: 16, Failures: 0, Errors: 0, Skipped: 0, Time elapsed: 38.378 sec - in org.apache.phoenix.end2end.CSVCommonsLoaderIT
Running org.apache.phoenix.end2end.CoalesceFunctionIT
Tests run: 62, Failures: 0, Errors: 0, Skipped: 0, Time elapsed: 276.865 sec - in org.apache.phoenix.end2end.index.IndexExpressionIT
Running org.apache.phoenix.end2end.DisableLocalIndexIT
Tests run: 22, Failures: 0, Errors: 0, Skipped: 0, Time elapsed: 18.139 sec - in org.apache.phoenix.end2end.StringToArrayFunctionIT
Running org.apache.phoenix.end2end.TimezoneOffsetFunctionIT
Tests run: 1, Failures: 0, Errors: 0, Skipped: 0, Time elapsed: 10.52 sec - in org.apache.phoenix.end2end.DisableLocalIndexIT
Running org.apache.phoenix.end2end.RegexpSubstrFunctionIT
Tests run: 7, Failures: 0, Errors: 0, Skipped: 0, Time elapsed: 10.667 sec - in org.apache.phoenix.end2end.TimezoneOffsetFunctionIT
Running org.apache.phoenix.end2end.CbrtFunctionEnd2EndIT
Tests run: 10, Failures: 0, Errors: 0, Skipped: 0, Time elapsed: 17.205 sec - in org.apache.phoenix.end2end.CoalesceFunctionIT
Running org.apache.phoenix.end2end.StoreNullsIT
Tests run: 2, Failures: 0, Errors: 0, Skipped: 0, Time elapsed: 6.076 sec - in org.apache.phoenix.end2end.RegexpSubstrFunctionIT
Running org.apache.phoenix.end2end.SpooledSortMergeJoinIT
Tests run: 2, Failures: 0, Errors: 0, Skipped: 0, Time elapsed: 10.103 sec - in org.apache.phoenix.end2end.CbrtFunctionEnd2EndIT
Running org.apache.phoenix.end2end.SortOrderIT
Tests run: 3, Failures: 0, Errors: 0, Skipped: 0, Time elapsed: 26.301 sec - in org.apache.phoenix.end2end.StoreNullsIT
Running org.apache.phoenix.end2end.InListIT
Tests run: 21, Failures: 0, Errors: 0, Skipped: 0, Time elapsed: 124.878 sec - in org.apache.phoenix.end2end.SubqueryIT
Running org.apache.phoenix.end2end.ReverseScanIT
Tests run: 3, Failures: 0, Errors: 0, Skipped: 0, Time elapsed: 13.32 sec - in org.apache.phoenix.end2end.ReverseScanIT
Running org.apache.phoenix.end2end.NthValueFunctionIT
Tests run: 11, Failures: 0, Errors: 0, Skipped: 0, Time elapsed: 15.165 sec - in org.apache.phoenix.end2end.NthValueFunctionIT
Running org.apache.phoenix.end2end.MappingTableDataTypeIT
Tests run: 1, Failures: 0, Errors: 0, Skipped: 0, Time elapsed: 12.533 sec - in org.apache.phoenix.end2end.MappingTableDataTypeIT
Running org.apache.phoenix.end2end.LikeExpressionIT
Tests run: 2, Failures: 0, Errors: 0, Skipped: 0, Time elapsed: 11.235 sec - in org.apache.phoenix.end2end.LikeExpressionIT
Running org.apache.phoenix.end2end.UpsertSelectAutoCommitIT
Tests run: 45, Failures: 0, Errors: 0, Skipped: 0, Time elapsed: 76.667 sec - in org.apache.phoenix.end2end.SortOrderIT
Running org.apache.phoenix.end2end.IsNullIT
Tests run: 3, Failures: 0, Errors: 0, Skipped: 0, Time elapsed: 9.998 sec - in org.apache.phoenix.end2end.IsNullIT
Running org.apache.phoenix.end2end.BinaryRowKeyIT
Tests run: 3, Failures: 0, Errors: 0, Skipped: 0, Time elapsed: 6.329 sec - in org.apache.phoenix.end2end.BinaryRowKeyIT
Running org.apache.phoenix.end2end.RegexpReplaceFunctionIT
Tests run: 2, Failures: 0, Errors: 0, Skipped: 0, Time elapsed: 5.141 sec - in org.apache.phoenix.end2end.RegexpReplaceFunctionIT
Running org.apache.phoenix.end2end.salted.SaltedTableUpsertSelectIT
Tests run: 3, Failures: 0, Errors: 0, Skipped: 0, Time elapsed: 27.177 sec - in org.apache.phoenix.end2end.UpsertSelectAutoCommitIT
Running org.apache.phoenix.end2end.salted.SaltedTableVarLengthRowKeyIT
Tests run: 1, Failures: 0, Errors: 0, Skipped: 0, Time elapsed: 6.489 sec - in org.apache.phoenix.end2end.salted.SaltedTableVarLengthRowKeyIT
Running org.apache.phoenix.end2end.HashJoinIT
Tests run: 108, Failures: 0, Errors: 0, Skipped: 0, Time elapsed: 176.398 sec - in org.apache.phoenix.end2end.SortMergeJoinIT
Running org.apache.phoenix.end2end.MD5FunctionIT
Tests run: 28, Failures: 0, Errors: 0, Skipped: 0, Time elapsed: 97.692 sec - in org.apache.phoenix.end2end.InListIT
Running org.apache.phoenix.end2end.DateTimeIT
Tests run: 5, Failures: 0, Errors: 0, Skipped: 0, Time elapsed: 18.529 sec - in org.apache.phoenix.end2end.salted.SaltedTableUpsertSelectIT
Running org.apache.phoenix.end2end.TenantSpecificViewIndexIT
Tests run: 3, Failures: 0, Errors: 0, Skipped: 0, Time elapsed: 10.02 sec - in org.apache.phoenix.end2end.MD5FunctionIT
Running org.apache.phoenix.end2end.AlterSessionIT
Tests run: 2, Failures: 0, Errors: 0, Skipped: 0, Time elapsed: 5.192 sec - in org.apache.phoenix.end2end.AlterSessionIT
Running org.apache.phoenix.end2end.PhoenixRuntimeIT
Tests run: 19, Failures: 0, Errors: 0, Skipped: 0, Time elapsed: 14.385 sec - in org.apache.phoenix.end2end.DateTimeIT
Running org.apache.phoenix.end2end.DecodeFunctionIT
Tests run: 6, Failures: 0, Errors: 0, Skipped: 0, Time elapsed: 7.08 sec - in org.apache.phoenix.end2end.DecodeFunctionIT
Running org.apache.phoenix.end2end.UpgradeIT
Tests run: 8, Failures: 0, Errors: 0, Skipped: 0, Time elapsed: 31.76 sec - in org.apache.phoenix.end2end.TenantSpecificViewIndexIT
Running org.apache.phoenix.end2end.ServerExceptionIT
Tests run: 1, Failures: 0, Errors: 0, Skipped: 0, Time elapsed: 5.98 sec - in org.apache.phoenix.end2end.ServerExceptionIT
Running org.apache.phoenix.end2end.RegexpSplitFunctionIT
Tests run: 2, Failures: 0, Errors: 0, Skipped: 0, Time elapsed: 33.523 sec - in org.apache.phoenix.end2end.PhoenixRuntimeIT
Running org.apache.phoenix.end2end.ExecuteStatementsIT
Tests run: 11, Failures: 0, Errors: 0, Skipped: 0, Time elapsed: 6.725 sec - in org.apache.phoenix.end2end.RegexpSplitFunctionIT
Running org.apache.phoenix.end2end.SkipScanAfterManualSplitIT
Tests run: 2, Failures: 0, Errors: 0, Skipped: 0, Time elapsed: 28.788 sec - in org.apache.phoenix.end2end.ExecuteStatementsIT
Running org.apache.phoenix.end2end.ConvertTimezoneFunctionIT
Tests run: 3, Failures: 0, Errors: 0, Skipped: 0, Time elapsed: 34.411 sec - in org.apache.phoenix.end2end.SkipScanAfterManualSplitIT
Tests run: 7, Failures: 0, Errors: 0, Skipped: 0, Time elapsed: 6.37 sec - in org.apache.phoenix.end2end.ConvertTimezoneFunctionIT
Running org.apache.phoenix.end2end.SignFunctionEnd2EndIT
Running org.apache.phoenix.end2end.RTrimFunctionIT
Tests run: 2, Failures: 0, Errors: 0, Skipped: 0, Time elapsed: 5.211 sec - in org.apache.phoenix.end2end.RTrimFunctionIT
Running org.apache.phoenix.end2end.SkipScanQueryIT
Tests run: 2, Failures: 0, Errors: 0, Skipped: 0, Time elapsed: 10.206 sec - in org.apache.phoenix.end2end.SignFunctionEnd2EndIT
Running org.apache.phoenix.end2end.ExpFunctionEnd2EndIT
Tests run: 6, Failures: 0, Errors: 0, Skipped: 0, Time elapsed: 72.542 sec - in org.apache.phoenix.end2end.UpgradeIT
Running org.apache.phoenix.end2end.ArrayAppendFunctionIT
Tests run: 3, Failures: 0, Errors: 0, Skipped: 0, Time elapsed: 16.185 sec - in org.apache.phoenix.end2end.ExpFunctionEnd2EndIT
Running org.apache.phoenix.end2end.TenantIdTypeIT
Tests run: 34, Failures: 0, Errors: 0, Skipped: 0, Time elapsed: 23.062 sec - in org.apache.phoenix.end2end.ArrayAppendFunctionIT
Running org.apache.phoenix.end2end.LpadFunctionIT
Tests run: 9, Failures: 0, Errors: 0, Skipped: 0, Time elapsed: 32.827 sec - in org.apache.phoenix.end2end.SkipScanQueryIT
Tests run: 12, Failures: 0, Errors: 0, Skipped: 0, Time elapsed: 23.43 sec - in org.apache.phoenix.end2end.LpadFunctionIT
Tests run: 108, Failures: 0, Errors: 0, Skipped: 0, Time elapsed: 370.789 sec - in org.apache.phoenix.end2end.SpooledSortMergeJoinIT
Tests run: 15, Failures: 0, Errors: 0, Skipped: 0, Time elapsed: 153.927 sec - in org.apache.phoenix.end2end.TenantIdTypeIT
Tests run: 108, Failures: 0, Errors: 0, Skipped: 0, Time elapsed: 365.116 sec - in org.apache.phoenix.end2end.HashJoinIT
Results :
Tests run: 1176, Failures: 0, Errors: 0, Skipped: 0
[INFO]
[INFO] --- maven-failsafe-plugin:2.19:integration-test (NeedTheirOwnClusterTests) @ phoenix-core ---
-------------------------------------------------------
T E S T S
-------------------------------------------------------
Running org.apache.hadoop.hbase.regionserver.wal.WALReplayWithIndexWritesAndCompressedWALIT
Running org.apache.hadoop.hbase.regionserver.wal.WALReplayWithIndexWritesAndUncompressedWALInHBase_094_9_IT
Running org.apache.phoenix.hbase.index.balancer.IndexLoadBalancerIT
Running org.apache.phoenix.rpc.PhoenixServerRpcIT
Running org.apache.phoenix.rpc.PhoenixClientRpcIT
Tests run: 1, Failures: 0, Errors: 0, Skipped: 0, Time elapsed: 34.733 sec - in org.apache.hadoop.hbase.regionserver.wal.WALReplayWithIndexWritesAndUncompressedWALInHBase_094_9_IT
Running org.apache.phoenix.hbase.index.FailForUnsupportedHBaseVersionsIT
Tests run: 1, Failures: 0, Errors: 0, Skipped: 0, Time elapsed: 37.317 sec - in org.apache.hadoop.hbase.regionserver.wal.WALReplayWithIndexWritesAndCompressedWALIT
Tests run: 2, Failures: 0, Errors: 0, Skipped: 0, Time elapsed: 12.581 sec - in org.apache.phoenix.rpc.PhoenixClientRpcIT
Tests run: 2, Failures: 0, Errors: 0, Skipped: 0, Time elapsed: 15.108 sec - in org.apache.phoenix.rpc.PhoenixServerRpcIT
Running org.apache.phoenix.hbase.index.covered.EndToEndCoveredColumnsIndexBuilderIT
Running org.apache.phoenix.hbase.index.covered.example.FailWithoutRetriesIT
Tests run: 2, Failures: 0, Errors: 0, Skipped: 0, Time elapsed: 16.949 sec - in org.apache.phoenix.hbase.index.FailForUnsupportedHBaseVersionsIT
Tests run: 1, Failures: 0, Errors: 0, Skipped: 0, Time elapsed: 9.527 sec - in org.apache.phoenix.hbase.index.covered.example.FailWithoutRetriesIT
Running org.apache.phoenix.hbase.index.covered.example.EndToEndCoveredIndexingIT
Tests run: 2, Failures: 0, Errors: 0, Skipped: 0, Time elapsed: 17.974 sec - in org.apache.phoenix.hbase.index.covered.EndToEndCoveredColumnsIndexBuilderIT
Running org.apache.phoenix.hbase.index.covered.example.EndtoEndIndexingWithCompressionIT
Running org.apache.phoenix.monitoring.PhoenixMetricsIT
Running org.apache.phoenix.iterate.RoundRobinResultIteratorWithStatsIT
Tests run: 1, Failures: 0, Errors: 0, Skipped: 0, Time elapsed: 15.525 sec - in org.apache.phoenix.iterate.RoundRobinResultIteratorWithStatsIT
Running org.apache.phoenix.end2end.TenantSpecificTablesDMLIT
Tests run: 17, Failures: 0, Errors: 0, Skipped: 0, Time elapsed: 60.106 sec - in org.apache.phoenix.monitoring.PhoenixMetricsIT
Running org.apache.phoenix.end2end.ViewIT
Tests run: 16, Failures: 0, Errors: 0, Skipped: 0, Time elapsed: 36.287 sec - in org.apache.phoenix.end2end.TenantSpecificTablesDMLIT
Running org.apache.phoenix.end2end.TenantSpecificTablesDDLIT
Tests run: 11, Failures: 0, Errors: 0, Skipped: 0, Time elapsed: 126.646 sec - in org.apache.phoenix.hbase.index.covered.example.EndToEndCoveredIndexingIT
Running org.apache.phoenix.end2end.index.MutableIndexFailureIT
Tests run: 9, Failures: 0, Errors: 0, Skipped: 0, Time elapsed: 172.982 sec - in org.apache.phoenix.hbase.index.balancer.IndexLoadBalancerIT
Tests run: 11, Failures: 0, Errors: 0, Skipped: 0, Time elapsed: 133.55 sec - in org.apache.phoenix.hbase.index.covered.example.EndtoEndIndexingWithCompressionIT
Running org.apache.phoenix.end2end.index.MutableIndexReplicationIT
Tests run: 22, Failures: 0, Errors: 0, Skipped: 0, Time elapsed: 58.065 sec - in org.apache.phoenix.end2end.ViewIT
Tests run: 17, Failures: 0, Errors: 0, Skipped: 0, Time elapsed: 47.636 sec - in org.apache.phoenix.end2end.TenantSpecificTablesDDLIT
Running org.apache.phoenix.end2end.UnionAllIT
Running org.apache.phoenix.end2end.StatsCollectorIT
Tests run: 1, Failures: 0, Errors: 0, Skipped: 0, Time elapsed: 27.23 sec - in org.apache.phoenix.end2end.index.MutableIndexReplicationIT
Running org.apache.phoenix.end2end.KeyOnlyIT
Tests run: 12, Failures: 0, Errors: 0, Skipped: 0, Time elapsed: 38.147 sec - in org.apache.phoenix.end2end.UnionAllIT
Tests run: 3, Failures: 0, Errors: 0, Skipped: 0, Time elapsed: 17.701 sec - in org.apache.phoenix.end2end.KeyOnlyIT
Running org.apache.phoenix.end2end.UserDefinedFunctionsIT
Tests run: 4, Failures: 0, Errors: 0, Skipped: 0, Time elapsed: 55.659 sec - in org.apache.phoenix.end2end.StatsCollectorIT
Running org.apache.phoenix.end2end.ContextClassloaderIT
Tests run: 3, Failures: 0, Errors: 0, Skipped: 0, Time elapsed: 5.908 sec - in org.apache.phoenix.end2end.ContextClassloaderIT
Running org.apache.phoenix.end2end.QueryTimeoutIT
Tests run: 13, Failures: 0, Errors: 0, Skipped: 0, Time elapsed: 29.087 sec - in org.apache.phoenix.end2end.UserDefinedFunctionsIT
Running org.apache.phoenix.end2end.MultiCfQueryExecIT
Running org.apache.phoenix.end2end.QueryWithLimitIT
Tests run: 1, Failures: 0, Errors: 0, Skipped: 0, Time elapsed: 17.047 sec - in org.apache.phoenix.end2end.QueryTimeoutIT
Tests run: 7, Failures: 0, Errors: 0, Skipped: 0, Time elapsed: 16.235 sec - in org.apache.phoenix.end2end.MultiCfQueryExecIT
Tests run: 2, Failures: 0, Errors: 0, Skipped: 0, Time elapsed: 19.247 sec - in org.apache.phoenix.end2end.QueryWithLimitIT
Running org.apache.phoenix.end2end.ParallelIteratorsIT
Running org.apache.phoenix.end2end.SaltedViewIT
Running org.apache.phoenix.end2end.SpillableGroupByIT
Tests run: 1, Failures: 0, Errors: 0, Skipped: 0, Time elapsed: 8.05 sec - in org.apache.phoenix.end2end.SpillableGroupByIT
Tests run: 2, Failures: 0, Errors: 0, Skipped: 0, Time elapsed: 17.669 sec - in org.apache.phoenix.end2end.SaltedViewIT
Tests run: 3, Failures: 0, Errors: 0, Skipped: 0, Time elapsed: 27.406 sec - in org.apache.phoenix.end2end.ParallelIteratorsIT
Running org.apache.phoenix.end2end.StatsCollectorWithSplitsAndMultiCFIT
Running org.apache.phoenix.end2end.AlterTableIT
Running org.apache.phoenix.end2end.CountDistinctCompressionIT
Tests run: 1, Failures: 0, Errors: 0, Skipped: 0, Time elapsed: 5.659 sec - in org.apache.phoenix.end2end.CountDistinctCompressionIT
Running org.apache.phoenix.end2end.ConnectionUtilIT
Tests run: 2, Failures: 0, Errors: 0, Skipped: 0, Time elapsed: 28.428 sec - in org.apache.phoenix.end2end.StatsCollectorWithSplitsAndMultiCFIT
Tests run: 1, Failures: 0, Errors: 0, Skipped: 0, Time elapsed: 19.521 sec - in org.apache.phoenix.end2end.ConnectionUtilIT
Running org.apache.phoenix.mapreduce.IndexToolIT
Running org.apache.phoenix.mapreduce.CsvBulkLoadToolIT
Tests run: 5, Failures: 4, Errors: 0, Skipped: 0, Time elapsed: 231.168 sec <<< FAILURE! - in org.apache.phoenix.mapreduce.CsvBulkLoadToolIT
testBasicImport(org.apache.phoenix.mapreduce.CsvBulkLoadToolIT) Time elapsed: 50.512 sec <<< FAILURE!
java.lang.AssertionError
at org.apache.phoenix.mapreduce.CsvBulkLoadToolIT.testBasicImport(CsvBulkLoadToolIT.java:118)
testFullOptionImport(org.apache.phoenix.mapreduce.CsvBulkLoadToolIT) Time elapsed: 46.63 sec <<< FAILURE!
java.lang.AssertionError
at org.apache.phoenix.mapreduce.CsvBulkLoadToolIT.testFullOptionImport(CsvBulkLoadToolIT.java:158)
testImportWithIndex(org.apache.phoenix.mapreduce.CsvBulkLoadToolIT) Time elapsed: 49.212 sec <<< FAILURE!
java.lang.AssertionError
at org.apache.phoenix.mapreduce.CsvBulkLoadToolIT.testImportWithIndex(CsvBulkLoadToolIT.java:197)
testImportOneIndexTable(org.apache.phoenix.mapreduce.CsvBulkLoadToolIT) Time elapsed: 46.109 sec <<< FAILURE!
java.lang.AssertionError
at org.apache.phoenix.mapreduce.CsvBulkLoadToolIT.testImportOneIndexTable(CsvBulkLoadToolIT.java:278)
at org.apache.phoenix.mapreduce.CsvBulkLoadToolIT.testImportOneIndexTable(CsvBulkLoadToolIT.java:240)
Tests run: 55, Failures: 0, Errors: 0, Skipped: 0, Time elapsed: 398.38 sec - in org.apache.phoenix.end2end.AlterTableIT
Tests run: 9, Failures: 0, Errors: 0, Skipped: 0, Time elapsed: 393.581 sec - in org.apache.phoenix.mapreduce.IndexToolIT
Running org.apache.phoenix.end2end.index.ImmutableIndexWithStatsIT
Tests run: 1, Failures: 0, Errors: 0, Skipped: 0, Time elapsed: 11.347 sec - in org.apache.phoenix.end2end.index.ImmutableIndexWithStatsIT
Tests run: 3, Failures: 0, Errors: 0, Skipped: 2, Time elapsed: 1,234.03 sec - in org.apache.phoenix.end2end.index.MutableIndexFailureIT
Running org.apache.phoenix.execute.PartialCommitIT
Tests run: 6, Failures: 0, Errors: 0, Skipped: 0, Time elapsed: 2.311 sec - in org.apache.phoenix.execute.PartialCommitIT
Results :
Failed tests:
CsvBulkLoadToolIT.testBasicImport:118 null
CsvBulkLoadToolIT.testFullOptionImport:158 null
CsvBulkLoadToolIT.testImportOneIndexTable:240->testImportOneIndexTable:278 null
CsvBulkLoadToolIT.testImportWithIndex:197 null
Tests run: 250, Failures: 4, Errors: 0, Skipped: 2
[INFO]
[INFO] --- maven-failsafe-plugin:2.19:verify (ClientManagedTimeTests) @ phoenix-core ---
[INFO] ------------------------------------------------------------------------
[INFO] Reactor Summary:
[INFO]
[INFO] Apache Phoenix .................................... SUCCESS [3.978s]
[INFO] Phoenix Core ...................................... FAILURE [58:22.818s]
[INFO] Phoenix - Flume ................................... SKIPPED
[INFO] Phoenix - Pig ..................................... SKIPPED
[INFO] Phoenix Query Server Client ....................... SKIPPED
[INFO] Phoenix Query Server .............................. SKIPPED
[INFO] Phoenix - Pherf ................................... SKIPPED
[INFO] Phoenix - Spark ................................... SKIPPED
[INFO] Phoenix Assembly .................................. SKIPPED
[INFO] Phoenix - Tracing Web Application ................. SKIPPED
[INFO] ------------------------------------------------------------------------
[INFO] BUILD FAILURE
[INFO] ------------------------------------------------------------------------
[INFO] Total time: 58:27.552s
[INFO] Finished at: Wed Nov 11 07:39:44 UTC 2015
[INFO] Final Memory: 48M/1027M
[INFO] ------------------------------------------------------------------------
[ERROR] Failed to execute goal org.apache.maven.plugins:maven-failsafe-plugin:2.19:verify (ClientManagedTimeTests) on project phoenix-core: There are test failures.
[ERROR]
[ERROR] Please refer to <https://builds.apache.org/job/Phoenix-master/ws/phoenix-core/target/failsafe-reports> for the individual test results.
[ERROR] -> [Help 1]
[ERROR]
[ERROR] To see the full stack trace of the errors, re-run Maven with the -e switch.
[ERROR] Re-run Maven using the -X switch to enable full debug logging.
[ERROR]
[ERROR] For more information about the errors and possible solutions, please read the following articles:
[ERROR] [Help 1] http://cwiki.apache.org/confluence/display/MAVEN/MojoFailureException
[ERROR]
[ERROR] After correcting the problems, you can resume the build with the command
[ERROR] mvn <goals> -rf :phoenix-core
Build step 'Invoke top-level Maven targets' marked build as failure
Archiving artifacts
Compressed 1.23 GB of artifacts by 51.4% relative to #942
Updating PHOENIX-2399
Recording test results
Build failed in Jenkins: Phoenix | Master #947
Posted by Apache Jenkins Server <je...@builds.apache.org>.
See <https://builds.apache.org/job/Phoenix-master/947/changes>
Changes:
[jamestaylor] PHOENIX-2399 Server is sometimes unable to find Phoenix driver
------------------------------------------
[...truncated 7336 lines...]
Running org.apache.phoenix.end2end.ServerExceptionIT
Tests run: 1, Failures: 0, Errors: 0, Skipped: 0, Time elapsed: 6.343 sec - in org.apache.phoenix.end2end.ServerExceptionIT
Running org.apache.phoenix.end2end.CSVCommonsLoaderIT
Tests run: 13, Failures: 0, Errors: 0, Skipped: 0, Time elapsed: 61.429 sec - in org.apache.phoenix.end2end.index.ImmutableIndexIT
Running org.apache.phoenix.end2end.ReverseFunctionIT
Tests run: 16, Failures: 0, Errors: 0, Skipped: 0, Time elapsed: 49.931 sec - in org.apache.phoenix.end2end.CSVCommonsLoaderIT
Running org.apache.phoenix.end2end.GetSetByteBitFunctionEnd2EndIT
Tests run: 20, Failures: 0, Errors: 0, Skipped: 0, Time elapsed: 372.574 sec - in org.apache.phoenix.end2end.index.LocalIndexIT
Running org.apache.phoenix.end2end.ArrayAppendFunctionIT
Tests run: 5, Failures: 0, Errors: 0, Skipped: 0, Time elapsed: 9.647 sec - in org.apache.phoenix.end2end.ReverseFunctionIT
Running org.apache.phoenix.end2end.LnLogFunctionEnd2EndIT
Tests run: 1, Failures: 0, Errors: 0, Skipped: 0, Time elapsed: 9.329 sec - in org.apache.phoenix.end2end.GetSetByteBitFunctionEnd2EndIT
Running org.apache.phoenix.end2end.AutoCommitIT
Tests run: 1, Failures: 0, Errors: 0, Skipped: 0, Time elapsed: 6.372 sec - in org.apache.phoenix.end2end.AutoCommitIT
Running org.apache.phoenix.end2end.TenantIdTypeIT
Tests run: 1, Failures: 0, Errors: 0, Skipped: 0, Time elapsed: 18.686 sec - in org.apache.phoenix.end2end.LnLogFunctionEnd2EndIT
Running org.apache.phoenix.end2end.PowerFunctionEnd2EndIT
Tests run: 34, Failures: 0, Errors: 0, Skipped: 0, Time elapsed: 31.559 sec - in org.apache.phoenix.end2end.ArrayAppendFunctionIT
Running org.apache.phoenix.end2end.TenantSpecificViewIndexSaltedIT
Tests run: 1, Failures: 0, Errors: 0, Skipped: 0, Time elapsed: 14.658 sec - in org.apache.phoenix.end2end.PowerFunctionEnd2EndIT
Running org.apache.phoenix.end2end.DateTimeIT
Tests run: 4, Failures: 0, Errors: 0, Skipped: 0, Time elapsed: 26.162 sec - in org.apache.phoenix.end2end.TenantSpecificViewIndexSaltedIT
Running org.apache.phoenix.end2end.SpooledTmpFileDeleteIT
Tests run: 1, Failures: 0, Errors: 0, Skipped: 0, Time elapsed: 9.465 sec - in org.apache.phoenix.end2end.SpooledTmpFileDeleteIT
Running org.apache.phoenix.end2end.CbrtFunctionEnd2EndIT
Tests run: 19, Failures: 0, Errors: 0, Skipped: 0, Time elapsed: 30.297 sec - in org.apache.phoenix.end2end.DateTimeIT
Running org.apache.phoenix.end2end.DecodeFunctionIT
Tests run: 2, Failures: 0, Errors: 0, Skipped: 0, Time elapsed: 12.143 sec - in org.apache.phoenix.end2end.CbrtFunctionEnd2EndIT
Running org.apache.phoenix.end2end.ModulusExpressionIT
Tests run: 6, Failures: 0, Errors: 0, Skipped: 0, Time elapsed: 11.498 sec - in org.apache.phoenix.end2end.DecodeFunctionIT
Running org.apache.phoenix.end2end.OctetLengthFunctionEnd2EndIT
Tests run: 11, Failures: 0, Errors: 0, Skipped: 0, Time elapsed: 10.83 sec - in org.apache.phoenix.end2end.ModulusExpressionIT
Running org.apache.phoenix.end2end.LastValueFunctionIT
Tests run: 62, Failures: 0, Errors: 0, Skipped: 0, Time elapsed: 312.274 sec - in org.apache.phoenix.end2end.index.IndexExpressionIT
Running org.apache.phoenix.end2end.UpgradeIT
Tests run: 1, Failures: 0, Errors: 0, Skipped: 0, Time elapsed: 6.974 sec - in org.apache.phoenix.end2end.OctetLengthFunctionEnd2EndIT
Running org.apache.phoenix.end2end.FirstValueFunctionIT
Tests run: 7, Failures: 0, Errors: 0, Skipped: 0, Time elapsed: 12.121 sec - in org.apache.phoenix.end2end.FirstValueFunctionIT
Running org.apache.phoenix.end2end.DisableLocalIndexIT
Tests run: 16, Failures: 0, Errors: 0, Skipped: 0, Time elapsed: 229.698 sec - in org.apache.phoenix.end2end.index.LocalMutableIndexIT
Running org.apache.phoenix.end2end.HashJoinLocalIndexIT
Tests run: 11, Failures: 0, Errors: 0, Skipped: 0, Time elapsed: 17.857 sec - in org.apache.phoenix.end2end.LastValueFunctionIT
Running org.apache.phoenix.end2end.UpsertBigValuesIT
Tests run: 1, Failures: 0, Errors: 0, Skipped: 0, Time elapsed: 16.182 sec - in org.apache.phoenix.end2end.DisableLocalIndexIT
Running org.apache.phoenix.end2end.MD5FunctionIT
Tests run: 4, Failures: 0, Errors: 0, Skipped: 0, Time elapsed: 29.146 sec - in org.apache.phoenix.end2end.UpsertBigValuesIT
Running org.apache.phoenix.end2end.LpadFunctionIT
Tests run: 3, Failures: 0, Errors: 0, Skipped: 0, Time elapsed: 17.259 sec - in org.apache.phoenix.end2end.MD5FunctionIT
Running org.apache.phoenix.end2end.SignFunctionEnd2EndIT
Tests run: 1, Failures: 0, Errors: 0, Skipped: 0, Time elapsed: 48.966 sec - in org.apache.phoenix.end2end.HashJoinLocalIndexIT
Running org.apache.phoenix.end2end.SortOrderIT
Tests run: 2, Failures: 0, Errors: 0, Skipped: 0, Time elapsed: 18.88 sec - in org.apache.phoenix.end2end.SignFunctionEnd2EndIT
Running org.apache.phoenix.end2end.ArrayToStringFunctionIT
Tests run: 12, Failures: 0, Errors: 0, Skipped: 0, Time elapsed: 33.332 sec - in org.apache.phoenix.end2end.LpadFunctionIT
Running org.apache.phoenix.end2end.QueryExecWithoutSCNIT
Tests run: 1, Failures: 0, Errors: 0, Skipped: 0, Time elapsed: 11.376 sec - in org.apache.phoenix.end2end.QueryExecWithoutSCNIT
Running org.apache.phoenix.end2end.RegexpReplaceFunctionIT
Tests run: 6, Failures: 0, Errors: 0, Skipped: 0, Time elapsed: 95.515 sec - in org.apache.phoenix.end2end.UpgradeIT
Running org.apache.phoenix.end2end.DynamicFamilyIT
Tests run: 2, Failures: 0, Errors: 0, Skipped: 0, Time elapsed: 6.641 sec - in org.apache.phoenix.end2end.RegexpReplaceFunctionIT
Running org.apache.phoenix.end2end.RoundFloorCeilFunctionsEnd2EndIT
Tests run: 4, Failures: 0, Errors: 0, Skipped: 0, Time elapsed: 16.189 sec - in org.apache.phoenix.end2end.DynamicFamilyIT
Running org.apache.phoenix.end2end.DeleteIT
Tests run: 36, Failures: 0, Errors: 0, Skipped: 0, Time elapsed: 48.533 sec - in org.apache.phoenix.end2end.ArrayToStringFunctionIT
Running org.apache.phoenix.end2end.InListIT
Tests run: 31, Failures: 0, Errors: 0, Skipped: 0, Time elapsed: 26.744 sec - in org.apache.phoenix.end2end.RoundFloorCeilFunctionsEnd2EndIT
Running org.apache.phoenix.end2end.EvaluationOfORIT
Tests run: 15, Failures: 0, Errors: 0, Skipped: 0, Time elapsed: 204.89 sec - in org.apache.phoenix.end2end.TenantIdTypeIT
Running org.apache.phoenix.end2end.ReverseScanIT
Tests run: 2, Failures: 0, Errors: 0, Skipped: 0, Time elapsed: 6.641 sec - in org.apache.phoenix.end2end.EvaluationOfORIT
Running org.apache.phoenix.end2end.RTrimFunctionIT
Tests run: 2, Failures: 0, Errors: 0, Skipped: 0, Time elapsed: 6.893 sec - in org.apache.phoenix.end2end.RTrimFunctionIT
Running org.apache.phoenix.end2end.NthValueFunctionIT
Tests run: 3, Failures: 0, Errors: 0, Skipped: 0, Time elapsed: 17.482 sec - in org.apache.phoenix.end2end.ReverseScanIT
Running org.apache.phoenix.end2end.ReadOnlyIT
Tests run: 11, Failures: 0, Errors: 0, Skipped: 0, Time elapsed: 18.034 sec - in org.apache.phoenix.end2end.NthValueFunctionIT
Running org.apache.phoenix.end2end.ArrayPrependFunctionIT
Tests run: 1, Failures: 0, Errors: 0, Skipped: 0, Time elapsed: 13.553 sec - in org.apache.phoenix.end2end.ReadOnlyIT
Running org.apache.phoenix.end2end.ExecuteStatementsIT
Tests run: 22, Failures: 0, Errors: 0, Skipped: 0, Time elapsed: 70.285 sec - in org.apache.phoenix.end2end.DeleteIT
Running org.apache.phoenix.iterate.RoundRobinResultIteratorIT
Tests run: 2, Failures: 0, Errors: 0, Skipped: 0, Time elapsed: 34.404 sec - in org.apache.phoenix.end2end.ExecuteStatementsIT
Running org.apache.phoenix.iterate.PhoenixQueryTimeoutIT
Tests run: 34, Failures: 0, Errors: 0, Skipped: 0, Time elapsed: 36.923 sec - in org.apache.phoenix.end2end.ArrayPrependFunctionIT
Tests run: 2, Failures: 0, Errors: 0, Skipped: 0, Time elapsed: 8.886 sec - in org.apache.phoenix.iterate.PhoenixQueryTimeoutIT
Tests run: 45, Failures: 0, Errors: 0, Skipped: 0, Time elapsed: 142.772 sec - in org.apache.phoenix.end2end.SortOrderIT
Tests run: 9, Failures: 0, Errors: 0, Skipped: 0, Time elapsed: 97.209 sec - in org.apache.phoenix.iterate.RoundRobinResultIteratorIT
Tests run: 28, Failures: 0, Errors: 0, Skipped: 0, Time elapsed: 214.642 sec - in org.apache.phoenix.end2end.InListIT
Results :
Tests run: 1176, Failures: 0, Errors: 0, Skipped: 0
[INFO]
[INFO] --- maven-failsafe-plugin:2.19:integration-test (NeedTheirOwnClusterTests) @ phoenix-core ---
-------------------------------------------------------
T E S T S
-------------------------------------------------------
Running org.apache.phoenix.rpc.PhoenixClientRpcIT
Running org.apache.phoenix.rpc.PhoenixServerRpcIT
Running org.apache.phoenix.mapreduce.IndexToolIT
Running org.apache.phoenix.execute.PartialCommitIT
Tests run: 6, Failures: 0, Errors: 0, Skipped: 0, Time elapsed: 3.011 sec - in org.apache.phoenix.execute.PartialCommitIT
Tests run: 2, Failures: 0, Errors: 0, Skipped: 0, Time elapsed: 11.362 sec - in org.apache.phoenix.rpc.PhoenixClientRpcIT
Running org.apache.phoenix.mapreduce.CsvBulkLoadToolIT
Tests run: 2, Failures: 0, Errors: 0, Skipped: 0, Time elapsed: 21.127 sec - in org.apache.phoenix.rpc.PhoenixServerRpcIT
Running org.apache.phoenix.end2end.ConnectionUtilIT
Running org.apache.phoenix.end2end.ViewIT
Tests run: 5, Failures: 0, Errors: 5, Skipped: 0, Time elapsed: 32.461 sec <<< FAILURE! - in org.apache.phoenix.mapreduce.CsvBulkLoadToolIT
testBasicImport(org.apache.phoenix.mapreduce.CsvBulkLoadToolIT) Time elapsed: 4.564 sec <<< ERROR!
java.sql.SQLException: No suitable driver found for jdbc:phoenix:localhost:64380:/hbase;test=true;
at org.apache.phoenix.mapreduce.CsvBulkLoadToolIT.testBasicImport(CsvBulkLoadToolIT.java:104)
testImportWithLocalIndex(org.apache.phoenix.mapreduce.CsvBulkLoadToolIT) Time elapsed: 6.175 sec <<< ERROR!
java.sql.SQLException: No suitable driver found for jdbc:phoenix:localhost:64380:/hbase;test=true;
at org.apache.phoenix.mapreduce.CsvBulkLoadToolIT.testImportWithLocalIndex(CsvBulkLoadToolIT.java:220)
testFullOptionImport(org.apache.phoenix.mapreduce.CsvBulkLoadToolIT) Time elapsed: 2.894 sec <<< ERROR!
java.sql.SQLException: No suitable driver found for jdbc:phoenix:localhost:64380:/hbase;test=true;
at org.apache.phoenix.mapreduce.CsvBulkLoadToolIT.testFullOptionImport(CsvBulkLoadToolIT.java:141)
testImportWithIndex(org.apache.phoenix.mapreduce.CsvBulkLoadToolIT) Time elapsed: 7.467 sec <<< ERROR!
java.sql.SQLException: No suitable driver found for jdbc:phoenix:localhost:64380:/hbase;test=true;
at org.apache.phoenix.mapreduce.CsvBulkLoadToolIT.testImportWithIndex(CsvBulkLoadToolIT.java:183)
testImportOneIndexTable(org.apache.phoenix.mapreduce.CsvBulkLoadToolIT) Time elapsed: 4.444 sec <<< ERROR!
java.sql.SQLException: No suitable driver found for jdbc:phoenix:localhost:64380:/hbase;test=true;
at org.apache.phoenix.mapreduce.CsvBulkLoadToolIT.testImportOneIndexTable(CsvBulkLoadToolIT.java:261)
at org.apache.phoenix.mapreduce.CsvBulkLoadToolIT.testImportOneIndexTable(CsvBulkLoadToolIT.java:233)
Tests run: 1, Failures: 0, Errors: 0, Skipped: 0, Time elapsed: 28.703 sec - in org.apache.phoenix.end2end.ConnectionUtilIT
Running org.apache.phoenix.end2end.StatsCollectorIT
Running org.apache.phoenix.end2end.AlterTableIT
Tests run: 22, Failures: 0, Errors: 0, Skipped: 0, Time elapsed: 73.739 sec - in org.apache.phoenix.end2end.ViewIT
Running org.apache.phoenix.end2end.SaltedViewIT
Tests run: 4, Failures: 0, Errors: 0, Skipped: 0, Time elapsed: 69.947 sec - in org.apache.phoenix.end2end.StatsCollectorIT
Tests run: 2, Failures: 0, Errors: 0, Skipped: 0, Time elapsed: 24.497 sec - in org.apache.phoenix.end2end.SaltedViewIT
Running org.apache.phoenix.end2end.index.ImmutableIndexWithStatsIT
Running org.apache.phoenix.end2end.index.MutableIndexReplicationIT
Tests run: 1, Failures: 0, Errors: 0, Skipped: 0, Time elapsed: 12.694 sec - in org.apache.phoenix.end2end.index.ImmutableIndexWithStatsIT
Running org.apache.phoenix.end2end.index.MutableIndexFailureIT
Tests run: 1, Failures: 0, Errors: 0, Skipped: 0, Time elapsed: 41.377 sec - in org.apache.phoenix.end2end.index.MutableIndexReplicationIT
Running org.apache.phoenix.end2end.SpillableGroupByIT
Tests run: 3, Failures: 0, Errors: 0, Skipped: 2, Time elapsed: 54.44 sec - in org.apache.phoenix.end2end.index.MutableIndexFailureIT
Tests run: 1, Failures: 0, Errors: 0, Skipped: 0, Time elapsed: 14.992 sec - in org.apache.phoenix.end2end.SpillableGroupByIT
Running org.apache.phoenix.end2end.CountDistinctCompressionIT
Running org.apache.phoenix.end2end.KeyOnlyIT
Tests run: 1, Failures: 0, Errors: 0, Skipped: 0, Time elapsed: 11.885 sec - in org.apache.phoenix.end2end.CountDistinctCompressionIT
Tests run: 3, Failures: 0, Errors: 0, Skipped: 0, Time elapsed: 23.185 sec - in org.apache.phoenix.end2end.KeyOnlyIT
Running org.apache.phoenix.end2end.TenantSpecificTablesDDLIT
Running org.apache.phoenix.end2end.TenantSpecificTablesDMLIT
Tests run: 17, Failures: 0, Errors: 0, Skipped: 0, Time elapsed: 64.893 sec - in org.apache.phoenix.end2end.TenantSpecificTablesDDLIT
Tests run: 16, Failures: 0, Errors: 0, Skipped: 0, Time elapsed: 63.275 sec - in org.apache.phoenix.end2end.TenantSpecificTablesDMLIT
Running org.apache.phoenix.end2end.ContextClassloaderIT
Tests run: 3, Failures: 0, Errors: 0, Skipped: 0, Time elapsed: 11.584 sec - in org.apache.phoenix.end2end.ContextClassloaderIT
Running org.apache.phoenix.end2end.QueryTimeoutIT
Tests run: 1, Failures: 0, Errors: 0, Skipped: 0, Time elapsed: 22.896 sec - in org.apache.phoenix.end2end.QueryTimeoutIT
Running org.apache.phoenix.end2end.UserDefinedFunctionsIT
Tests run: 9, Failures: 0, Errors: 0, Skipped: 0, Time elapsed: 432.096 sec - in org.apache.phoenix.mapreduce.IndexToolIT
Running org.apache.phoenix.end2end.QueryWithLimitIT
Running org.apache.phoenix.end2end.StatsCollectorWithSplitsAndMultiCFIT
Tests run: 2, Failures: 0, Errors: 0, Skipped: 0, Time elapsed: 25.076 sec - in org.apache.phoenix.end2end.QueryWithLimitIT
Tests run: 13, Failures: 0, Errors: 0, Skipped: 0, Time elapsed: 51.004 sec - in org.apache.phoenix.end2end.UserDefinedFunctionsIT
Tests run: 2, Failures: 0, Errors: 0, Skipped: 0, Time elapsed: 32.598 sec - in org.apache.phoenix.end2end.StatsCollectorWithSplitsAndMultiCFIT
Running org.apache.phoenix.end2end.UnionAllIT
Running org.apache.phoenix.end2end.ParallelIteratorsIT
Running org.apache.phoenix.iterate.RoundRobinResultIteratorWithStatsIT
Tests run: 12, Failures: 0, Errors: 0, Skipped: 0, Time elapsed: 35.063 sec - in org.apache.phoenix.end2end.UnionAllIT
Tests run: 1, Failures: 0, Errors: 0, Skipped: 0, Time elapsed: 12.596 sec - in org.apache.phoenix.iterate.RoundRobinResultIteratorWithStatsIT
Running org.apache.phoenix.hbase.index.covered.EndToEndCoveredColumnsIndexBuilderIT
Tests run: 3, Failures: 0, Errors: 0, Skipped: 0, Time elapsed: 33.271 sec - in org.apache.phoenix.end2end.ParallelIteratorsIT
Running org.apache.phoenix.hbase.index.covered.example.EndtoEndIndexingWithCompressionIT
Running org.apache.phoenix.hbase.index.covered.example.EndToEndCoveredIndexingIT
Tests run: 2, Failures: 0, Errors: 0, Skipped: 0, Time elapsed: 19.115 sec - in org.apache.phoenix.hbase.index.covered.EndToEndCoveredColumnsIndexBuilderIT
Running org.apache.phoenix.hbase.index.covered.example.FailWithoutRetriesIT
Tests run: 1, Failures: 0, Errors: 0, Skipped: 0, Time elapsed: 9.01 sec - in org.apache.phoenix.hbase.index.covered.example.FailWithoutRetriesIT
Running org.apache.phoenix.hbase.index.balancer.IndexLoadBalancerIT
Tests run: 55, Failures: 0, Errors: 0, Skipped: 0, Time elapsed: 504.538 sec - in org.apache.phoenix.end2end.AlterTableIT
Running org.apache.phoenix.hbase.index.FailForUnsupportedHBaseVersionsIT
Tests run: 2, Failures: 0, Errors: 0, Skipped: 0, Time elapsed: 17.612 sec - in org.apache.phoenix.hbase.index.FailForUnsupportedHBaseVersionsIT
Running org.apache.phoenix.monitoring.PhoenixMetricsIT
Tests run: 11, Failures: 0, Errors: 1, Skipped: 0, Time elapsed: 158.586 sec <<< FAILURE! - in org.apache.phoenix.hbase.index.covered.example.EndtoEndIndexingWithCompressionIT
testExceedVersionsOutOfOrderUpdates(org.apache.phoenix.hbase.index.covered.example.EndtoEndIndexingWithCompressionIT) Time elapsed: 4.763 sec <<< ERROR!
java.lang.RuntimeException: java.util.concurrent.RejectedExecutionException: Task org.apache.hadoop.hbase.client.ResultBoundedCompletionService$QueueingFuture@6b69d4d6 rejected from java.util.concurrent.ThreadPoolExecutor@711464b1[Running, pool size = 2, active threads = 2, queued tasks = 0, completed tasks = 5]
Caused by: java.util.concurrent.RejectedExecutionException: Task org.apache.hadoop.hbase.client.ResultBoundedCompletionService$QueueingFuture@6b69d4d6 rejected from java.util.concurrent.ThreadPoolExecutor@711464b1[Running, pool size = 2, active threads = 2, queued tasks = 0, completed tasks = 5]
Running org.apache.hadoop.hbase.regionserver.wal.WALReplayWithIndexWritesAndCompressedWALIT
Tests run: 11, Failures: 0, Errors: 0, Skipped: 0, Time elapsed: 159.149 sec - in org.apache.phoenix.hbase.index.covered.example.EndToEndCoveredIndexingIT
Running org.apache.hadoop.hbase.regionserver.wal.WALReplayWithIndexWritesAndUncompressedWALInHBase_094_9_IT
Tests run: 17, Failures: 0, Errors: 0, Skipped: 0, Time elapsed: 85.001 sec - in org.apache.phoenix.monitoring.PhoenixMetricsIT
Tests run: 1, Failures: 0, Errors: 0, Skipped: 0, Time elapsed: 27.788 sec - in org.apache.hadoop.hbase.regionserver.wal.WALReplayWithIndexWritesAndCompressedWALIT
Tests run: 1, Failures: 0, Errors: 0, Skipped: 0, Time elapsed: 27.835 sec - in org.apache.hadoop.hbase.regionserver.wal.WALReplayWithIndexWritesAndUncompressedWALInHBase_094_9_IT
Tests run: 9, Failures: 0, Errors: 0, Skipped: 0, Time elapsed: 242.741 sec - in org.apache.phoenix.hbase.index.balancer.IndexLoadBalancerIT
Running org.apache.phoenix.end2end.MultiCfQueryExecIT
Tests run: 7, Failures: 0, Errors: 0, Skipped: 0, Time elapsed: 25.489 sec - in org.apache.phoenix.end2end.MultiCfQueryExecIT
Results :
Tests in error:
EndtoEndIndexingWithCompressionIT>EndToEndCoveredIndexingIT.testExceedVersionsOutOfOrderUpdates:754 » Runtime
CsvBulkLoadToolIT.testBasicImport:104 » SQL No suitable driver found for jdbc:...
CsvBulkLoadToolIT.testFullOptionImport:141 » SQL No suitable driver found for ...
CsvBulkLoadToolIT.testImportOneIndexTable:233->testImportOneIndexTable:261 » SQL
CsvBulkLoadToolIT.testImportWithIndex:183 » SQL No suitable driver found for j...
CsvBulkLoadToolIT.testImportWithLocalIndex:220 » SQL No suitable driver found ...
Tests run: 250, Failures: 0, Errors: 6, Skipped: 2
[INFO]
[INFO] --- maven-failsafe-plugin:2.19:verify (ClientManagedTimeTests) @ phoenix-core ---
[INFO] ------------------------------------------------------------------------
[INFO] Reactor Summary:
[INFO]
[INFO] Apache Phoenix .................................... SUCCESS [4.010s]
[INFO] Phoenix Core ...................................... FAILURE [56:12.925s]
[INFO] Phoenix - Flume ................................... SKIPPED
[INFO] Phoenix - Pig ..................................... SKIPPED
[INFO] Phoenix Query Server Client ....................... SKIPPED
[INFO] Phoenix Query Server .............................. SKIPPED
[INFO] Phoenix - Pherf ................................... SKIPPED
[INFO] Phoenix - Spark ................................... SKIPPED
[INFO] Phoenix Assembly .................................. SKIPPED
[INFO] Phoenix - Tracing Web Application ................. SKIPPED
[INFO] ------------------------------------------------------------------------
[INFO] BUILD FAILURE
[INFO] ------------------------------------------------------------------------
[INFO] Total time: 56:17.609s
[INFO] Finished at: Wed Nov 11 03:34:54 UTC 2015
[INFO] Final Memory: 51M/1269M
[INFO] ------------------------------------------------------------------------
[ERROR] Failed to execute goal org.apache.maven.plugins:maven-failsafe-plugin:2.19:verify (ClientManagedTimeTests) on project phoenix-core: There are test failures.
[ERROR]
[ERROR] Please refer to <https://builds.apache.org/job/Phoenix-master/ws/phoenix-core/target/failsafe-reports> for the individual test results.
[ERROR] -> [Help 1]
[ERROR]
[ERROR] To see the full stack trace of the errors, re-run Maven with the -e switch.
[ERROR] Re-run Maven using the -X switch to enable full debug logging.
[ERROR]
[ERROR] For more information about the errors and possible solutions, please read the following articles:
[ERROR] [Help 1] http://cwiki.apache.org/confluence/display/MAVEN/MojoFailureException
[ERROR]
[ERROR] After correcting the problems, you can resume the build with the command
[ERROR] mvn <goals> -rf :phoenix-core
Build step 'Invoke top-level Maven targets' marked build as failure
Archiving artifacts
Compressed 1.12 GB of artifacts by 48.7% relative to #942
Updating PHOENIX-2399
Recording test results
Build failed in Jenkins: Phoenix | Master #946
Posted by Apache Jenkins Server <je...@builds.apache.org>.
See <https://builds.apache.org/job/Phoenix-master/946/changes>
Changes:
[jamestaylor] PHOENIX-2397 Execution default-test of goal
------------------------------------------
[...truncated 7897 lines...]
-------------------------------------------------------
T E S T S
-------------------------------------------------------
Running org.apache.phoenix.flume.PhoenixSinkIT
Running org.apache.phoenix.flume.RegexEventSerializerIT
Tests run: 9, Failures: 0, Errors: 0, Skipped: 0, Time elapsed: 17.928 sec - in org.apache.phoenix.flume.PhoenixSinkIT
Tests run: 6, Failures: 0, Errors: 0, Skipped: 0, Time elapsed: 40.969 sec - in org.apache.phoenix.flume.RegexEventSerializerIT
Results :
Tests run: 15, Failures: 0, Errors: 0, Skipped: 0
[INFO]
[INFO] --- maven-failsafe-plugin:2.19:integration-test (NeedTheirOwnClusterTests) @ phoenix-flume ---
-------------------------------------------------------
T E S T S
-------------------------------------------------------
Results :
Tests run: 0, Failures: 0, Errors: 0, Skipped: 0
[INFO]
[INFO] --- maven-failsafe-plugin:2.19:verify (ClientManagedTimeTests) @ phoenix-flume ---
[INFO]
[INFO] --- maven-failsafe-plugin:2.19:verify (HBaseManagedTimeTests) @ phoenix-flume ---
[INFO]
[INFO] --- maven-failsafe-plugin:2.19:verify (NeedTheirOwnClusterTests) @ phoenix-flume ---
[INFO]
[INFO] --- maven-install-plugin:2.5.1:install (default-install) @ phoenix-flume ---
[INFO] Installing <https://builds.apache.org/job/Phoenix-master/946/artifact/phoenix-flume/target/phoenix-flume-4.7.0-HBase-1.1-SNAPSHOT.jar> to /home/jenkins/.m2/repository/org/apache/phoenix/phoenix-flume/4.7.0-HBase-1.1-SNAPSHOT/phoenix-flume-4.7.0-HBase-1.1-SNAPSHOT.jar
[INFO] Installing <https://builds.apache.org/job/Phoenix-master/ws/phoenix-flume/pom.xml> to /home/jenkins/.m2/repository/org/apache/phoenix/phoenix-flume/4.7.0-HBase-1.1-SNAPSHOT/phoenix-flume-4.7.0-HBase-1.1-SNAPSHOT.pom
[INFO] Installing <https://builds.apache.org/job/Phoenix-master/946/artifact/phoenix-flume/target/phoenix-flume-4.7.0-HBase-1.1-SNAPSHOT-sources.jar> to /home/jenkins/.m2/repository/org/apache/phoenix/phoenix-flume/4.7.0-HBase-1.1-SNAPSHOT/phoenix-flume-4.7.0-HBase-1.1-SNAPSHOT-sources.jar
[INFO] Installing <https://builds.apache.org/job/Phoenix-master/946/artifact/phoenix-flume/target/phoenix-flume-4.7.0-HBase-1.1-SNAPSHOT-tests.jar> to /home/jenkins/.m2/repository/org/apache/phoenix/phoenix-flume/4.7.0-HBase-1.1-SNAPSHOT/phoenix-flume-4.7.0-HBase-1.1-SNAPSHOT-tests.jar
[INFO]
[INFO] ------------------------------------------------------------------------
[INFO] Building Phoenix - Pig 4.7.0-HBase-1.1-SNAPSHOT
[INFO] ------------------------------------------------------------------------
Downloading: https://repository.apache.org/content/repositories/releases/org/apache/hbase/hbase-client/1.1.0/hbase-client-1.1.0-tests.jar
4/172 KB
8/172 KB
8/172 KB
12/172 KB
14/172 KB
16/172 KB
20/172 KB
22/172 KB
24/172 KB
28/172 KB
30/172 KB
32/172 KB
36/172 KB
38/172 KB
40/172 KB
44/172 KB
45/172 KB
48/172 KB
52/172 KB
53/172 KB
56/172 KB
60/172 KB
61/172 KB
64/172 KB
68/172 KB
69/172 KB
72/172 KB
76/172 KB
77/172 KB
80/172 KB
84/172 KB
85/172 KB
88/172 KB
92/172 KB
96/172 KB
96/172 KB
100/172 KB
103/172 KB
104/172 KB
108/172 KB
111/172 KB
112/172 KB
116/172 KB
119/172 KB
120/172 KB
124/172 KB
127/172 KB
128/172 KB
132/172 KB
135/172 KB
136/172 KB
140/172 KB
142/172 KB
144/172 KB
148/172 KB
150/172 KB
152/172 KB
156/172 KB
158/172 KB
160/172 KB
164/172 KB
166/172 KB
168/172 KB
172/172 KB
172/172 KB
Downloaded: https://repository.apache.org/content/repositories/releases/org/apache/hbase/hbase-client/1.1.0/hbase-client-1.1.0-tests.jar (172 KB at 968.0 KB/sec)
[INFO]
[INFO] --- maven-clean-plugin:2.5:clean (default-clean) @ phoenix-pig ---
[INFO] Deleting <https://builds.apache.org/job/Phoenix-master/ws/phoenix-pig/target>
[INFO]
[INFO] --- maven-checkstyle-plugin:2.13:check (validate) @ phoenix-pig ---
[INFO]
[INFO] --- build-helper-maven-plugin:1.9.1:add-test-source (add-test-source) @ phoenix-pig ---
[INFO] Test Source directory: <https://builds.apache.org/job/Phoenix-master/ws/phoenix-pig/src/it/java> added.
[INFO]
[INFO] --- build-helper-maven-plugin:1.9.1:add-test-resource (add-test-resource) @ phoenix-pig ---
[INFO]
[INFO] --- maven-remote-resources-plugin:1.5:process (default) @ phoenix-pig ---
[INFO]
[INFO] --- maven-resources-plugin:2.6:resources (default-resources) @ phoenix-pig ---
[INFO] Using 'UTF-8' encoding to copy filtered resources.
[INFO] skip non existing resourceDirectory <https://builds.apache.org/job/Phoenix-master/ws/phoenix-pig/src/main/resources>
[INFO] Copying 3 resources
[INFO]
[INFO] --- maven-compiler-plugin:3.0:compile (default-compile) @ phoenix-pig ---
[INFO] Changes detected - recompiling the module!
[INFO] Compiling 9 source files to <https://builds.apache.org/job/Phoenix-master/ws/phoenix-pig/target/classes>
[INFO]
[INFO] --- maven-dependency-plugin:2.1:build-classpath (create-mrapp-generated-classpath) @ phoenix-pig ---
[INFO] Wrote classpath file '<https://builds.apache.org/job/Phoenix-master/ws/phoenix-pig/target/classes/mrapp-generated-classpath'.>
[INFO]
[INFO] --- maven-resources-plugin:2.6:testResources (default-testResources) @ phoenix-pig ---
[INFO] Using 'UTF-8' encoding to copy filtered resources.
[INFO] skip non existing resourceDirectory <https://builds.apache.org/job/Phoenix-master/ws/phoenix-pig/src/test/resources>
[INFO] skip non existing resourceDirectory <https://builds.apache.org/job/Phoenix-master/ws/phoenix-pig/src/it/resources>
[INFO] Copying 3 resources
[INFO]
[INFO] --- maven-compiler-plugin:3.0:testCompile (default-testCompile) @ phoenix-pig ---
[INFO] Changes detected - recompiling the module!
[INFO] Compiling 8 source files to <https://builds.apache.org/job/Phoenix-master/ws/phoenix-pig/target/test-classes>
[INFO]
[INFO] --- maven-surefire-plugin:2.19:test (default-test) @ phoenix-pig ---
-------------------------------------------------------
T E S T S
-------------------------------------------------------
Running org.apache.phoenix.pig.util.TypeUtilTest
Running org.apache.phoenix.pig.util.TableSchemaParserFunctionTest
Running org.apache.phoenix.pig.util.SqlQueryToColumnInfoFunctionTest
Tests run: 3, Failures: 0, Errors: 0, Skipped: 0, Time elapsed: 0.139 sec - in org.apache.phoenix.pig.util.TableSchemaParserFunctionTest
Running org.apache.phoenix.pig.util.QuerySchemaParserFunctionTest
Tests run: 1, Failures: 0, Errors: 0, Skipped: 0, Time elapsed: 0.552 sec - in org.apache.phoenix.pig.util.TypeUtilTest
Running org.apache.phoenix.pig.util.PhoenixPigSchemaUtilTest
Tests run: 2, Failures: 0, Errors: 0, Skipped: 0, Time elapsed: 0.154 sec - in org.apache.phoenix.pig.util.PhoenixPigSchemaUtilTest
Tests run: 1, Failures: 0, Errors: 0, Skipped: 0, Time elapsed: 2.358 sec - in org.apache.phoenix.pig.util.SqlQueryToColumnInfoFunctionTest
Tests run: 4, Failures: 0, Errors: 0, Skipped: 0, Time elapsed: 2.303 sec - in org.apache.phoenix.pig.util.QuerySchemaParserFunctionTest
Results :
Tests run: 11, Failures: 0, Errors: 0, Skipped: 0
[INFO]
[INFO] --- maven-source-plugin:2.2.1:jar-no-fork (attach-sources) @ phoenix-pig ---
[INFO] Building jar: <https://builds.apache.org/job/Phoenix-master/946/artifact/phoenix-pig/target/phoenix-pig-4.7.0-HBase-1.1-SNAPSHOT-sources.jar>
[INFO]
[INFO] --- maven-jar-plugin:2.4:test-jar (default) @ phoenix-pig ---
[INFO] Building jar: <https://builds.apache.org/job/Phoenix-master/946/artifact/phoenix-pig/target/phoenix-pig-4.7.0-HBase-1.1-SNAPSHOT-tests.jar>
[INFO]
[INFO] --- maven-jar-plugin:2.4:jar (default-jar) @ phoenix-pig ---
[INFO] Building jar: <https://builds.apache.org/job/Phoenix-master/946/artifact/phoenix-pig/target/phoenix-pig-4.7.0-HBase-1.1-SNAPSHOT.jar>
[INFO]
[INFO] --- maven-site-plugin:3.2:attach-descriptor (attach-descriptor) @ phoenix-pig ---
[INFO]
[INFO] --- maven-failsafe-plugin:2.19:integration-test (ClientManagedTimeTests) @ phoenix-pig ---
-------------------------------------------------------
T E S T S
-------------------------------------------------------
Results :
Tests run: 0, Failures: 0, Errors: 0, Skipped: 0
[INFO]
[INFO] --- maven-failsafe-plugin:2.19:integration-test (HBaseManagedTimeTests) @ phoenix-pig ---
-------------------------------------------------------
T E S T S
-------------------------------------------------------
Running org.apache.phoenix.pig.PhoenixHBaseStorerIT
Running org.apache.phoenix.pig.PhoenixHBaseLoaderIT
Running org.apache.phoenix.pig.udf.ReserveNSequenceTestIT
Tests run: 10, Failures: 0, Errors: 0, Skipped: 0, Time elapsed: 2.705 sec - in org.apache.phoenix.pig.udf.ReserveNSequenceTestIT
Tests run: 4, Failures: 0, Errors: 0, Skipped: 0, Time elapsed: 34.659 sec - in org.apache.phoenix.pig.PhoenixHBaseStorerIT
Tests run: 16, Failures: 0, Errors: 0, Skipped: 0, Time elapsed: 122.448 sec - in org.apache.phoenix.pig.PhoenixHBaseLoaderIT
Results :
Tests run: 30, Failures: 0, Errors: 0, Skipped: 0
[INFO]
[INFO] --- maven-failsafe-plugin:2.19:integration-test (NeedTheirOwnClusterTests) @ phoenix-pig ---
-------------------------------------------------------
T E S T S
-------------------------------------------------------
Results :
Tests run: 0, Failures: 0, Errors: 0, Skipped: 0
[INFO]
[INFO] --- maven-failsafe-plugin:2.19:verify (ClientManagedTimeTests) @ phoenix-pig ---
[INFO] ------------------------------------------------------------------------
[INFO] Reactor Summary:
[INFO]
[INFO] Apache Phoenix .................................... SUCCESS [5.451s]
[INFO] Phoenix Core ...................................... SUCCESS [54:15.837s]
[INFO] Phoenix - Flume ................................... SUCCESS [1:11.525s]
[INFO] Phoenix - Pig ..................................... FAILURE [2:46.173s]
[INFO] Phoenix Query Server Client ....................... SKIPPED
[INFO] Phoenix Query Server .............................. SKIPPED
[INFO] Phoenix - Pherf ................................... SKIPPED
[INFO] Phoenix - Spark ................................... SKIPPED
[INFO] Phoenix Assembly .................................. SKIPPED
[INFO] Phoenix - Tracing Web Application ................. SKIPPED
[INFO] ------------------------------------------------------------------------
[INFO] BUILD FAILURE
[INFO] ------------------------------------------------------------------------
[INFO] Total time: 58:19.665s
[INFO] Finished at: Wed Nov 11 02:20:58 UTC 2015
[INFO] Final Memory: 60M/976M
[INFO] ------------------------------------------------------------------------
[ERROR] Failed to execute goal org.apache.maven.plugins:maven-failsafe-plugin:2.19:verify (ClientManagedTimeTests) on project phoenix-pig: There was a timeout or other error in the fork -> [Help 1]
[ERROR]
[ERROR] To see the full stack trace of the errors, re-run Maven with the -e switch.
[ERROR] Re-run Maven using the -X switch to enable full debug logging.
[ERROR]
[ERROR] For more information about the errors and possible solutions, please read the following articles:
[ERROR] [Help 1] http://cwiki.apache.org/confluence/display/MAVEN/MojoExecutionException
[ERROR]
[ERROR] After correcting the problems, you can resume the build with the command
[ERROR] mvn <goals> -rf :phoenix-pig
Build step 'Invoke top-level Maven targets' marked build as failure
Archiving artifacts
Compressed 1.21 GB of artifacts by 56.0% relative to #942
Updating PHOENIX-2397
Recording test results
Build failed in Jenkins: Phoenix | Master #945
Posted by Apache Jenkins Server <je...@builds.apache.org>.
See <https://builds.apache.org/job/Phoenix-master/945/changes>
Changes:
[jamestaylor] PHOENIX-2396 Set root cause exception when parsing server exception
------------------------------------------
[...truncated 7505 lines...]
at org.apache.hadoop.hbase.ipc.RegionCoprocessorRpcChannel.callExecService(RegionCoprocessorRpcChannel.java:95)
at org.apache.hadoop.hbase.ipc.CoprocessorRpcChannel.callMethod(CoprocessorRpcChannel.java:56)
at org.apache.phoenix.coprocessor.generated.MetaDataProtos$MetaDataService$Stub.dropColumn(MetaDataProtos.java:11874)
at org.apache.phoenix.query.ConnectionQueryServicesImpl$11.call(ConnectionQueryServicesImpl.java:1832)
at org.apache.phoenix.query.ConnectionQueryServicesImpl$11.call(ConnectionQueryServicesImpl.java:1820)
at org.apache.hadoop.hbase.client.HTable$16.call(HTable.java:1727)
at java.util.concurrent.FutureTask.run(FutureTask.java:262)
at java.util.concurrent.ThreadPoolExecutor.runWorker(ThreadPoolExecutor.java:1145)
at java.util.concurrent.ThreadPoolExecutor$Worker.run(ThreadPoolExecutor.java:615)
at java.lang.Thread.run(Thread.java:745)
testDropIndexedColumn(org.apache.phoenix.end2end.AlterTableIT) Time elapsed: 8.037 sec <<< ERROR!
java.sql.SQLException: ERROR 2009 (INT11): Unknown error code ERROR 0 (08001): No suitable driver found for jdbc:phoenix:localhost:60926:/hbase; T
at org.apache.phoenix.exception.SQLExceptionCode$Factory$1.newException(SQLExceptionCode.java:396)
at org.apache.phoenix.exception.SQLExceptionInfo.buildException(SQLExceptionInfo.java:145)
at org.apache.phoenix.util.ServerUtil.parseRemoteException(ServerUtil.java:126)
at org.apache.phoenix.util.ServerUtil.parseServerExceptionOrNull(ServerUtil.java:115)
at org.apache.phoenix.util.ServerUtil.parseServerException(ServerUtil.java:104)
at org.apache.phoenix.query.ConnectionQueryServicesImpl.metaDataCoprocessorExec(ConnectionQueryServicesImpl.java:1053)
at org.apache.phoenix.query.ConnectionQueryServicesImpl.metaDataCoprocessorExec(ConnectionQueryServicesImpl.java:1016)
at org.apache.phoenix.query.ConnectionQueryServicesImpl.dropColumn(ConnectionQueryServicesImpl.java:1819)
at org.apache.phoenix.schema.MetaDataClient.dropColumn(MetaDataClient.java:2880)
at org.apache.phoenix.jdbc.PhoenixStatement$ExecutableDropColumnStatement$1.execute(PhoenixStatement.java:1147)
at org.apache.phoenix.jdbc.PhoenixStatement$2.call(PhoenixStatement.java:322)
at org.apache.phoenix.jdbc.PhoenixStatement$2.call(PhoenixStatement.java:314)
at org.apache.phoenix.call.CallRunner.run(CallRunner.java:53)
at org.apache.phoenix.jdbc.PhoenixStatement.executeMutation(PhoenixStatement.java:312)
at org.apache.phoenix.jdbc.PhoenixStatement.execute(PhoenixStatement.java:1435)
at org.apache.phoenix.end2end.AlterTableIT.testDropIndexedColumn(AlterTableIT.java:285)
Caused by: org.apache.hadoop.hbase.ipc.RemoteWithExtrasException: org.apache.hadoop.hbase.DoNotRetryIOException: ERROR 0 (08001): No suitable driver found for jdbc:phoenix:localhost:60926:/hbase; T
at org.apache.phoenix.util.ServerUtil.createIOException(ServerUtil.java:76)
at org.apache.phoenix.util.ServerUtil.throwIOException(ServerUtil.java:52)
at org.apache.phoenix.coprocessor.MetaDataEndpointImpl.mutateColumn(MetaDataEndpointImpl.java:1685)
at org.apache.phoenix.coprocessor.MetaDataEndpointImpl.dropColumn(MetaDataEndpointImpl.java:2497)
at org.apache.phoenix.coprocessor.generated.MetaDataProtos$MetaDataService.callMethod(MetaDataProtos.java:11644)
at org.apache.hadoop.hbase.regionserver.HRegion.execService(HRegion.java:7356)
at org.apache.hadoop.hbase.regionserver.RSRpcServices.execServiceOnRegion(RSRpcServices.java:1849)
at org.apache.hadoop.hbase.regionserver.RSRpcServices.execService(RSRpcServices.java:1831)
at org.apache.hadoop.hbase.protobuf.generated.ClientProtos$ClientService$2.callBlockingMethod(ClientProtos.java:32209)
at org.apache.hadoop.hbase.ipc.RpcServer.call(RpcServer.java:2112)
at org.apache.hadoop.hbase.ipc.CallRunner.run(CallRunner.java:101)
at org.apache.hadoop.hbase.ipc.RpcExecutor.consumerLoop(RpcExecutor.java:130)
at org.apache.hadoop.hbase.ipc.RpcExecutor$1.run(RpcExecutor.java:107)
at java.lang.Thread.run(Thread.java:745)
Caused by: java.sql.SQLException: No suitable driver found for jdbc:phoenix:localhost:60926:/hbase;
at java.sql.DriverManager.getConnection(DriverManager.java:596)
at java.sql.DriverManager.getConnection(DriverManager.java:187)
at org.apache.phoenix.util.QueryUtil.getConnection(QueryUtil.java:300)
at org.apache.phoenix.util.QueryUtil.getConnection(QueryUtil.java:291)
at org.apache.phoenix.coprocessor.MetaDataEndpointImpl$4.updateMutation(MetaDataEndpointImpl.java:2573)
at org.apache.phoenix.coprocessor.MetaDataEndpointImpl.mutateColumn(MetaDataEndpointImpl.java:1666)
... 11 more
at org.apache.hadoop.hbase.ipc.RpcClientImpl.call(RpcClientImpl.java:1196)
at org.apache.hadoop.hbase.ipc.AbstractRpcClient.callBlockingMethod(AbstractRpcClient.java:213)
at org.apache.hadoop.hbase.ipc.AbstractRpcClient$BlockingRpcChannelImplementation.callBlockingMethod(AbstractRpcClient.java:287)
at org.apache.hadoop.hbase.protobuf.generated.ClientProtos$ClientService$BlockingStub.execService(ClientProtos.java:32675)
at org.apache.hadoop.hbase.protobuf.ProtobufUtil.execService(ProtobufUtil.java:1615)
at org.apache.hadoop.hbase.ipc.RegionCoprocessorRpcChannel$1.call(RegionCoprocessorRpcChannel.java:92)
at org.apache.hadoop.hbase.ipc.RegionCoprocessorRpcChannel$1.call(RegionCoprocessorRpcChannel.java:89)
at org.apache.hadoop.hbase.client.RpcRetryingCaller.callWithRetries(RpcRetryingCaller.java:126)
at org.apache.hadoop.hbase.ipc.RegionCoprocessorRpcChannel.callExecService(RegionCoprocessorRpcChannel.java:95)
at org.apache.hadoop.hbase.ipc.CoprocessorRpcChannel.callMethod(CoprocessorRpcChannel.java:56)
at org.apache.phoenix.coprocessor.generated.MetaDataProtos$MetaDataService$Stub.dropColumn(MetaDataProtos.java:11874)
at org.apache.phoenix.query.ConnectionQueryServicesImpl$11.call(ConnectionQueryServicesImpl.java:1832)
at org.apache.phoenix.query.ConnectionQueryServicesImpl$11.call(ConnectionQueryServicesImpl.java:1820)
at org.apache.hadoop.hbase.client.HTable$16.call(HTable.java:1727)
at java.util.concurrent.FutureTask.run(FutureTask.java:262)
at java.util.concurrent.ThreadPoolExecutor.runWorker(ThreadPoolExecutor.java:1145)
at java.util.concurrent.ThreadPoolExecutor$Worker.run(ThreadPoolExecutor.java:615)
at java.lang.Thread.run(Thread.java:745)
testDropCoveredColumn(org.apache.phoenix.end2end.AlterTableIT) Time elapsed: 6.868 sec <<< ERROR!
java.sql.SQLException: ERROR 2009 (INT11): Unknown error code ERROR 0 (08001): No suitable driver found for jdbc:phoenix:localhost:60926:/hbase; T
at org.apache.phoenix.exception.SQLExceptionCode$Factory$1.newException(SQLExceptionCode.java:396)
at org.apache.phoenix.exception.SQLExceptionInfo.buildException(SQLExceptionInfo.java:145)
at org.apache.phoenix.util.ServerUtil.parseRemoteException(ServerUtil.java:126)
at org.apache.phoenix.util.ServerUtil.parseServerExceptionOrNull(ServerUtil.java:115)
at org.apache.phoenix.util.ServerUtil.parseServerException(ServerUtil.java:104)
at org.apache.phoenix.query.ConnectionQueryServicesImpl.metaDataCoprocessorExec(ConnectionQueryServicesImpl.java:1053)
at org.apache.phoenix.query.ConnectionQueryServicesImpl.metaDataCoprocessorExec(ConnectionQueryServicesImpl.java:1016)
at org.apache.phoenix.query.ConnectionQueryServicesImpl.dropColumn(ConnectionQueryServicesImpl.java:1819)
at org.apache.phoenix.schema.MetaDataClient.dropColumn(MetaDataClient.java:2880)
at org.apache.phoenix.jdbc.PhoenixStatement$ExecutableDropColumnStatement$1.execute(PhoenixStatement.java:1147)
at org.apache.phoenix.jdbc.PhoenixStatement$2.call(PhoenixStatement.java:322)
at org.apache.phoenix.jdbc.PhoenixStatement$2.call(PhoenixStatement.java:314)
at org.apache.phoenix.call.CallRunner.run(CallRunner.java:53)
at org.apache.phoenix.jdbc.PhoenixStatement.executeMutation(PhoenixStatement.java:312)
at org.apache.phoenix.jdbc.PhoenixStatement.execute(PhoenixStatement.java:1435)
at org.apache.phoenix.end2end.AlterTableIT.testDropCoveredColumn(AlterTableIT.java:350)
Caused by: org.apache.hadoop.hbase.ipc.RemoteWithExtrasException: org.apache.hadoop.hbase.DoNotRetryIOException: ERROR 0 (08001): No suitable driver found for jdbc:phoenix:localhost:60926:/hbase; T
at org.apache.phoenix.util.ServerUtil.createIOException(ServerUtil.java:76)
at org.apache.phoenix.util.ServerUtil.throwIOException(ServerUtil.java:52)
at org.apache.phoenix.coprocessor.MetaDataEndpointImpl.mutateColumn(MetaDataEndpointImpl.java:1685)
at org.apache.phoenix.coprocessor.MetaDataEndpointImpl.dropColumn(MetaDataEndpointImpl.java:2497)
at org.apache.phoenix.coprocessor.generated.MetaDataProtos$MetaDataService.callMethod(MetaDataProtos.java:11644)
at org.apache.hadoop.hbase.regionserver.HRegion.execService(HRegion.java:7356)
at org.apache.hadoop.hbase.regionserver.RSRpcServices.execServiceOnRegion(RSRpcServices.java:1849)
at org.apache.hadoop.hbase.regionserver.RSRpcServices.execService(RSRpcServices.java:1831)
at org.apache.hadoop.hbase.protobuf.generated.ClientProtos$ClientService$2.callBlockingMethod(ClientProtos.java:32209)
at org.apache.hadoop.hbase.ipc.RpcServer.call(RpcServer.java:2112)
at org.apache.hadoop.hbase.ipc.CallRunner.run(CallRunner.java:101)
at org.apache.hadoop.hbase.ipc.RpcExecutor.consumerLoop(RpcExecutor.java:130)
at org.apache.hadoop.hbase.ipc.RpcExecutor$1.run(RpcExecutor.java:107)
at java.lang.Thread.run(Thread.java:745)
Caused by: java.sql.SQLException: No suitable driver found for jdbc:phoenix:localhost:60926:/hbase;
at java.sql.DriverManager.getConnection(DriverManager.java:596)
at java.sql.DriverManager.getConnection(DriverManager.java:187)
at org.apache.phoenix.util.QueryUtil.getConnection(QueryUtil.java:300)
at org.apache.phoenix.util.QueryUtil.getConnection(QueryUtil.java:291)
at org.apache.phoenix.coprocessor.MetaDataEndpointImpl$4.updateMutation(MetaDataEndpointImpl.java:2573)
at org.apache.phoenix.coprocessor.MetaDataEndpointImpl.mutateColumn(MetaDataEndpointImpl.java:1666)
... 11 more
at org.apache.hadoop.hbase.ipc.RpcClientImpl.call(RpcClientImpl.java:1196)
at org.apache.hadoop.hbase.ipc.AbstractRpcClient.callBlockingMethod(AbstractRpcClient.java:213)
at org.apache.hadoop.hbase.ipc.AbstractRpcClient$BlockingRpcChannelImplementation.callBlockingMethod(AbstractRpcClient.java:287)
at org.apache.hadoop.hbase.protobuf.generated.ClientProtos$ClientService$BlockingStub.execService(ClientProtos.java:32675)
at org.apache.hadoop.hbase.protobuf.ProtobufUtil.execService(ProtobufUtil.java:1615)
at org.apache.hadoop.hbase.ipc.RegionCoprocessorRpcChannel$1.call(RegionCoprocessorRpcChannel.java:92)
at org.apache.hadoop.hbase.ipc.RegionCoprocessorRpcChannel$1.call(RegionCoprocessorRpcChannel.java:89)
at org.apache.hadoop.hbase.client.RpcRetryingCaller.callWithRetries(RpcRetryingCaller.java:126)
at org.apache.hadoop.hbase.ipc.RegionCoprocessorRpcChannel.callExecService(RegionCoprocessorRpcChannel.java:95)
at org.apache.hadoop.hbase.ipc.CoprocessorRpcChannel.callMethod(CoprocessorRpcChannel.java:56)
at org.apache.phoenix.coprocessor.generated.MetaDataProtos$MetaDataService$Stub.dropColumn(MetaDataProtos.java:11874)
at org.apache.phoenix.query.ConnectionQueryServicesImpl$11.call(ConnectionQueryServicesImpl.java:1832)
at org.apache.phoenix.query.ConnectionQueryServicesImpl$11.call(ConnectionQueryServicesImpl.java:1820)
at org.apache.hadoop.hbase.client.HTable$16.call(HTable.java:1727)
at java.util.concurrent.FutureTask.run(FutureTask.java:262)
at java.util.concurrent.ThreadPoolExecutor.runWorker(ThreadPoolExecutor.java:1145)
at java.util.concurrent.ThreadPoolExecutor$Worker.run(ThreadPoolExecutor.java:615)
at java.lang.Thread.run(Thread.java:745)
testDropColumnsWithImutability(org.apache.phoenix.end2end.AlterTableIT) Time elapsed: 12.535 sec <<< ERROR!
java.sql.SQLException: ERROR 2009 (INT11): Unknown error code ERROR 0 (08001): No suitable driver found for jdbc:phoenix:localhost:60926:/hbase; TEST_TABLE
at org.apache.phoenix.exception.SQLExceptionCode$Factory$1.newException(SQLExceptionCode.java:396)
at org.apache.phoenix.exception.SQLExceptionInfo.buildException(SQLExceptionInfo.java:145)
at org.apache.phoenix.util.ServerUtil.parseRemoteException(ServerUtil.java:126)
at org.apache.phoenix.util.ServerUtil.parseServerExceptionOrNull(ServerUtil.java:115)
at org.apache.phoenix.util.ServerUtil.parseServerException(ServerUtil.java:104)
at org.apache.phoenix.query.ConnectionQueryServicesImpl.metaDataCoprocessorExec(ConnectionQueryServicesImpl.java:1053)
at org.apache.phoenix.query.ConnectionQueryServicesImpl.metaDataCoprocessorExec(ConnectionQueryServicesImpl.java:1016)
at org.apache.phoenix.query.ConnectionQueryServicesImpl.dropColumn(ConnectionQueryServicesImpl.java:1819)
at org.apache.phoenix.schema.MetaDataClient.dropColumn(MetaDataClient.java:2880)
at org.apache.phoenix.jdbc.PhoenixStatement$ExecutableDropColumnStatement$1.execute(PhoenixStatement.java:1147)
at org.apache.phoenix.jdbc.PhoenixStatement$2.call(PhoenixStatement.java:322)
at org.apache.phoenix.jdbc.PhoenixStatement$2.call(PhoenixStatement.java:314)
at org.apache.phoenix.call.CallRunner.run(CallRunner.java:53)
at org.apache.phoenix.jdbc.PhoenixStatement.executeMutation(PhoenixStatement.java:312)
at org.apache.phoenix.jdbc.PhoenixStatement.execute(PhoenixStatement.java:1435)
at org.apache.phoenix.end2end.AlterTableIT.testDropColumnsWithImutability(AlterTableIT.java:874)
Caused by: org.apache.hadoop.hbase.ipc.RemoteWithExtrasException: org.apache.hadoop.hbase.DoNotRetryIOException: ERROR 0 (08001): No suitable driver found for jdbc:phoenix:localhost:60926:/hbase; TEST_TABLE
at org.apache.phoenix.util.ServerUtil.createIOException(ServerUtil.java:76)
at org.apache.phoenix.util.ServerUtil.throwIOException(ServerUtil.java:52)
at org.apache.phoenix.coprocessor.MetaDataEndpointImpl.mutateColumn(MetaDataEndpointImpl.java:1685)
at org.apache.phoenix.coprocessor.MetaDataEndpointImpl.dropColumn(MetaDataEndpointImpl.java:2497)
at org.apache.phoenix.coprocessor.generated.MetaDataProtos$MetaDataService.callMethod(MetaDataProtos.java:11644)
at org.apache.hadoop.hbase.regionserver.HRegion.execService(HRegion.java:7356)
at org.apache.hadoop.hbase.regionserver.RSRpcServices.execServiceOnRegion(RSRpcServices.java:1849)
at org.apache.hadoop.hbase.regionserver.RSRpcServices.execService(RSRpcServices.java:1831)
at org.apache.hadoop.hbase.protobuf.generated.ClientProtos$ClientService$2.callBlockingMethod(ClientProtos.java:32209)
at org.apache.hadoop.hbase.ipc.RpcServer.call(RpcServer.java:2112)
at org.apache.hadoop.hbase.ipc.CallRunner.run(CallRunner.java:101)
at org.apache.hadoop.hbase.ipc.RpcExecutor.consumerLoop(RpcExecutor.java:130)
at org.apache.hadoop.hbase.ipc.RpcExecutor$1.run(RpcExecutor.java:107)
at java.lang.Thread.run(Thread.java:745)
Caused by: java.sql.SQLException: No suitable driver found for jdbc:phoenix:localhost:60926:/hbase;
at java.sql.DriverManager.getConnection(DriverManager.java:596)
at java.sql.DriverManager.getConnection(DriverManager.java:187)
at org.apache.phoenix.util.QueryUtil.getConnection(QueryUtil.java:300)
at org.apache.phoenix.util.QueryUtil.getConnection(QueryUtil.java:291)
at org.apache.phoenix.coprocessor.MetaDataEndpointImpl$4.updateMutation(MetaDataEndpointImpl.java:2573)
at org.apache.phoenix.coprocessor.MetaDataEndpointImpl.mutateColumn(MetaDataEndpointImpl.java:1666)
... 11 more
at org.apache.hadoop.hbase.ipc.RpcClientImpl.call(RpcClientImpl.java:1196)
at org.apache.hadoop.hbase.ipc.AbstractRpcClient.callBlockingMethod(AbstractRpcClient.java:213)
at org.apache.hadoop.hbase.ipc.AbstractRpcClient$BlockingRpcChannelImplementation.callBlockingMethod(AbstractRpcClient.java:287)
at org.apache.hadoop.hbase.protobuf.generated.ClientProtos$ClientService$BlockingStub.execService(ClientProtos.java:32675)
at org.apache.hadoop.hbase.protobuf.ProtobufUtil.execService(ProtobufUtil.java:1615)
at org.apache.hadoop.hbase.ipc.RegionCoprocessorRpcChannel$1.call(RegionCoprocessorRpcChannel.java:92)
at org.apache.hadoop.hbase.ipc.RegionCoprocessorRpcChannel$1.call(RegionCoprocessorRpcChannel.java:89)
at org.apache.hadoop.hbase.client.RpcRetryingCaller.callWithRetries(RpcRetryingCaller.java:126)
at org.apache.hadoop.hbase.ipc.RegionCoprocessorRpcChannel.callExecService(RegionCoprocessorRpcChannel.java:95)
at org.apache.hadoop.hbase.ipc.CoprocessorRpcChannel.callMethod(CoprocessorRpcChannel.java:56)
at org.apache.phoenix.coprocessor.generated.MetaDataProtos$MetaDataService$Stub.dropColumn(MetaDataProtos.java:11874)
at org.apache.phoenix.query.ConnectionQueryServicesImpl$11.call(ConnectionQueryServicesImpl.java:1832)
at org.apache.phoenix.query.ConnectionQueryServicesImpl$11.call(ConnectionQueryServicesImpl.java:1820)
at org.apache.hadoop.hbase.client.HTable$16.call(HTable.java:1727)
at java.util.concurrent.FutureTask.run(FutureTask.java:262)
at java.util.concurrent.ThreadPoolExecutor.runWorker(ThreadPoolExecutor.java:1145)
at java.util.concurrent.ThreadPoolExecutor$Worker.run(ThreadPoolExecutor.java:615)
at java.lang.Thread.run(Thread.java:745)
Tests run: 9, Failures: 0, Errors: 0, Skipped: 0, Time elapsed: 352.496 sec - in org.apache.phoenix.mapreduce.IndexToolIT
Results :
Tests in error:
AlterTableIT.testDropColumnsWithImutability:874 » SQL ERROR 2009 (INT11): Unkn...
AlterTableIT.testDropCoveredColumn:350 » SQL ERROR 2009 (INT11): Unknown error...
AlterTableIT.testDropIndexedColumn:285 » SQL ERROR 2009 (INT11): Unknown error...
AlterTableIT.testDropMultipleColumns:1039 » SQL ERROR 2009 (INT11): Unknown er...
Tests run: 250, Failures: 0, Errors: 4, Skipped: 2
[INFO]
[INFO] --- maven-failsafe-plugin:2.18:verify (ClientManagedTimeTests) @ phoenix-core ---
[INFO] Failsafe report directory: <https://builds.apache.org/job/Phoenix-master/ws/phoenix-core/target/failsafe-reports>
[INFO] ------------------------------------------------------------------------
[INFO] Reactor Summary:
[INFO]
[INFO] Apache Phoenix .................................... SUCCESS [4.788s]
[INFO] Phoenix Core ...................................... FAILURE [40:22.439s]
[INFO] Phoenix - Flume ................................... SKIPPED
[INFO] Phoenix - Pig ..................................... SKIPPED
[INFO] Phoenix Query Server Client ....................... SKIPPED
[INFO] Phoenix Query Server .............................. SKIPPED
[INFO] Phoenix - Pherf ................................... SKIPPED
[INFO] Phoenix - Spark ................................... SKIPPED
[INFO] Phoenix Assembly .................................. SKIPPED
[INFO] Phoenix - Tracing Web Application ................. SKIPPED
[INFO] ------------------------------------------------------------------------
[INFO] BUILD FAILURE
[INFO] ------------------------------------------------------------------------
[INFO] Total time: 40:27.878s
[INFO] Finished at: Wed Nov 11 01:18:57 UTC 2015
[INFO] Final Memory: 63M/999M
[INFO] ------------------------------------------------------------------------
[ERROR] Failed to execute goal org.apache.maven.plugins:maven-failsafe-plugin:2.18:verify (ClientManagedTimeTests) on project phoenix-core: There are test failures.
[ERROR]
[ERROR] Please refer to <https://builds.apache.org/job/Phoenix-master/ws/phoenix-core/target/failsafe-reports> for the individual test results.
[ERROR] -> [Help 1]
[ERROR]
[ERROR] To see the full stack trace of the errors, re-run Maven with the -e switch.
[ERROR] Re-run Maven using the -X switch to enable full debug logging.
[ERROR]
[ERROR] For more information about the errors and possible solutions, please read the following articles:
[ERROR] [Help 1] http://cwiki.apache.org/confluence/display/MAVEN/MojoFailureException
[ERROR]
[ERROR] After correcting the problems, you can resume the build with the command
[ERROR] mvn <goals> -rf :phoenix-core
Build step 'Invoke top-level Maven targets' marked build as failure
Archiving artifacts
Compressed 1.13 GB of artifacts by 49.3% relative to #942
Updating PHOENIX-2396
Recording test results
Build failed in Jenkins: Phoenix | Master #944
Posted by Apache Jenkins Server <je...@builds.apache.org>.
See <https://builds.apache.org/job/Phoenix-master/944/changes>
Changes:
[jan] PHOENIX-2373- Change ReserveNSequence Udf to take in zookeeper and
------------------------------------------
[...truncated 7332 lines...]
Tests run: 2, Failures: 0, Errors: 0, Skipped: 0, Time elapsed: 34.015 sec - in org.apache.phoenix.end2end.PhoenixRuntimeIT
Running org.apache.phoenix.end2end.AutoCommitIT
Tests run: 3, Failures: 0, Errors: 0, Skipped: 0, Time elapsed: 16.091 sec - in org.apache.phoenix.end2end.ExpFunctionEnd2EndIT
Running org.apache.phoenix.end2end.SortMergeJoinIT
Tests run: 1, Failures: 0, Errors: 0, Skipped: 0, Time elapsed: 6.457 sec - in org.apache.phoenix.end2end.AutoCommitIT
Running org.apache.phoenix.end2end.StddevIT
Tests run: 4, Failures: 0, Errors: 0, Skipped: 0, Time elapsed: 8.187 sec - in org.apache.phoenix.end2end.StddevIT
Running org.apache.phoenix.end2end.IsNullIT
Tests run: 34, Failures: 0, Errors: 0, Skipped: 0, Time elapsed: 33.235 sec - in org.apache.phoenix.end2end.ArrayAppendFunctionIT
Running org.apache.phoenix.end2end.SignFunctionEnd2EndIT
Tests run: 3, Failures: 0, Errors: 0, Skipped: 0, Time elapsed: 11.156 sec - in org.apache.phoenix.end2end.IsNullIT
Running org.apache.phoenix.end2end.LastValueFunctionIT
Tests run: 2, Failures: 0, Errors: 0, Skipped: 0, Time elapsed: 12.447 sec - in org.apache.phoenix.end2end.SignFunctionEnd2EndIT
Running org.apache.phoenix.end2end.HashJoinLocalIndexIT
Tests run: 11, Failures: 0, Errors: 0, Skipped: 0, Time elapsed: 15.521 sec - in org.apache.phoenix.end2end.LastValueFunctionIT
Running org.apache.phoenix.end2end.RoundFloorCeilFunctionsEnd2EndIT
Tests run: 31, Failures: 0, Errors: 0, Skipped: 0, Time elapsed: 28.092 sec - in org.apache.phoenix.end2end.RoundFloorCeilFunctionsEnd2EndIT
Running org.apache.phoenix.end2end.LpadFunctionIT
Tests run: 1, Failures: 0, Errors: 0, Skipped: 0, Time elapsed: 38.537 sec - in org.apache.phoenix.end2end.HashJoinLocalIndexIT
Running org.apache.phoenix.iterate.RoundRobinResultIteratorIT
Tests run: 12, Failures: 0, Errors: 0, Skipped: 0, Time elapsed: 30.93 sec - in org.apache.phoenix.end2end.LpadFunctionIT
Running org.apache.phoenix.iterate.PhoenixQueryTimeoutIT
Tests run: 2, Failures: 0, Errors: 0, Skipped: 0, Time elapsed: 6.279 sec - in org.apache.phoenix.iterate.PhoenixQueryTimeoutIT
Tests run: 108, Failures: 0, Errors: 0, Skipped: 0, Time elapsed: 354.095 sec - in org.apache.phoenix.end2end.HashJoinIT
Tests run: 15, Failures: 0, Errors: 0, Skipped: 0, Time elapsed: 227.511 sec - in org.apache.phoenix.end2end.AlterTableWithViewsIT
Tests run: 9, Failures: 0, Errors: 0, Skipped: 0, Time elapsed: 93.741 sec - in org.apache.phoenix.iterate.RoundRobinResultIteratorIT
Tests run: 108, Failures: 0, Errors: 0, Skipped: 0, Time elapsed: 176.643 sec - in org.apache.phoenix.end2end.SortMergeJoinIT
Results :
Tests run: 1176, Failures: 0, Errors: 0, Skipped: 0
[INFO]
[INFO] --- maven-failsafe-plugin:2.18:integration-test (NeedTheirOwnClusterTests) @ phoenix-core ---
[INFO] Failsafe report directory: <https://builds.apache.org/job/Phoenix-master/ws/phoenix-core/target/failsafe-reports>
[INFO] parallel='none', perCoreThreadCount=true, threadCount=0, useUnlimitedThreads=false, threadCountSuites=0, threadCountClasses=0, threadCountMethods=0, parallelOptimized=true
-------------------------------------------------------
T E S T S
-------------------------------------------------------
Running org.apache.phoenix.hbase.index.covered.example.EndToEndCoveredIndexingIT
Running org.apache.phoenix.hbase.index.balancer.IndexLoadBalancerIT
Running org.apache.phoenix.rpc.PhoenixClientRpcIT
Running org.apache.phoenix.rpc.PhoenixServerRpcIT
Running org.apache.phoenix.monitoring.PhoenixMetricsIT
Tests run: 2, Failures: 0, Errors: 0, Skipped: 0, Time elapsed: 14.352 sec - in org.apache.phoenix.rpc.PhoenixClientRpcIT
Tests run: 2, Failures: 0, Errors: 0, Skipped: 0, Time elapsed: 14.274 sec - in org.apache.phoenix.rpc.PhoenixServerRpcIT
Running org.apache.phoenix.hbase.index.covered.example.FailWithoutRetriesIT
Running org.apache.phoenix.hbase.index.covered.example.EndtoEndIndexingWithCompressionIT
Tests run: 1, Failures: 0, Errors: 0, Skipped: 0, Time elapsed: 9.49 sec - in org.apache.phoenix.hbase.index.covered.example.FailWithoutRetriesIT
Running org.apache.phoenix.hbase.index.covered.EndToEndCoveredColumnsIndexBuilderIT
Tests run: 2, Failures: 0, Errors: 0, Skipped: 0, Time elapsed: 18.577 sec - in org.apache.phoenix.hbase.index.covered.EndToEndCoveredColumnsIndexBuilderIT
Running org.apache.phoenix.hbase.index.FailForUnsupportedHBaseVersionsIT
Tests run: 17, Failures: 0, Errors: 0, Skipped: 0, Time elapsed: 64.906 sec - in org.apache.phoenix.monitoring.PhoenixMetricsIT
Running org.apache.phoenix.end2end.ConnectionUtilIT
Tests run: 2, Failures: 0, Errors: 0, Skipped: 0, Time elapsed: 17.003 sec - in org.apache.phoenix.hbase.index.FailForUnsupportedHBaseVersionsIT
Running org.apache.phoenix.end2end.SpillableGroupByIT
Tests run: 1, Failures: 0, Errors: 0, Skipped: 0, Time elapsed: 19.09 sec - in org.apache.phoenix.end2end.ConnectionUtilIT
Tests run: 1, Failures: 0, Errors: 0, Skipped: 0, Time elapsed: 7.848 sec - in org.apache.phoenix.end2end.SpillableGroupByIT
Running org.apache.phoenix.end2end.KeyOnlyIT
Running org.apache.phoenix.end2end.ParallelIteratorsIT
Tests run: 11, Failures: 0, Errors: 0, Skipped: 0, Time elapsed: 128.076 sec - in org.apache.phoenix.hbase.index.covered.example.EndToEndCoveredIndexingIT
Tests run: 3, Failures: 0, Errors: 0, Skipped: 0, Time elapsed: 18.075 sec - in org.apache.phoenix.end2end.KeyOnlyIT
Running org.apache.phoenix.end2end.TenantSpecificTablesDDLIT
Tests run: 11, Failures: 0, Errors: 0, Skipped: 0, Time elapsed: 119.078 sec - in org.apache.phoenix.hbase.index.covered.example.EndtoEndIndexingWithCompressionIT
Running org.apache.phoenix.end2end.index.MutableIndexFailureIT
Running org.apache.phoenix.end2end.index.MutableIndexReplicationIT
Tests run: 9, Failures: 0, Errors: 0, Skipped: 0, Time elapsed: 161.917 sec - in org.apache.phoenix.hbase.index.balancer.IndexLoadBalancerIT
Tests run: 3, Failures: 0, Errors: 0, Skipped: 0, Time elapsed: 37.173 sec - in org.apache.phoenix.end2end.ParallelIteratorsIT
Running org.apache.phoenix.end2end.ContextClassloaderIT
Running org.apache.phoenix.end2end.index.ImmutableIndexWithStatsIT
Tests run: 1, Failures: 0, Errors: 0, Skipped: 0, Time elapsed: 27.458 sec - in org.apache.phoenix.end2end.index.MutableIndexReplicationIT
Tests run: 3, Failures: 0, Errors: 0, Skipped: 0, Time elapsed: 6.698 sec - in org.apache.phoenix.end2end.ContextClassloaderIT
Tests run: 1, Failures: 0, Errors: 0, Skipped: 0, Time elapsed: 5.999 sec - in org.apache.phoenix.end2end.index.ImmutableIndexWithStatsIT
Tests run: 17, Failures: 0, Errors: 0, Skipped: 0, Time elapsed: 45.823 sec - in org.apache.phoenix.end2end.TenantSpecificTablesDDLIT
Tests run: 3, Failures: 0, Errors: 0, Skipped: 2, Time elapsed: 43.745 sec - in org.apache.phoenix.end2end.index.MutableIndexFailureIT
Running org.apache.phoenix.end2end.QueryWithLimitIT
Running org.apache.phoenix.end2end.AlterTableIT
Running org.apache.phoenix.end2end.ViewIT
Running org.apache.phoenix.end2end.StatsCollectorWithSplitsAndMultiCFIT
Running org.apache.phoenix.end2end.StatsCollectorIT
Tests run: 2, Failures: 0, Errors: 0, Skipped: 0, Time elapsed: 19.147 sec - in org.apache.phoenix.end2end.QueryWithLimitIT
Running org.apache.phoenix.end2end.CountDistinctCompressionIT
Tests run: 2, Failures: 0, Errors: 0, Skipped: 0, Time elapsed: 28.15 sec - in org.apache.phoenix.end2end.StatsCollectorWithSplitsAndMultiCFIT
Tests run: 1, Failures: 0, Errors: 0, Skipped: 0, Time elapsed: 8.023 sec - in org.apache.phoenix.end2end.CountDistinctCompressionIT
Running org.apache.phoenix.end2end.TenantSpecificTablesDMLIT
Running org.apache.phoenix.end2end.UserDefinedFunctionsIT
Tests run: 22, Failures: 0, Errors: 0, Skipped: 0, Time elapsed: 57.33 sec - in org.apache.phoenix.end2end.ViewIT
Tests run: 4, Failures: 0, Errors: 0, Skipped: 0, Time elapsed: 57.51 sec - in org.apache.phoenix.end2end.StatsCollectorIT
Running org.apache.phoenix.end2end.SaltedViewIT
Running org.apache.phoenix.end2end.QueryTimeoutIT
Tests run: 13, Failures: 0, Errors: 0, Skipped: 0, Time elapsed: 31.51 sec - in org.apache.phoenix.end2end.UserDefinedFunctionsIT
Tests run: 2, Failures: 0, Errors: 0, Skipped: 0, Time elapsed: 16.345 sec - in org.apache.phoenix.end2end.SaltedViewIT
Tests run: 1, Failures: 0, Errors: 0, Skipped: 0, Time elapsed: 17.09 sec - in org.apache.phoenix.end2end.QueryTimeoutIT
Tests run: 16, Failures: 0, Errors: 0, Skipped: 0, Time elapsed: 48.149 sec - in org.apache.phoenix.end2end.TenantSpecificTablesDMLIT
Running org.apache.phoenix.end2end.UnionAllIT
Running org.apache.phoenix.end2end.MultiCfQueryExecIT
Running org.apache.phoenix.iterate.RoundRobinResultIteratorWithStatsIT
Running org.apache.phoenix.execute.PartialCommitIT
Tests run: 1, Failures: 0, Errors: 0, Skipped: 0, Time elapsed: 8.205 sec - in org.apache.phoenix.iterate.RoundRobinResultIteratorWithStatsIT
Tests run: 6, Failures: 0, Errors: 0, Skipped: 0, Time elapsed: 3.231 sec - in org.apache.phoenix.execute.PartialCommitIT
Tests run: 7, Failures: 0, Errors: 0, Skipped: 0, Time elapsed: 15.221 sec - in org.apache.phoenix.end2end.MultiCfQueryExecIT
Running org.apache.hadoop.hbase.regionserver.wal.WALReplayWithIndexWritesAndCompressedWALIT
Tests run: 12, Failures: 0, Errors: 0, Skipped: 0, Time elapsed: 37.62 sec - in org.apache.phoenix.end2end.UnionAllIT
Running org.apache.hadoop.hbase.regionserver.wal.WALReplayWithIndexWritesAndUncompressedWALInHBase_094_9_IT
Running org.apache.phoenix.mapreduce.IndexToolIT
Tests run: 1, Failures: 0, Errors: 0, Skipped: 0, Time elapsed: 25.909 sec - in org.apache.hadoop.hbase.regionserver.wal.WALReplayWithIndexWritesAndCompressedWALIT
Running org.apache.phoenix.mapreduce.CsvBulkLoadToolIT
Tests run: 1, Failures: 0, Errors: 0, Skipped: 0, Time elapsed: 22.725 sec - in org.apache.hadoop.hbase.regionserver.wal.WALReplayWithIndexWritesAndUncompressedWALInHBase_094_9_IT
Tests run: 5, Failures: 0, Errors: 0, Skipped: 0, Time elapsed: 170.898 sec - in org.apache.phoenix.mapreduce.CsvBulkLoadToolIT
Tests run: 55, Failures: 0, Errors: 4, Skipped: 0, Time elapsed: 397.658 sec <<< FAILURE! - in org.apache.phoenix.end2end.AlterTableIT
testDropMultipleColumns(org.apache.phoenix.end2end.AlterTableIT) Time elapsed: 3.178 sec <<< ERROR!
java.sql.SQLException: ERROR 2009 (INT11): Unknown error code 0
at org.apache.phoenix.exception.SQLExceptionCode$Factory$1.newException(SQLExceptionCode.java:396)
at org.apache.phoenix.exception.SQLExceptionInfo.buildException(SQLExceptionInfo.java:145)
at org.apache.phoenix.exception.SQLExceptionCode.fromErrorCode(SQLExceptionCode.java:424)
at org.apache.phoenix.util.ServerUtil.parseRemoteException(ServerUtil.java:127)
at org.apache.phoenix.util.ServerUtil.parseServerExceptionOrNull(ServerUtil.java:115)
at org.apache.phoenix.util.ServerUtil.parseServerException(ServerUtil.java:104)
at org.apache.phoenix.query.ConnectionQueryServicesImpl.metaDataCoprocessorExec(ConnectionQueryServicesImpl.java:1053)
at org.apache.phoenix.query.ConnectionQueryServicesImpl.metaDataCoprocessorExec(ConnectionQueryServicesImpl.java:1016)
at org.apache.phoenix.query.ConnectionQueryServicesImpl.dropColumn(ConnectionQueryServicesImpl.java:1819)
at org.apache.phoenix.schema.MetaDataClient.dropColumn(MetaDataClient.java:2880)
at org.apache.phoenix.jdbc.PhoenixStatement$ExecutableDropColumnStatement$1.execute(PhoenixStatement.java:1147)
at org.apache.phoenix.jdbc.PhoenixStatement$2.call(PhoenixStatement.java:322)
at org.apache.phoenix.jdbc.PhoenixStatement$2.call(PhoenixStatement.java:314)
at org.apache.phoenix.call.CallRunner.run(CallRunner.java:53)
at org.apache.phoenix.jdbc.PhoenixStatement.executeMutation(PhoenixStatement.java:312)
at org.apache.phoenix.jdbc.PhoenixStatement.execute(PhoenixStatement.java:1435)
at org.apache.phoenix.end2end.AlterTableIT.testDropMultipleColumns(AlterTableIT.java:1039)
testDropIndexedColumn(org.apache.phoenix.end2end.AlterTableIT) Time elapsed: 8.089 sec <<< ERROR!
java.sql.SQLException: ERROR 2009 (INT11): Unknown error code 0
at org.apache.phoenix.exception.SQLExceptionCode$Factory$1.newException(SQLExceptionCode.java:396)
at org.apache.phoenix.exception.SQLExceptionInfo.buildException(SQLExceptionInfo.java:145)
at org.apache.phoenix.exception.SQLExceptionCode.fromErrorCode(SQLExceptionCode.java:424)
at org.apache.phoenix.util.ServerUtil.parseRemoteException(ServerUtil.java:127)
at org.apache.phoenix.util.ServerUtil.parseServerExceptionOrNull(ServerUtil.java:115)
at org.apache.phoenix.util.ServerUtil.parseServerException(ServerUtil.java:104)
at org.apache.phoenix.query.ConnectionQueryServicesImpl.metaDataCoprocessorExec(ConnectionQueryServicesImpl.java:1053)
at org.apache.phoenix.query.ConnectionQueryServicesImpl.metaDataCoprocessorExec(ConnectionQueryServicesImpl.java:1016)
at org.apache.phoenix.query.ConnectionQueryServicesImpl.dropColumn(ConnectionQueryServicesImpl.java:1819)
at org.apache.phoenix.schema.MetaDataClient.dropColumn(MetaDataClient.java:2880)
at org.apache.phoenix.jdbc.PhoenixStatement$ExecutableDropColumnStatement$1.execute(PhoenixStatement.java:1147)
at org.apache.phoenix.jdbc.PhoenixStatement$2.call(PhoenixStatement.java:322)
at org.apache.phoenix.jdbc.PhoenixStatement$2.call(PhoenixStatement.java:314)
at org.apache.phoenix.call.CallRunner.run(CallRunner.java:53)
at org.apache.phoenix.jdbc.PhoenixStatement.executeMutation(PhoenixStatement.java:312)
at org.apache.phoenix.jdbc.PhoenixStatement.execute(PhoenixStatement.java:1435)
at org.apache.phoenix.end2end.AlterTableIT.testDropIndexedColumn(AlterTableIT.java:285)
testDropCoveredColumn(org.apache.phoenix.end2end.AlterTableIT) Time elapsed: 6.867 sec <<< ERROR!
java.sql.SQLException: ERROR 2009 (INT11): Unknown error code 0
at org.apache.phoenix.exception.SQLExceptionCode$Factory$1.newException(SQLExceptionCode.java:396)
at org.apache.phoenix.exception.SQLExceptionInfo.buildException(SQLExceptionInfo.java:145)
at org.apache.phoenix.exception.SQLExceptionCode.fromErrorCode(SQLExceptionCode.java:424)
at org.apache.phoenix.util.ServerUtil.parseRemoteException(ServerUtil.java:127)
at org.apache.phoenix.util.ServerUtil.parseServerExceptionOrNull(ServerUtil.java:115)
at org.apache.phoenix.util.ServerUtil.parseServerException(ServerUtil.java:104)
at org.apache.phoenix.query.ConnectionQueryServicesImpl.metaDataCoprocessorExec(ConnectionQueryServicesImpl.java:1053)
at org.apache.phoenix.query.ConnectionQueryServicesImpl.metaDataCoprocessorExec(ConnectionQueryServicesImpl.java:1016)
at org.apache.phoenix.query.ConnectionQueryServicesImpl.dropColumn(ConnectionQueryServicesImpl.java:1819)
at org.apache.phoenix.schema.MetaDataClient.dropColumn(MetaDataClient.java:2880)
at org.apache.phoenix.jdbc.PhoenixStatement$ExecutableDropColumnStatement$1.execute(PhoenixStatement.java:1147)
at org.apache.phoenix.jdbc.PhoenixStatement$2.call(PhoenixStatement.java:322)
at org.apache.phoenix.jdbc.PhoenixStatement$2.call(PhoenixStatement.java:314)
at org.apache.phoenix.call.CallRunner.run(CallRunner.java:53)
at org.apache.phoenix.jdbc.PhoenixStatement.executeMutation(PhoenixStatement.java:312)
at org.apache.phoenix.jdbc.PhoenixStatement.execute(PhoenixStatement.java:1435)
at org.apache.phoenix.end2end.AlterTableIT.testDropCoveredColumn(AlterTableIT.java:350)
testDropColumnsWithImutability(org.apache.phoenix.end2end.AlterTableIT) Time elapsed: 12.585 sec <<< ERROR!
java.sql.SQLException: ERROR 2009 (INT11): Unknown error code 0
at org.apache.phoenix.exception.SQLExceptionCode$Factory$1.newException(SQLExceptionCode.java:396)
at org.apache.phoenix.exception.SQLExceptionInfo.buildException(SQLExceptionInfo.java:145)
at org.apache.phoenix.exception.SQLExceptionCode.fromErrorCode(SQLExceptionCode.java:424)
at org.apache.phoenix.util.ServerUtil.parseRemoteException(ServerUtil.java:127)
at org.apache.phoenix.util.ServerUtil.parseServerExceptionOrNull(ServerUtil.java:115)
at org.apache.phoenix.util.ServerUtil.parseServerException(ServerUtil.java:104)
at org.apache.phoenix.query.ConnectionQueryServicesImpl.metaDataCoprocessorExec(ConnectionQueryServicesImpl.java:1053)
at org.apache.phoenix.query.ConnectionQueryServicesImpl.metaDataCoprocessorExec(ConnectionQueryServicesImpl.java:1016)
at org.apache.phoenix.query.ConnectionQueryServicesImpl.dropColumn(ConnectionQueryServicesImpl.java:1819)
at org.apache.phoenix.schema.MetaDataClient.dropColumn(MetaDataClient.java:2880)
at org.apache.phoenix.jdbc.PhoenixStatement$ExecutableDropColumnStatement$1.execute(PhoenixStatement.java:1147)
at org.apache.phoenix.jdbc.PhoenixStatement$2.call(PhoenixStatement.java:322)
at org.apache.phoenix.jdbc.PhoenixStatement$2.call(PhoenixStatement.java:314)
at org.apache.phoenix.call.CallRunner.run(CallRunner.java:53)
at org.apache.phoenix.jdbc.PhoenixStatement.executeMutation(PhoenixStatement.java:312)
at org.apache.phoenix.jdbc.PhoenixStatement.execute(PhoenixStatement.java:1435)
at org.apache.phoenix.end2end.AlterTableIT.testDropColumnsWithImutability(AlterTableIT.java:874)
Tests run: 9, Failures: 0, Errors: 0, Skipped: 0, Time elapsed: 353.639 sec - in org.apache.phoenix.mapreduce.IndexToolIT
Results :
Tests in error:
AlterTableIT.testDropColumnsWithImutability:874 » SQL ERROR 2009 (INT11): Unkn...
AlterTableIT.testDropCoveredColumn:350 » SQL ERROR 2009 (INT11): Unknown error...
AlterTableIT.testDropIndexedColumn:285 » SQL ERROR 2009 (INT11): Unknown error...
AlterTableIT.testDropMultipleColumns:1039 » SQL ERROR 2009 (INT11): Unknown er...
Tests run: 250, Failures: 0, Errors: 4, Skipped: 2
[INFO]
[INFO] --- maven-failsafe-plugin:2.18:verify (ClientManagedTimeTests) @ phoenix-core ---
[INFO] Failsafe report directory: <https://builds.apache.org/job/Phoenix-master/ws/phoenix-core/target/failsafe-reports>
[INFO] ------------------------------------------------------------------------
[INFO] Reactor Summary:
[INFO]
[INFO] Apache Phoenix .................................... SUCCESS [4.058s]
[INFO] Phoenix Core ...................................... FAILURE [37:01.358s]
[INFO] Phoenix - Flume ................................... SKIPPED
[INFO] Phoenix - Pig ..................................... SKIPPED
[INFO] Phoenix Query Server Client ....................... SKIPPED
[INFO] Phoenix Query Server .............................. SKIPPED
[INFO] Phoenix - Pherf ................................... SKIPPED
[INFO] Phoenix - Spark ................................... SKIPPED
[INFO] Phoenix Assembly .................................. SKIPPED
[INFO] Phoenix - Tracing Web Application ................. SKIPPED
[INFO] ------------------------------------------------------------------------
[INFO] BUILD FAILURE
[INFO] ------------------------------------------------------------------------
[INFO] Total time: 37:06.053s
[INFO] Finished at: Tue Nov 10 20:00:39 UTC 2015
[INFO] Final Memory: 62M/1221M
[INFO] ------------------------------------------------------------------------
[ERROR] Failed to execute goal org.apache.maven.plugins:maven-failsafe-plugin:2.18:verify (ClientManagedTimeTests) on project phoenix-core: There are test failures.
[ERROR]
[ERROR] Please refer to <https://builds.apache.org/job/Phoenix-master/ws/phoenix-core/target/failsafe-reports> for the individual test results.
[ERROR] -> [Help 1]
[ERROR]
[ERROR] To see the full stack trace of the errors, re-run Maven with the -e switch.
[ERROR] Re-run Maven using the -X switch to enable full debug logging.
[ERROR]
[ERROR] For more information about the errors and possible solutions, please read the following articles:
[ERROR] [Help 1] http://cwiki.apache.org/confluence/display/MAVEN/MojoFailureException
[ERROR]
[ERROR] After correcting the problems, you can resume the build with the command
[ERROR] mvn <goals> -rf :phoenix-core
Build step 'Invoke top-level Maven targets' marked build as failure
Archiving artifacts
Compressed 1.15 GB of artifacts by 50.1% relative to #942
Updating PHOENIX-2373
Recording test results