You are viewing a plain text version of this content. The canonical link for it is here.
Posted to commits@flex.apache.org by fl...@gmail.com on 2015/03/26 06:58:31 UTC
rc_flex-sdk_mustella-mobile - Build # 171 - Failure!
rc_flex-sdk_mustella-mobile - Build # 171 - Failure:
http://flex-mustella.cloudapp.net/job/rc_flex-sdk_mustella-mobile/171/
Changes for Build #171
No changes
--------------------------------
[...truncated 13066 lines...]
[java] test script count: 4
[java] apollo adj with : C:\jenkins_slave\workspace\rc_flex-sdk_mustella-mobile\mustella\tests\mobile\SkinnablePopUpContainer\swfs\SkinnablePopUpContainerApp.swf
[java] apollo adj thinks it's a swf
[java] writing Apollo file!
[java] full swf is C:\jenkins_slave\workspace\rc_flex-sdk_mustella-mobile\mustella\tests\mobile\SkinnablePopUpContainer\swfs\SkinnablePopUpContainerApp.swf
[java] starting the baseline server: Thu Mar 26 00:47:47 ACT 2015
[java] post ApolloAdjuster: C:\jenkins_slave\workspace\rc_flex-sdk_mustella-mobile\mustella\tests\mobile\SkinnablePopUpContainer\swfs\SkinnablePopUpContainerApp.xml
[java] new test file: C:\jenkins_slave\workspace\rc_flex-sdk_mustella-mobile\mustella\tests\mobile\SkinnablePopUpContainer\swfs\SkinnablePopUpContainerApp.xml
[java] ******** cmdArr before:
[java] C:\ApacheFlex\dependencies\AdobeAIRSDK\16\bin\adl.exe
[java] C:\jenkins_slave\workspace\rc_flex-sdk_mustella-mobile\mustella\tests\mobile\SkinnablePopUpContainer\swfs\SkinnablePopUpContainerApp.xml
[java] ******** moreParameters before:
[java] -screensize
[java] 640x960:640x960
[java] -profile
[java] mobileDevice
[java] -XscreenDPI
[java] 240
[java] ******** cmdArr after:
[java] C:\ApacheFlex\dependencies\AdobeAIRSDK\16\bin\adl.exe
[java] C:\jenkins_slave\workspace\rc_flex-sdk_mustella-mobile\mustella\tests\mobile\SkinnablePopUpContainer\swfs\SkinnablePopUpContainerApp.xml
[java] -screensize
[java] 640x960:640x960
[java] -profile
[java] mobileDevice
[java] -XscreenDPI
[java] 240
[java] getting directory from the swf file
[java] derived directory: C:\jenkins_slave\workspace\rc_flex-sdk_mustella-mobile\mustella\tests\mobile\SkinnablePopUpContainer\swfs
[java] Launching:
[java] C:\ApacheFlex\dependencies\AdobeAIRSDK\16\bin\adl.exe C:\jenkins_slave\workspace\rc_flex-sdk_mustella-mobile\mustella\tests\mobile\SkinnablePopUpContainer\swfs\SkinnablePopUpContainerApp.xml -screensize 640x960:640x960 -profile mobileDevice -XscreenDPI 240 Launching: C:\ApacheFlex\dependencies\AdobeAIRSDK\16\bin\adl.exe C:\jenkins_slave\workspace\rc_flex-sdk_mustella-mobile\mustella\tests\mobile\SkinnablePopUpContainer\swfs\SkinnablePopUpContainerApp.xml
[java] USING directory: C:\jenkins_slave\workspace\rc_flex-sdk_mustella-mobile\mustella\tests\mobile\SkinnablePopUpContainer\swfs
[java] time: 00:47:49.714
[java] Firing Meta Timeout for process start after 12000 millis at: 00:48:01.740
[java] clobberProcess true
[java] ClobberProcess, destroying process
[java] unpacked result: C:\jenkins_slave\workspace\rc_flex-sdk_mustella-mobile\mustella\tests\mobile\SkinnablePopUpContainer\swfs\SkinnablePopUpContainerApp.xml Failed Timed out 0 Thu Mar 26 00:47:49 ACT 2015 0.0
[java] removing the xml app file
[java] Grab log, do parse = false
[java] Grabbing the log from: C:\Users\ApacheFlex\AppData/Roaming\Macromedia/Flash Player/Logs/flashlog.txt to: C:\jenkins_slave\workspace\rc_flex-sdk_mustella-mobile\mustella\tests\mobile\SkinnablePopUpContainer\swfs\SkinnablePopUpContainerApp.log
[java] Grablog: never saw the ScriptDone for C:\jenkins_slave\workspace\rc_flex-sdk_mustella-mobile\mustella\tests\mobile\SkinnablePopUpContainer\swfs\SkinnablePopUpContainerApp.swf
[java] apollo adj with : C:\jenkins_slave\workspace\rc_flex-sdk_mustella-mobile\mustella\tests\mobile\ViewAndViewNavigator\swfs\ViewAndViewNavigatorMainTabbed.swf
[java] apollo adj thinks it's a swf
[java] writing Apollo file!
[java] full swf is C:\jenkins_slave\workspace\rc_flex-sdk_mustella-mobile\mustella\tests\mobile\ViewAndViewNavigator\swfs\ViewAndViewNavigatorMainTabbed.swf
[java] post ApolloAdjuster: C:\jenkins_slave\workspace\rc_flex-sdk_mustella-mobile\mustella\tests\mobile\ViewAndViewNavigator\swfs\ViewAndViewNavigatorMainTabbed.xml
[java] new test file: C:\jenkins_slave\workspace\rc_flex-sdk_mustella-mobile\mustella\tests\mobile\ViewAndViewNavigator\swfs\ViewAndViewNavigatorMainTabbed.xml
[java] ******** cmdArr before:
[java] C:\ApacheFlex\dependencies\AdobeAIRSDK\16\bin\adl.exe
[java] C:\jenkins_slave\workspace\rc_flex-sdk_mustella-mobile\mustella\tests\mobile\ViewAndViewNavigator\swfs\ViewAndViewNavigatorMainTabbed.xml
[java] ******** moreParameters before:
[java] -screensize
[java] 640x960:640x960
[java] -profile
[java] mobileDevice
[java] -XscreenDPI
[java] 240
[java] ******** cmdArr after:
[java] C:\ApacheFlex\dependencies\AdobeAIRSDK\16\bin\adl.exe
[java] C:\jenkins_slave\workspace\rc_flex-sdk_mustella-mobile\mustella\tests\mobile\ViewAndViewNavigator\swfs\ViewAndViewNavigatorMainTabbed.xml
[java] -screensize
[java] 640x960:640x960
[java] -profile
[java] mobileDevice
[java] -XscreenDPI
[java] 240
[java] getting directory from the swf file
[java] derived directory: C:\jenkins_slave\workspace\rc_flex-sdk_mustella-mobile\mustella\tests\mobile\ViewAndViewNavigator\swfs
[java] Launching:
[java] C:\ApacheFlex\dependencies\AdobeAIRSDK\16\bin\adl.exe C:\jenkins_slave\workspace\rc_flex-sdk_mustella-mobile\mustella\tests\mobile\ViewAndViewNavigator\swfs\ViewAndViewNavigatorMainTabbed.xml -screensize 640x960:640x960 -profile mobileDevice -XscreenDPI 240 Launching: C:\ApacheFlex\dependencies\AdobeAIRSDK\16\bin\adl.exe C:\jenkins_slave\workspace\rc_flex-sdk_mustella-mobile\mustella\tests\mobile\ViewAndViewNavigator\swfs\ViewAndViewNavigatorMainTabbed.xml
[java] USING directory: C:\jenkins_slave\workspace\rc_flex-sdk_mustella-mobile\mustella\tests\mobile\ViewAndViewNavigator\swfs
[java] time: 00:48:01.839
[java] Total Results so far: 1
[java] SCRIPTDONE! 00:48:08.083
[java] GET /ScriptComplete?0 HTTP/1.1
[java] Before Wait loop 00:48:08.083 waiting = 0
[java] After Wait loop 00:48:08.083 waiting = 0
[java] clobberProcess false
[java] Total Results so far: 3
[java] removing the xml app file
[java] Grab log, do parse = false
[java] Grabbing the log from: C:\Users\ApacheFlex\AppData/Roaming\Macromedia/Flash Player/Logs/flashlog.txt to: C:\jenkins_slave\workspace\rc_flex-sdk_mustella-mobile\mustella\tests\mobile\ViewAndViewNavigator\swfs\ViewAndViewNavigatorMainTabbed.log
[java] apollo adj with : C:\jenkins_slave\workspace\rc_flex-sdk_mustella-mobile\mustella\tests\mobile\components\ActionBar\swfs\ActionBar.swf
[java] apollo adj thinks it's a swf
[java] writing Apollo file!
[java] full swf is C:\jenkins_slave\workspace\rc_flex-sdk_mustella-mobile\mustella\tests\mobile\components\ActionBar\swfs\ActionBar.swf
[java] waited 1800
[java] ClobberProcess, it was already null
[java] post ApolloAdjuster: C:\jenkins_slave\workspace\rc_flex-sdk_mustella-mobile\mustella\tests\mobile\components\ActionBar\swfs\ActionBar.xml
[java] new test file: C:\jenkins_slave\workspace\rc_flex-sdk_mustella-mobile\mustella\tests\mobile\components\ActionBar\swfs\ActionBar.xml
[java] ******** cmdArr before:
[java] C:\ApacheFlex\dependencies\AdobeAIRSDK\16\bin\adl.exe
[java] C:\jenkins_slave\workspace\rc_flex-sdk_mustella-mobile\mustella\tests\mobile\components\ActionBar\swfs\ActionBar.xml
[java] ******** moreParameters before:
[java] -screensize
[java] 640x960:640x960
[java] -profile
[java] mobileDevice
[java] -XscreenDPI
[java] 240
[java] ******** cmdArr after:
[java] C:\ApacheFlex\dependencies\AdobeAIRSDK\16\bin\adl.exe
[java] C:\jenkins_slave\workspace\rc_flex-sdk_mustella-mobile\mustella\tests\mobile\components\ActionBar\swfs\ActionBar.xml
[java] -screensize
[java] 640x960:640x960
[java] -profile
[java] mobileDevice
[java] -XscreenDPI
[java] 240
[java] getting directory from the swf file
[java] derived directory: C:\jenkins_slave\workspace\rc_flex-sdk_mustella-mobile\mustella\tests\mobile\components\ActionBar\swfs
[java] Launching:
[java] C:\ApacheFlex\dependencies\AdobeAIRSDK\16\bin\adl.exe C:\jenkins_slave\workspace\rc_flex-sdk_mustella-mobile\mustella\tests\mobile\components\ActionBar\swfs\ActionBar.xml -screensize 640x960:640x960 -profile mobileDevice -XscreenDPI 240 Launching: C:\ApacheFlex\dependencies\AdobeAIRSDK\16\bin\adl.exe C:\jenkins_slave\workspace\rc_flex-sdk_mustella-mobile\mustella\tests\mobile\components\ActionBar\swfs\ActionBar.xml
[java] USING directory: C:\jenkins_slave\workspace\rc_flex-sdk_mustella-mobile\mustella\tests\mobile\components\ActionBar\swfs
[java] time: 00:48:10.207
[java] Wrote file: c:/jenkins_slave/workspace/rc_flex-sdk_mustella-mobile/mustella/tests/mobile/components/ActionBar/styles/baselines/ActionBar_TitleDisplay_TextDecoration@android_240ppi.png.bad.png.xml length: 41892
[java] Wrote file: c:/jenkins_slave/workspace/rc_flex-sdk_mustella-mobile/mustella/tests/mobile/components/ActionBar/styles/baselines/ActionBar_TitleDisplay_TextDecoration@android_240ppi.png.bad.png length: 2375
[java] FAIL: mobile/components/ActionBar/styles/ActionBar_Styles ActionBar_TitleDisplay_TextDecoration
[java] SCRIPTDONE! 00:48:17.344
[java] GET /ScriptComplete?0 HTTP/1.1
[java] Before Wait loop 00:48:17.344 waiting = 0
[java] After Wait loop 00:48:17.344 waiting = 0
[java] clobberProcess false
[java] Total Results so far: 4
[java] removing the xml app file
[java] Grab log, do parse = false
[java] Grabbing the log from: C:\Users\ApacheFlex\AppData/Roaming\Macromedia/Flash Player/Logs/flashlog.txt to: C:\jenkins_slave\workspace\rc_flex-sdk_mustella-mobile\mustella\tests\mobile\components\ActionBar\swfs\ActionBar.log
[java] apollo adj with : C:\jenkins_slave\workspace\rc_flex-sdk_mustella-mobile\mustella\tests\mobile\components\ActionBar\swfs\ActionBarTest.swf
[java] apollo adj thinks it's a swf
[java] writing Apollo file!
[java] full swf is C:\jenkins_slave\workspace\rc_flex-sdk_mustella-mobile\mustella\tests\mobile\components\ActionBar\swfs\ActionBarTest.swf
[java] post ApolloAdjuster: C:\jenkins_slave\workspace\rc_flex-sdk_mustella-mobile\mustella\tests\mobile\components\ActionBar\swfs\ActionBarTest.xml
[java] new test file: C:\jenkins_slave\workspace\rc_flex-sdk_mustella-mobile\mustella\tests\mobile\components\ActionBar\swfs\ActionBarTest.xml
[java] ******** cmdArr before:
[java] C:\ApacheFlex\dependencies\AdobeAIRSDK\16\bin\adl.exe
[java] C:\jenkins_slave\workspace\rc_flex-sdk_mustella-mobile\mustella\tests\mobile\components\ActionBar\swfs\ActionBarTest.xml
[java] ******** moreParameters before:
[java] -screensize
[java] 640x960:640x960
[java] -profile
[java] mobileDevice
[java] -XscreenDPI
[java] 240
[java] ******** cmdArr after:
[java] C:\ApacheFlex\dependencies\AdobeAIRSDK\16\bin\adl.exe
[java] C:\jenkins_slave\workspace\rc_flex-sdk_mustella-mobile\mustella\tests\mobile\components\ActionBar\swfs\ActionBarTest.xml
[java] -screensize
[java] 640x960:640x960
[java] -profile
[java] mobileDevice
[java] -XscreenDPI
[java] 240
[java] getting directory from the swf file
[java] derived directory: C:\jenkins_slave\workspace\rc_flex-sdk_mustella-mobile\mustella\tests\mobile\components\ActionBar\swfs
[java] Launching:
[java] C:\ApacheFlex\dependencies\AdobeAIRSDK\16\bin\adl.exe C:\jenkins_slave\workspace\rc_flex-sdk_mustella-mobile\mustella\tests\mobile\components\ActionBar\swfs\ActionBarTest.xml -screensize 640x960:640x960 -profile mobileDevice -XscreenDPI 240 Launching: C:\ApacheFlex\dependencies\AdobeAIRSDK\16\bin\adl.exe C:\jenkins_slave\workspace\rc_flex-sdk_mustella-mobile\mustella\tests\mobile\components\ActionBar\swfs\ActionBarTest.xml
[java] USING directory: C:\jenkins_slave\workspace\rc_flex-sdk_mustella-mobile\mustella\tests\mobile\components\ActionBar\swfs
[java] time: 00:48:19.341
[java] waited 1700
[java] ClobberProcess, it was already null
[java] SCRIPTDONE! 00:48:26.631
[java] GET /ScriptComplete?0 HTTP/1.1
[java] Before Wait loop 00:48:26.631 waiting = 0
[java] After Wait loop 00:48:26.631 waiting = 0
[java] clobberProcess false
[java] Total Results so far: 7
[java] removing the xml app file
[java] Grab log, do parse = false
[java] Grabbing the log from: C:\Users\ApacheFlex\AppData/Roaming\Macromedia/Flash Player/Logs/flashlog.txt to: C:\jenkins_slave\workspace\rc_flex-sdk_mustella-mobile\mustella\tests\mobile\components\ActionBar\swfs\ActionBarTest.log
[java] at the end of main
[java] Shutting down the results server
[java] shutting down the baseline server
[java] done waiting for results...bye
[java] =====================================================
[java] Passes: 5
[java] Fails: 2
[java] =====================================================
[java]
[java] =====================================================
[java] =====================================================
[java] Passed:
[java] =====================================================
[java] mobile/ViewAndViewNavigator/tests/ViewAndViewNavigator_orientationTabbed orientationStatesUnDefinedActionBarOverlayLeftTabbed Passed
[java] mobile/ViewAndViewNavigator/tests/ViewAndViewNavigator_orientationTabbed orientationStatesUnDefinedActionBarOverlayRightTabbed Passed
[java] mobile/components/ActionBar/properties/ActionBar_ViewNavigator_Properties ActionBar_ViewNavigator_titleLayout_vertical Passed
[java] mobile/components/ActionBar/properties/ActionBar_ViewNavigator_Properties ActionBar_ViewNavigator_titleLayout_tile Passed
[java] mobile/components/ActionBar/properties/ActionBar_ViewNavigator_Properties ActionBar_ViewNavigator_titleLayout_basic Passed
[java] =====================================================
[java] Failed:
[java] =====================================================
[java] C:\jenkins_slave\workspace\rc_flex-sdk_mustella-mobile\mustella\tests\mobile\SkinnablePopUpContainer\swfs\SkinnablePopUpContainerApp.xml Failed Timed out
[java] mobile/components/ActionBar/styles/ActionBar_Styles ActionBar_TitleDisplay_TextDecoration Failed CompareBitmap(body:step 2) compare returned[object BitmapData]
[java]
[java]
[java] =====================================================
[java] Passes: 5
[java] Fails: 2
[java] =====================================================
[java]
[java]
[java] Wrote summary to results.txt
[java] Wrote failures to failures.txt
BUILD FAILED
C:\jenkins_slave\workspace\rc_flex-sdk_mustella-mobile\mustella\build.xml:1547: The following error occurred while executing this line:
C:\jenkins_slave\workspace\rc_flex-sdk_mustella-mobile\mustella\build.xml:1665: Java returned: 1
Total time: 2 minutes 52 seconds
============ JENKINS MUSTELLA RUN REPORT ============
Date/Time: 03-26-2015 05:48
Run duration: 0 days 1 hours 52 mins 25 seconds
Settings:
player.version = 16.0
air.version = 16
FLASHPLAYER_DEBUGGER = C:\ApacheFlex\dependencies\FlashPlayer_Debug\flashplayer_16_sa_debug.exe
AIR_HOME = C:\ApacheFlex\dependencies\AdobeAIRSDK\16
Build:
type = mobile
command = -mobile
set = tests/mobile
Log:
- Made Cygwin ignore carriage returns
- Set FLASH_VERSION to '16.0' and AIR_VERSION to '16'
- Set AIR_HOME to 'C:\ApacheFlex\dependencies\AdobeAIRSDK\16'
- Set FLASHPLAYER_DEBUGGER to 'C:\ApacheFlex\dependencies\FlashPlayer_Debug\flashplayer_16_sa_debug.exe'
- Cleaned up 'local.properties' files from previous runs
- Created fresh 'local.properties' files with containing run specific values
- Ran 'clean', 'main' and 'other.locales' ant targets to prepare the SDK for testing
- Ran Mustella on the SDK with these parameters: '-mobile tests/mobile'
- Some tests failed: running '-failures'
- Some of tests failed, even after running '-failures'...
=====================================================
Build step 'Execute shell' marked build as failure
Archiving artifacts
Email was triggered for: Failure - Any
Sending email for trigger: Failure - Any
(sent from ext-email)
rc_flex-sdk_mustella-mobile - Build # 173 - Still Failing!
Posted by fl...@gmail.com.
rc_flex-sdk_mustella-mobile - Build # 173 - Still Failing:
http://flex-mustella.cloudapp.net/job/rc_flex-sdk_mustella-mobile/173/
Changes for Build #171
No changes
Changes for Build #172
No changes
Changes for Build #173
[erik] Handle URL encode and decode
--------------------------------
[...truncated 13171 lines...]
[java] test script count: 4
[java] apollo adj with : C:\jenkins_slave\workspace\rc_flex-sdk_mustella-mobile\mustella\tests\mobile\SkinnablePopUpContainer\swfs\SkinnablePopUpContainerApp.swf
[java] apollo adj thinks it's a swf
[java] writing Apollo file!
[java] full swf is C:\jenkins_slave\workspace\rc_flex-sdk_mustella-mobile\mustella\tests\mobile\SkinnablePopUpContainer\swfs\SkinnablePopUpContainerApp.swf
[java] starting the baseline server: Tue Mar 31 11:36:11 ACT 2015
[java] post ApolloAdjuster: C:\jenkins_slave\workspace\rc_flex-sdk_mustella-mobile\mustella\tests\mobile\SkinnablePopUpContainer\swfs\SkinnablePopUpContainerApp.xml
[java] new test file: C:\jenkins_slave\workspace\rc_flex-sdk_mustella-mobile\mustella\tests\mobile\SkinnablePopUpContainer\swfs\SkinnablePopUpContainerApp.xml
[java] ******** cmdArr before:
[java] C:\ApacheFlex\dependencies\AdobeAIRSDK\3.7\bin\adl.exe
[java] C:\jenkins_slave\workspace\rc_flex-sdk_mustella-mobile\mustella\tests\mobile\SkinnablePopUpContainer\swfs\SkinnablePopUpContainerApp.xml
[java] ******** moreParameters before:
[java] -screensize
[java] 640x960:640x960
[java] -profile
[java] mobileDevice
[java] -XscreenDPI
[java] 240
[java] ******** cmdArr after:
[java] C:\ApacheFlex\dependencies\AdobeAIRSDK\3.7\bin\adl.exe
[java] C:\jenkins_slave\workspace\rc_flex-sdk_mustella-mobile\mustella\tests\mobile\SkinnablePopUpContainer\swfs\SkinnablePopUpContainerApp.xml
[java] -screensize
[java] 640x960:640x960
[java] -profile
[java] mobileDevice
[java] -XscreenDPI
[java] 240
[java] getting directory from the swf file
[java] derived directory: C:\jenkins_slave\workspace\rc_flex-sdk_mustella-mobile\mustella\tests\mobile\SkinnablePopUpContainer\swfs
[java] Launching:
[java] C:\ApacheFlex\dependencies\AdobeAIRSDK\3.7\bin\adl.exe C:\jenkins_slave\workspace\rc_flex-sdk_mustella-mobile\mustella\tests\mobile\SkinnablePopUpContainer\swfs\SkinnablePopUpContainerApp.xml -screensize 640x960:640x960 -profile mobileDevice -XscreenDPI 240 Launching: C:\ApacheFlex\dependencies\AdobeAIRSDK\3.7\bin\adl.exe C:\jenkins_slave\workspace\rc_flex-sdk_mustella-mobile\mustella\tests\mobile\SkinnablePopUpContainer\swfs\SkinnablePopUpContainerApp.xml
[java] USING directory: C:\jenkins_slave\workspace\rc_flex-sdk_mustella-mobile\mustella\tests\mobile\SkinnablePopUpContainer\swfs
[java] time: 11:36:13.616
[java] Firing Meta Timeout for process start after 12000 millis at: 11:36:25.649
[java] clobberProcess true
[java] ClobberProcess, destroying process
[java] unpacked result: C:\jenkins_slave\workspace\rc_flex-sdk_mustella-mobile\mustella\tests\mobile\SkinnablePopUpContainer\swfs\SkinnablePopUpContainerApp.xml Failed Timed out 0 Tue Mar 31 11:36:13 ACT 2015 0.0
[java] removing the xml app file
[java] Total Results so far: 1
[java] Grab log, do parse = false
[java] Grabbing the log from: C:\Users\ApacheFlex\AppData/Roaming\Macromedia/Flash Player/Logs/flashlog.txt to: C:\jenkins_slave\workspace\rc_flex-sdk_mustella-mobile\mustella\tests\mobile\SkinnablePopUpContainer\swfs\SkinnablePopUpContainerApp.log
[java] Grablog: never saw the ScriptDone for C:\jenkins_slave\workspace\rc_flex-sdk_mustella-mobile\mustella\tests\mobile\SkinnablePopUpContainer\swfs\SkinnablePopUpContainerApp.swf
[java] apollo adj with : C:\jenkins_slave\workspace\rc_flex-sdk_mustella-mobile\mustella\tests\mobile\ViewAndViewNavigator\swfs\ViewAndViewNavigatorMainTabbed.swf
[java] apollo adj thinks it's a swf
[java] writing Apollo file!
[java] full swf is C:\jenkins_slave\workspace\rc_flex-sdk_mustella-mobile\mustella\tests\mobile\ViewAndViewNavigator\swfs\ViewAndViewNavigatorMainTabbed.swf
[java] post ApolloAdjuster: C:\jenkins_slave\workspace\rc_flex-sdk_mustella-mobile\mustella\tests\mobile\ViewAndViewNavigator\swfs\ViewAndViewNavigatorMainTabbed.xml
[java] new test file: C:\jenkins_slave\workspace\rc_flex-sdk_mustella-mobile\mustella\tests\mobile\ViewAndViewNavigator\swfs\ViewAndViewNavigatorMainTabbed.xml
[java] ******** cmdArr before:
[java] C:\ApacheFlex\dependencies\AdobeAIRSDK\3.7\bin\adl.exe
[java] C:\jenkins_slave\workspace\rc_flex-sdk_mustella-mobile\mustella\tests\mobile\ViewAndViewNavigator\swfs\ViewAndViewNavigatorMainTabbed.xml
[java] ******** moreParameters before:
[java] -screensize
[java] 640x960:640x960
[java] -profile
[java] mobileDevice
[java] -XscreenDPI
[java] 240
[java] ******** cmdArr after:
[java] C:\ApacheFlex\dependencies\AdobeAIRSDK\3.7\bin\adl.exe
[java] C:\jenkins_slave\workspace\rc_flex-sdk_mustella-mobile\mustella\tests\mobile\ViewAndViewNavigator\swfs\ViewAndViewNavigatorMainTabbed.xml
[java] -screensize
[java] 640x960:640x960
[java] -profile
[java] mobileDevice
[java] -XscreenDPI
[java] 240
[java] getting directory from the swf file
[java] derived directory: C:\jenkins_slave\workspace\rc_flex-sdk_mustella-mobile\mustella\tests\mobile\ViewAndViewNavigator\swfs
[java] Launching:
[java] C:\ApacheFlex\dependencies\AdobeAIRSDK\3.7\bin\adl.exe C:\jenkins_slave\workspace\rc_flex-sdk_mustella-mobile\mustella\tests\mobile\ViewAndViewNavigator\swfs\ViewAndViewNavigatorMainTabbed.xml -screensize 640x960:640x960 -profile mobileDevice -XscreenDPI 240 Launching: C:\ApacheFlex\dependencies\AdobeAIRSDK\3.7\bin\adl.exe C:\jenkins_slave\workspace\rc_flex-sdk_mustella-mobile\mustella\tests\mobile\ViewAndViewNavigator\swfs\ViewAndViewNavigatorMainTabbed.xml
[java] USING directory: C:\jenkins_slave\workspace\rc_flex-sdk_mustella-mobile\mustella\tests\mobile\ViewAndViewNavigator\swfs
[java] time: 11:36:25.728
[java] SCRIPTDONE! 11:36:33.712
[java] GET /ScriptComplete?0 HTTP/1.1
[java] Before Wait loop 11:36:33.712 waiting = 0
[java] After Wait loop 11:36:33.712 waiting = 0
[java] clobberProcess false
[java] Total Results so far: 3
[java] waited 1800
[java] ClobberProcess, it was already null
[java] removing the xml app file
[java] Grab log, do parse = false
[java] Grabbing the log from: C:\Users\ApacheFlex\AppData/Roaming\Macromedia/Flash Player/Logs/flashlog.txt to: C:\jenkins_slave\workspace\rc_flex-sdk_mustella-mobile\mustella\tests\mobile\ViewAndViewNavigator\swfs\ViewAndViewNavigatorMainTabbed.log
[java] apollo adj with : C:\jenkins_slave\workspace\rc_flex-sdk_mustella-mobile\mustella\tests\mobile\components\ActionBar\swfs\ActionBar.swf
[java] apollo adj thinks it's a swf
[java] writing Apollo file!
[java] full swf is C:\jenkins_slave\workspace\rc_flex-sdk_mustella-mobile\mustella\tests\mobile\components\ActionBar\swfs\ActionBar.swf
[java] post ApolloAdjuster: C:\jenkins_slave\workspace\rc_flex-sdk_mustella-mobile\mustella\tests\mobile\components\ActionBar\swfs\ActionBar.xml
[java] new test file: C:\jenkins_slave\workspace\rc_flex-sdk_mustella-mobile\mustella\tests\mobile\components\ActionBar\swfs\ActionBar.xml
[java] ******** cmdArr before:
[java] C:\ApacheFlex\dependencies\AdobeAIRSDK\3.7\bin\adl.exe
[java] C:\jenkins_slave\workspace\rc_flex-sdk_mustella-mobile\mustella\tests\mobile\components\ActionBar\swfs\ActionBar.xml
[java] ******** moreParameters before:
[java] -screensize
[java] 640x960:640x960
[java] -profile
[java] mobileDevice
[java] -XscreenDPI
[java] 240
[java] ******** cmdArr after:
[java] C:\ApacheFlex\dependencies\AdobeAIRSDK\3.7\bin\adl.exe
[java] C:\jenkins_slave\workspace\rc_flex-sdk_mustella-mobile\mustella\tests\mobile\components\ActionBar\swfs\ActionBar.xml
[java] -screensize
[java] 640x960:640x960
[java] -profile
[java] mobileDevice
[java] -XscreenDPI
[java] 240
[java] getting directory from the swf file
[java] derived directory: C:\jenkins_slave\workspace\rc_flex-sdk_mustella-mobile\mustella\tests\mobile\components\ActionBar\swfs
[java] Launching:
[java] C:\ApacheFlex\dependencies\AdobeAIRSDK\3.7\bin\adl.exe C:\jenkins_slave\workspace\rc_flex-sdk_mustella-mobile\mustella\tests\mobile\components\ActionBar\swfs\ActionBar.xml -screensize 640x960:640x960 -profile mobileDevice -XscreenDPI 240 Launching: C:\ApacheFlex\dependencies\AdobeAIRSDK\3.7\bin\adl.exe C:\jenkins_slave\workspace\rc_flex-sdk_mustella-mobile\mustella\tests\mobile\components\ActionBar\swfs\ActionBar.xml
[java] USING directory: C:\jenkins_slave\workspace\rc_flex-sdk_mustella-mobile\mustella\tests\mobile\components\ActionBar\swfs
[java] time: 11:36:35.880
[java] Wrote file: c:/jenkins_slave/workspace/rc_flex-sdk_mustella-mobile/mustella/tests/mobile/components/ActionBar/styles/baselines/ActionBar_TitleDisplay_TextDecoration@android_240ppi.png.bad.png.xml length: 41892
[java] Wrote file: c:/jenkins_slave/workspace/rc_flex-sdk_mustella-mobile/mustella/tests/mobile/components/ActionBar/styles/baselines/ActionBar_TitleDisplay_TextDecoration@android_240ppi.png.bad.png length: 2375
[java] FAIL: mobile/components/ActionBar/styles/ActionBar_Styles ActionBar_TitleDisplay_TextDecoration
[java] SCRIPTDONE! 11:36:42.922
[java] GET /ScriptComplete?0 HTTP/1.1
[java] Before Wait loop 11:36:42.922 waiting = 0
[java] After Wait loop 11:36:42.922 waiting = 0
[java] clobberProcess false
[java] Total Results so far: 4
[java] removing the xml app file
[java] Grab log, do parse = false
[java] Grabbing the log from: C:\Users\ApacheFlex\AppData/Roaming\Macromedia/Flash Player/Logs/flashlog.txt to: C:\jenkins_slave\workspace\rc_flex-sdk_mustella-mobile\mustella\tests\mobile\components\ActionBar\swfs\ActionBar.log
[java] waited 1700
[java] ClobberProcess, it was already null
[java] apollo adj with : C:\jenkins_slave\workspace\rc_flex-sdk_mustella-mobile\mustella\tests\mobile\components\ActionBar\swfs\ActionBarTest.swf
[java] apollo adj thinks it's a swf
[java] writing Apollo file!
[java] full swf is C:\jenkins_slave\workspace\rc_flex-sdk_mustella-mobile\mustella\tests\mobile\components\ActionBar\swfs\ActionBarTest.swf
[java] post ApolloAdjuster: C:\jenkins_slave\workspace\rc_flex-sdk_mustella-mobile\mustella\tests\mobile\components\ActionBar\swfs\ActionBarTest.xml
[java] new test file: C:\jenkins_slave\workspace\rc_flex-sdk_mustella-mobile\mustella\tests\mobile\components\ActionBar\swfs\ActionBarTest.xml
[java] ******** cmdArr before:
[java] C:\ApacheFlex\dependencies\AdobeAIRSDK\3.7\bin\adl.exe
[java] C:\jenkins_slave\workspace\rc_flex-sdk_mustella-mobile\mustella\tests\mobile\components\ActionBar\swfs\ActionBarTest.xml
[java] ******** moreParameters before:
[java] -screensize
[java] 640x960:640x960
[java] -profile
[java] mobileDevice
[java] -XscreenDPI
[java] 240
[java] ******** cmdArr after:
[java] C:\ApacheFlex\dependencies\AdobeAIRSDK\3.7\bin\adl.exe
[java] C:\jenkins_slave\workspace\rc_flex-sdk_mustella-mobile\mustella\tests\mobile\components\ActionBar\swfs\ActionBarTest.xml
[java] -screensize
[java] 640x960:640x960
[java] -profile
[java] mobileDevice
[java] -XscreenDPI
[java] 240
[java] getting directory from the swf file
[java] derived directory: C:\jenkins_slave\workspace\rc_flex-sdk_mustella-mobile\mustella\tests\mobile\components\ActionBar\swfs
[java] Launching:
[java] C:\ApacheFlex\dependencies\AdobeAIRSDK\3.7\bin\adl.exe C:\jenkins_slave\workspace\rc_flex-sdk_mustella-mobile\mustella\tests\mobile\components\ActionBar\swfs\ActionBarTest.xml -screensize 640x960:640x960 -profile mobileDevice -XscreenDPI 240 Launching: C:\ApacheFlex\dependencies\AdobeAIRSDK\3.7\bin\adl.exe C:\jenkins_slave\workspace\rc_flex-sdk_mustella-mobile\mustella\tests\mobile\components\ActionBar\swfs\ActionBarTest.xml
[java] USING directory: C:\jenkins_slave\workspace\rc_flex-sdk_mustella-mobile\mustella\tests\mobile\components\ActionBar\swfs
[java] time: 11:36:44.959
[java] SCRIPTDONE! 11:36:52.372
[java] GET /ScriptComplete?0 HTTP/1.1
[java] Before Wait loop 11:36:52.372 waiting = 0
[java] After Wait loop 11:36:52.372 waiting = 0
[java] clobberProcess false
[java] Total Results so far: 7
[java] removing the xml app file
[java] Grab log, do parse = false
[java] Grabbing the log from: C:\Users\ApacheFlex\AppData/Roaming\Macromedia/Flash Player/Logs/flashlog.txt to: C:\jenkins_slave\workspace\rc_flex-sdk_mustella-mobile\mustella\tests\mobile\components\ActionBar\swfs\ActionBarTest.log
[java] at the end of main
[java] Shutting down the results server
[java] shutting down the baseline server
[java] done waiting for results...bye
[java] =====================================================
[java] Passes: 5
[java] Fails: 2
[java] =====================================================
[java]
[java] =====================================================
[java] =====================================================
[java] Passed:
[java] =====================================================
[java] mobile/ViewAndViewNavigator/tests/ViewAndViewNavigator_orientationTabbed orientationStatesUnDefinedActionBarOverlayLeftTabbed Passed
[java] mobile/ViewAndViewNavigator/tests/ViewAndViewNavigator_orientationTabbed orientationStatesUnDefinedActionBarOverlayRightTabbed Passed
[java] mobile/components/ActionBar/properties/ActionBar_ViewNavigator_Properties ActionBar_ViewNavigator_titleLayout_vertical Passed
[java] mobile/components/ActionBar/properties/ActionBar_ViewNavigator_Properties ActionBar_ViewNavigator_titleLayout_tile Passed
[java] mobile/components/ActionBar/properties/ActionBar_ViewNavigator_Properties ActionBar_ViewNavigator_titleLayout_basic Passed
[java] =====================================================
[java] Failed:
[java] =====================================================
[java] C:\jenkins_slave\workspace\rc_flex-sdk_mustella-mobile\mustella\tests\mobile\SkinnablePopUpContainer\swfs\SkinnablePopUpContainerApp.xml Failed Timed out
[java] mobile/components/ActionBar/styles/ActionBar_Styles ActionBar_TitleDisplay_TextDecoration Failed CompareBitmap(body:step 2) compare returned[object BitmapData]
[java]
[java]
[java] =====================================================
[java] Passes: 5
[java] Fails: 2
[java] =====================================================
[java]
[java]
[java] Wrote summary to results.txt
[java] Wrote failures to failures.txt
BUILD FAILED
C:\jenkins_slave\workspace\rc_flex-sdk_mustella-mobile\mustella\build.xml:1547: The following error occurred while executing this line:
C:\jenkins_slave\workspace\rc_flex-sdk_mustella-mobile\mustella\build.xml:1665: Java returned: 1
Total time: 2 minutes 52 seconds
============ JENKINS MUSTELLA RUN REPORT ============
Date/Time: 03-31-2015 16:36
Run duration: 0 days 1 hours 47 mins 23 seconds
Settings:
player.version = 11.7
air.version = 3.7
FLASHPLAYER_DEBUGGER = C:\ApacheFlex\dependencies\FlashPlayer_Debug\flashplayer11_7r700_232_win_sa_debug.exe
AIR_HOME = C:\ApacheFlex\dependencies\AdobeAIRSDK\3.7
Build:
type = mobile
command = -mobile
set = tests/mobile
Log:
- Made Cygwin ignore carriage returns
- Set FLASH_VERSION to '11.7' and AIR_VERSION to '3.7'
- Set AIR_HOME to 'C:\ApacheFlex\dependencies\AdobeAIRSDK\3.7'
- Set FLASHPLAYER_DEBUGGER to 'C:\ApacheFlex\dependencies\FlashPlayer_Debug\flashplayer11_7r700_232_win_sa_debug.exe'
- Cleaned up 'local.properties' files from previous runs
- Created fresh 'local.properties' files with containing run specific values
- Ran 'clean', 'main' and 'other.locales' ant targets to prepare the SDK for testing
- Ran Mustella on the SDK with these parameters: '-mobile tests/mobile'
- Some tests failed: running '-failures'
- Some of tests failed, even after running '-failures'...
=====================================================
Build step 'Execute shell' marked build as failure
Archiving artifacts
Email was triggered for: Failure - Any
Sending email for trigger: Failure - Any
(sent from ext-email)
rc_flex-sdk_mustella-mobile - Build # 172 - Still Failing!
Posted by fl...@gmail.com.
rc_flex-sdk_mustella-mobile - Build # 172 - Still Failing:
http://flex-mustella.cloudapp.net/job/rc_flex-sdk_mustella-mobile/172/
Changes for Build #171
No changes
Changes for Build #172
No changes
--------------------------------
[...truncated 13093 lines...]
[java] C:\jenkins_slave\workspace\rc_flex-sdk_mustella-mobile\mustella\tests\mobile\SkinnablePopUpContainer\swfs\SkinnablePopUpContainerApp.swf (2560740 bytes)
[java] C:\jenkins_slave\workspace\rc_flex-sdk_mustella-mobile\mustella\tests\mobile\components\ActionBar\swfs\ActionBarTest.swf (2650789 bytes)
[java] C:\jenkins_slave\workspace\rc_flex-sdk_mustella-mobile\mustella\tests\mobile\ViewAndViewNavigator\swfs\ViewAndViewNavigatorMainTabbed.swf (2491404 bytes)
[java] nothing left to do
[java] All done with the compile
[java] leaving the compile, elapsed: 36
[java] ...via exit
[echo] compileswfs jreturn is 0
do_fail:
compileswfs:
getExcludes:
getExcludeIds:
populateExcludeTable:
[echo] populate exclude, got this for db time: 2015/03/26 13:32:13
justrun:
delete_cache:
[echo] delete cache: /Users/ApacheFlex/Library/Caches/Adobe/Flash Player/AssetCache
delete_cache:
[echo] delete cache: /Users/ApacheFlex/AppData/Roaming/Adobe/Flash Player/AssetCache
[delete] Deleting directory C:\Users\ApacheFlex\AppData\Roaming\Adobe\Flash Player\AssetCache\UH8TFT25
[delete] Deleting directory C:\Users\ApacheFlex\AppData\Roaming\Adobe\Flash Player\AssetCache
delete_cache:
[echo] delete cache: C:\Users\ApacheFlex/Application Data/Adobe/Flash Player/AssetCache
android_runner:
ios_runner:
qnx_runner:
desktop_runner:
[echo] **** Willkommen auf Runner ****
[java] the apollo situation: C:\ApacheFlex\dependencies\AdobeAIRSDK\3.7/adl.exe -runtime C:\ApacheFlex\dependencies\AdobeAIRSDK\3.7\runtimes\air\win
[java] starting results server
[java] starting baseline server
[java] test script count: 3
[java] apollo adj with : C:\jenkins_slave\workspace\rc_flex-sdk_mustella-mobile\mustella\tests\mobile\SkinnablePopUpContainer\swfs\SkinnablePopUpContainerApp.swf
[java] apollo adj thinks it's a swf
[java] writing Apollo file!
[java] full swf is C:\jenkins_slave\workspace\rc_flex-sdk_mustella-mobile\mustella\tests\mobile\SkinnablePopUpContainer\swfs\SkinnablePopUpContainerApp.swf
[java] starting the baseline server: Thu Mar 26 13:33:14 ACT 2015
[java] post ApolloAdjuster: C:\jenkins_slave\workspace\rc_flex-sdk_mustella-mobile\mustella\tests\mobile\SkinnablePopUpContainer\swfs\SkinnablePopUpContainerApp.xml
[java] new test file: C:\jenkins_slave\workspace\rc_flex-sdk_mustella-mobile\mustella\tests\mobile\SkinnablePopUpContainer\swfs\SkinnablePopUpContainerApp.xml
[java] ******** cmdArr before:
[java] C:\ApacheFlex\dependencies\AdobeAIRSDK\3.7\bin\adl.exe
[java] C:\jenkins_slave\workspace\rc_flex-sdk_mustella-mobile\mustella\tests\mobile\SkinnablePopUpContainer\swfs\SkinnablePopUpContainerApp.xml
[java] ******** moreParameters before:
[java] -screensize
[java] 640x960:640x960
[java] -profile
[java] mobileDevice
[java] -XscreenDPI
[java] 240
[java] ******** cmdArr after:
[java] C:\ApacheFlex\dependencies\AdobeAIRSDK\3.7\bin\adl.exe
[java] C:\jenkins_slave\workspace\rc_flex-sdk_mustella-mobile\mustella\tests\mobile\SkinnablePopUpContainer\swfs\SkinnablePopUpContainerApp.xml
[java] -screensize
[java] 640x960:640x960
[java] -profile
[java] mobileDevice
[java] -XscreenDPI
[java] 240
[java] getting directory from the swf file
[java] derived directory: C:\jenkins_slave\workspace\rc_flex-sdk_mustella-mobile\mustella\tests\mobile\SkinnablePopUpContainer\swfs
[java] Launching:
[java] C:\ApacheFlex\dependencies\AdobeAIRSDK\3.7\bin\adl.exe C:\jenkins_slave\workspace\rc_flex-sdk_mustella-mobile\mustella\tests\mobile\SkinnablePopUpContainer\swfs\SkinnablePopUpContainerApp.xml -screensize 640x960:640x960 -profile mobileDevice -XscreenDPI 240 Launching: C:\ApacheFlex\dependencies\AdobeAIRSDK\3.7\bin\adl.exe C:\jenkins_slave\workspace\rc_flex-sdk_mustella-mobile\mustella\tests\mobile\SkinnablePopUpContainer\swfs\SkinnablePopUpContainerApp.xml
[java] USING directory: C:\jenkins_slave\workspace\rc_flex-sdk_mustella-mobile\mustella\tests\mobile\SkinnablePopUpContainer\swfs
[java] time: 13:33:15.849
[java] Firing Meta Timeout for process start after 12000 millis at: 13:33:27.887
[java] clobberProcess true
[java] ClobberProcess, destroying process
[java] unpacked result: C:\jenkins_slave\workspace\rc_flex-sdk_mustella-mobile\mustella\tests\mobile\SkinnablePopUpContainer\swfs\SkinnablePopUpContainerApp.xml Failed Timed out 0 Thu Mar 26 13:33:15 ACT 2015 0.0
[java] Total Results so far: 1
[java] removing the xml app file
[java] Grab log, do parse = false
[java] Grabbing the log from: C:\Users\ApacheFlex\AppData/Roaming\Macromedia/Flash Player/Logs/flashlog.txt to: C:\jenkins_slave\workspace\rc_flex-sdk_mustella-mobile\mustella\tests\mobile\SkinnablePopUpContainer\swfs\SkinnablePopUpContainerApp.log
[java] Grablog: never saw the ScriptDone for C:\jenkins_slave\workspace\rc_flex-sdk_mustella-mobile\mustella\tests\mobile\SkinnablePopUpContainer\swfs\SkinnablePopUpContainerApp.swf
[java] apollo adj with : C:\jenkins_slave\workspace\rc_flex-sdk_mustella-mobile\mustella\tests\mobile\ViewAndViewNavigator\swfs\ViewAndViewNavigatorMainTabbed.swf
[java] apollo adj thinks it's a swf
[java] writing Apollo file!
[java] full swf is C:\jenkins_slave\workspace\rc_flex-sdk_mustella-mobile\mustella\tests\mobile\ViewAndViewNavigator\swfs\ViewAndViewNavigatorMainTabbed.swf
[java] post ApolloAdjuster: C:\jenkins_slave\workspace\rc_flex-sdk_mustella-mobile\mustella\tests\mobile\ViewAndViewNavigator\swfs\ViewAndViewNavigatorMainTabbed.xml
[java] new test file: C:\jenkins_slave\workspace\rc_flex-sdk_mustella-mobile\mustella\tests\mobile\ViewAndViewNavigator\swfs\ViewAndViewNavigatorMainTabbed.xml
[java] ******** cmdArr before:
[java] C:\ApacheFlex\dependencies\AdobeAIRSDK\3.7\bin\adl.exe
[java] C:\jenkins_slave\workspace\rc_flex-sdk_mustella-mobile\mustella\tests\mobile\ViewAndViewNavigator\swfs\ViewAndViewNavigatorMainTabbed.xml
[java] ******** moreParameters before:
[java] -screensize
[java] 640x960:640x960
[java] -profile
[java] mobileDevice
[java] -XscreenDPI
[java] 240
[java] ******** cmdArr after:
[java] C:\ApacheFlex\dependencies\AdobeAIRSDK\3.7\bin\adl.exe
[java] C:\jenkins_slave\workspace\rc_flex-sdk_mustella-mobile\mustella\tests\mobile\ViewAndViewNavigator\swfs\ViewAndViewNavigatorMainTabbed.xml
[java] -screensize
[java] 640x960:640x960
[java] -profile
[java] mobileDevice
[java] -XscreenDPI
[java] 240
[java] getting directory from the swf file
[java] derived directory: C:\jenkins_slave\workspace\rc_flex-sdk_mustella-mobile\mustella\tests\mobile\ViewAndViewNavigator\swfs
[java] Launching:
[java] C:\ApacheFlex\dependencies\AdobeAIRSDK\3.7\bin\adl.exe C:\jenkins_slave\workspace\rc_flex-sdk_mustella-mobile\mustella\tests\mobile\ViewAndViewNavigator\swfs\ViewAndViewNavigatorMainTabbed.xml -screensize 640x960:640x960 -profile mobileDevice -XscreenDPI 240 Launching: C:\ApacheFlex\dependencies\AdobeAIRSDK\3.7\bin\adl.exe C:\jenkins_slave\workspace\rc_flex-sdk_mustella-mobile\mustella\tests\mobile\ViewAndViewNavigator\swfs\ViewAndViewNavigatorMainTabbed.xml
[java] USING directory: C:\jenkins_slave\workspace\rc_flex-sdk_mustella-mobile\mustella\tests\mobile\ViewAndViewNavigator\swfs
[java] time: 13:33:27.985
[java] SCRIPTDONE! 13:33:34.987
[java] GET /ScriptComplete?0 HTTP/1.1
[java] Before Wait loop 13:33:34.987 waiting = 0
[java] After Wait loop 13:33:34.987 waiting = 0
[java] clobberProcess false
[java] Total Results so far: 3
[java] removing the xml app file
[java] Grab log, do parse = false
[java] Grabbing the log from: C:\Users\ApacheFlex\AppData/Roaming\Macromedia/Flash Player/Logs/flashlog.txt to: C:\jenkins_slave\workspace\rc_flex-sdk_mustella-mobile\mustella\tests\mobile\ViewAndViewNavigator\swfs\ViewAndViewNavigatorMainTabbed.log
[java] apollo adj with : C:\jenkins_slave\workspace\rc_flex-sdk_mustella-mobile\mustella\tests\mobile\components\ActionBar\swfs\ActionBarTest.swf
[java] apollo adj thinks it's a swf
[java] writing Apollo file!
[java] full swf is C:\jenkins_slave\workspace\rc_flex-sdk_mustella-mobile\mustella\tests\mobile\components\ActionBar\swfs\ActionBarTest.swf
[java] post ApolloAdjuster: C:\jenkins_slave\workspace\rc_flex-sdk_mustella-mobile\mustella\tests\mobile\components\ActionBar\swfs\ActionBarTest.xml
[java] new test file: C:\jenkins_slave\workspace\rc_flex-sdk_mustella-mobile\mustella\tests\mobile\components\ActionBar\swfs\ActionBarTest.xml
[java] ******** cmdArr before:
[java] C:\ApacheFlex\dependencies\AdobeAIRSDK\3.7\bin\adl.exe
[java] C:\jenkins_slave\workspace\rc_flex-sdk_mustella-mobile\mustella\tests\mobile\components\ActionBar\swfs\ActionBarTest.xml
[java] ******** moreParameters before:
[java] -screensize
[java] 640x960:640x960
[java] -profile
[java] mobileDevice
[java] -XscreenDPI
[java] 240
[java] ******** cmdArr after:
[java] C:\ApacheFlex\dependencies\AdobeAIRSDK\3.7\bin\adl.exe
[java] C:\jenkins_slave\workspace\rc_flex-sdk_mustella-mobile\mustella\tests\mobile\components\ActionBar\swfs\ActionBarTest.xml
[java] -screensize
[java] 640x960:640x960
[java] -profile
[java] mobileDevice
[java] -XscreenDPI
[java] 240
[java] getting directory from the swf file
[java] derived directory: C:\jenkins_slave\workspace\rc_flex-sdk_mustella-mobile\mustella\tests\mobile\components\ActionBar\swfs
[java] Launching:
[java] C:\ApacheFlex\dependencies\AdobeAIRSDK\3.7\bin\adl.exe C:\jenkins_slave\workspace\rc_flex-sdk_mustella-mobile\mustella\tests\mobile\components\ActionBar\swfs\ActionBarTest.xml -screensize 640x960:640x960 -profile mobileDevice -XscreenDPI 240 Launching: C:\ApacheFlex\dependencies\AdobeAIRSDK\3.7\bin\adl.exe C:\jenkins_slave\workspace\rc_flex-sdk_mustella-mobile\mustella\tests\mobile\components\ActionBar\swfs\ActionBarTest.xml
[java] USING directory: C:\jenkins_slave\workspace\rc_flex-sdk_mustella-mobile\mustella\tests\mobile\components\ActionBar\swfs
[java] time: 13:33:37.063
[java] waited 1800
[java] ClobberProcess, it was already null
[java] SCRIPTDONE! 13:33:44.319
[java] GET /ScriptComplete?0 HTTP/1.1
[java] Before Wait loop 13:33:44.319 waiting = 0
[java] After Wait loop 13:33:44.319 waiting = 0
[java] clobberProcess false
[java] Total Results so far: 6
[java] removing the xml app file
[java] Grab log, do parse = false
[java] Grabbing the log from: C:\Users\ApacheFlex\AppData/Roaming\Macromedia/Flash Player/Logs/flashlog.txt to: C:\jenkins_slave\workspace\rc_flex-sdk_mustella-mobile\mustella\tests\mobile\components\ActionBar\swfs\ActionBarTest.log
[java] at the end of main
[java] Shutting down the results server
[java] shutting down the baseline server
[java] done waiting for results...bye
[java] =====================================================
[java] Passes: 5
[java] Fails: 1
[java] =====================================================
[java]
[java] =====================================================
[java] =====================================================
[java] Passed:
[java] =====================================================
[java] mobile/ViewAndViewNavigator/tests/ViewAndViewNavigator_orientationTabbed orientationStatesUnDefinedActionBarOverlayLeftTabbed Passed
[java] mobile/ViewAndViewNavigator/tests/ViewAndViewNavigator_orientationTabbed orientationStatesUnDefinedActionBarOverlayRightTabbed Passed
[java] mobile/components/ActionBar/properties/ActionBar_ViewNavigator_Properties ActionBar_ViewNavigator_titleLayout_vertical Passed
[java] mobile/components/ActionBar/properties/ActionBar_ViewNavigator_Properties ActionBar_ViewNavigator_titleLayout_tile Passed
[java] mobile/components/ActionBar/properties/ActionBar_ViewNavigator_Properties ActionBar_ViewNavigator_titleLayout_basic Passed
[java] =====================================================
[java] Failed:
[java] =====================================================
[java] C:\jenkins_slave\workspace\rc_flex-sdk_mustella-mobile\mustella\tests\mobile\SkinnablePopUpContainer\swfs\SkinnablePopUpContainerApp.xml Failed Timed out
[java]
[java]
[java] =====================================================
[java] Passes: 5
[java] Fails: 1
[java] =====================================================
[java]
[java]
[java] Wrote summary to results.txt
[java] Wrote failures to failures.txt
waited 1600
ClobberProcess, it was already null
BUILD FAILED
C:\jenkins_slave\workspace\rc_flex-sdk_mustella-mobile\mustella\build.xml:1547: The following error occurred while executing this line:
C:\jenkins_slave\workspace\rc_flex-sdk_mustella-mobile\mustella\build.xml:1665: Java returned: 1
Total time: 2 minutes 33 seconds
============ JENKINS MUSTELLA RUN REPORT ============
Date/Time: 03-26-2015 18:33
Run duration: 0 days 1 hours 51 mins 42 seconds
Settings:
player.version = 11.1
air.version = 3.7
FLASHPLAYER_DEBUGGER = C:\ApacheFlex\dependencies\FlashPlayer_Debug\flashplayer11_1r102_55_win_sa_debug_32bit.exe
AIR_HOME = C:\ApacheFlex\dependencies\AdobeAIRSDK\3.7
Build:
type = mobile
command = -mobile
set = tests/mobile
Log:
- Made Cygwin ignore carriage returns
- Set FLASH_VERSION to '11.1' and AIR_VERSION to '3.7'
- Set AIR_HOME to 'C:\ApacheFlex\dependencies\AdobeAIRSDK\3.7'
- Set FLASHPLAYER_DEBUGGER to 'C:\ApacheFlex\dependencies\FlashPlayer_Debug\flashplayer11_1r102_55_win_sa_debug_32bit.exe'
- Cleaned up 'local.properties' files from previous runs
- Created fresh 'local.properties' files with containing run specific values
- Ran 'clean', 'main' and 'other.locales' ant targets to prepare the SDK for testing
- Ran Mustella on the SDK with these parameters: '-mobile tests/mobile'
- Some tests failed: running '-failures'
- Some of tests failed, even after running '-failures'...
=====================================================
Build step 'Execute shell' marked build as failure
Archiving artifacts
Email was triggered for: Failure - Any
Sending email for trigger: Failure - Any
(sent from ext-email)