You are viewing a plain text version of this content. The canonical link for it is here.
Posted to dev@kafka.apache.org by Apache Jenkins Server <je...@builds.apache.org> on 2019/08/07 00:19:42 UTC
Build failed in Jenkins: kafka-2.1-jdk8 #220
See <https://builds.apache.org/job/kafka-2.1-jdk8/220/display/redirect?page=changes>
Changes:
[matthias] KAFKA-8736: Streams performance improvement, use isEmpty() rather than
------------------------------------------
[...truncated 234.20 KB...]
kafka.api.AuthorizerIntegrationTest > testOffsetFetchWithTopicAndGroupRead STARTED
kafka.api.AuthorizerIntegrationTest > testOffsetFetchWithTopicAndGroupRead PASSED
kafka.api.AuthorizerIntegrationTest > testCommitWithTopicDescribe STARTED
kafka.api.AuthorizerIntegrationTest > testCommitWithTopicDescribe PASSED
kafka.api.AuthorizerIntegrationTest > testAuthorizationWithTopicExisting STARTED
kafka.api.AuthorizerIntegrationTest > testAuthorizationWithTopicExisting PASSED
kafka.api.AuthorizerIntegrationTest > testUnauthorizedDeleteRecordsWithoutDescribe STARTED
kafka.api.AuthorizerIntegrationTest > testUnauthorizedDeleteRecordsWithoutDescribe PASSED
kafka.api.AuthorizerIntegrationTest > testMetadataWithTopicDescribe STARTED
kafka.api.AuthorizerIntegrationTest > testMetadataWithTopicDescribe PASSED
kafka.api.AuthorizerIntegrationTest > testProduceWithTopicDescribe STARTED
kafka.api.AuthorizerIntegrationTest > testProduceWithTopicDescribe PASSED
kafka.api.AuthorizerIntegrationTest > testDescribeGroupApiWithNoGroupAcl STARTED
kafka.api.AuthorizerIntegrationTest > testDescribeGroupApiWithNoGroupAcl PASSED
kafka.api.AuthorizerIntegrationTest > testPatternSubscriptionMatchingInternalTopic STARTED
kafka.api.AuthorizerIntegrationTest > testPatternSubscriptionMatchingInternalTopic PASSED
kafka.api.AuthorizerIntegrationTest > testSendOffsetsWithNoConsumerGroupDescribeAccess STARTED
kafka.api.AuthorizerIntegrationTest > testSendOffsetsWithNoConsumerGroupDescribeAccess PASSED
kafka.api.AuthorizerIntegrationTest > testOffsetFetchTopicDescribe STARTED
kafka.api.AuthorizerIntegrationTest > testOffsetFetchTopicDescribe PASSED
kafka.api.AuthorizerIntegrationTest > testCommitWithTopicAndGroupRead STARTED
kafka.api.AuthorizerIntegrationTest > testCommitWithTopicAndGroupRead PASSED
kafka.api.AuthorizerIntegrationTest > testIdempotentProducerNoIdempotentWriteAclInInitProducerId STARTED
kafka.api.AuthorizerIntegrationTest > testIdempotentProducerNoIdempotentWriteAclInInitProducerId PASSED
kafka.api.AuthorizerIntegrationTest > testSimpleConsumeWithExplicitSeekAndNoGroupAccess STARTED
kafka.api.AuthorizerIntegrationTest > testSimpleConsumeWithExplicitSeekAndNoGroupAccess PASSED
kafka.api.RackAwareAutoTopicCreationTest > testAutoCreateTopic STARTED
kafka.api.RackAwareAutoTopicCreationTest > testAutoCreateTopic PASSED
kafka.api.SaslClientsWithInvalidCredentialsTest > testTransactionalProducerWithAuthenticationFailure STARTED
kafka.api.SaslClientsWithInvalidCredentialsTest > testTransactionalProducerWithAuthenticationFailure PASSED
kafka.api.SaslClientsWithInvalidCredentialsTest > testManualAssignmentConsumerWithAuthenticationFailure STARTED
kafka.api.SaslClientsWithInvalidCredentialsTest > testManualAssignmentConsumerWithAuthenticationFailure PASSED
kafka.api.SaslClientsWithInvalidCredentialsTest > testConsumerGroupServiceWithAuthenticationSuccess STARTED
kafka.api.SaslClientsWithInvalidCredentialsTest > testConsumerGroupServiceWithAuthenticationSuccess PASSED
kafka.api.SaslClientsWithInvalidCredentialsTest > testProducerWithAuthenticationFailure STARTED
kafka.api.SaslClientsWithInvalidCredentialsTest > testProducerWithAuthenticationFailure PASSED
kafka.api.SaslClientsWithInvalidCredentialsTest > testConsumerGroupServiceWithAuthenticationFailure STARTED
kafka.api.SaslClientsWithInvalidCredentialsTest > testConsumerGroupServiceWithAuthenticationFailure PASSED
kafka.api.SaslClientsWithInvalidCredentialsTest > testManualAssignmentConsumerWithAutoCommitDisabledWithAuthenticationFailure STARTED
kafka.api.SaslClientsWithInvalidCredentialsTest > testManualAssignmentConsumerWithAutoCommitDisabledWithAuthenticationFailure PASSED
kafka.api.SaslClientsWithInvalidCredentialsTest > testKafkaAdminClientWithAuthenticationFailure STARTED
kafka.api.SaslClientsWithInvalidCredentialsTest > testKafkaAdminClientWithAuthenticationFailure PASSED
kafka.api.SaslClientsWithInvalidCredentialsTest > testConsumerWithAuthenticationFailure STARTED
kafka.api.SaslClientsWithInvalidCredentialsTest > testConsumerWithAuthenticationFailure PASSED
kafka.api.LogAppendTimeTest > testProduceConsume STARTED
kafka.api.LogAppendTimeTest > testProduceConsume PASSED
kafka.api.PlaintextEndToEndAuthorizationTest > testListenerName STARTED
kafka.api.PlaintextEndToEndAuthorizationTest > testListenerName PASSED
kafka.api.PlaintextEndToEndAuthorizationTest > testNoConsumeWithoutDescribeAclViaSubscribe STARTED
kafka.api.PlaintextEndToEndAuthorizationTest > testNoConsumeWithoutDescribeAclViaSubscribe PASSED
kafka.api.PlaintextEndToEndAuthorizationTest > testProduceConsumeWithPrefixedAcls STARTED
kafka.api.PlaintextEndToEndAuthorizationTest > testProduceConsumeWithPrefixedAcls PASSED
kafka.api.PlaintextEndToEndAuthorizationTest > testProduceConsumeViaAssign STARTED
kafka.api.PlaintextEndToEndAuthorizationTest > testProduceConsumeViaAssign PASSED
kafka.api.PlaintextEndToEndAuthorizationTest > testNoConsumeWithDescribeAclViaAssign STARTED
kafka.api.PlaintextEndToEndAuthorizationTest > testNoConsumeWithDescribeAclViaAssign PASSED
kafka.api.PlaintextEndToEndAuthorizationTest > testProduceConsumeTopicAutoCreateTopicCreateAcl STARTED
kafka.api.PlaintextEndToEndAuthorizationTest > testProduceConsumeTopicAutoCreateTopicCreateAcl PASSED
kafka.api.PlaintextEndToEndAuthorizationTest > testProduceConsumeWithWildcardAcls STARTED
kafka.api.PlaintextEndToEndAuthorizationTest > testProduceConsumeWithWildcardAcls PASSED
kafka.api.PlaintextEndToEndAuthorizationTest > testNoConsumeWithDescribeAclViaSubscribe STARTED
kafka.api.PlaintextEndToEndAuthorizationTest > testNoConsumeWithDescribeAclViaSubscribe PASSED
kafka.api.PlaintextEndToEndAuthorizationTest > testNoConsumeWithoutDescribeAclViaAssign STARTED
kafka.api.PlaintextEndToEndAuthorizationTest > testNoConsumeWithoutDescribeAclViaAssign PASSED
kafka.api.PlaintextEndToEndAuthorizationTest > testNoGroupAcl STARTED
kafka.api.PlaintextEndToEndAuthorizationTest > testNoGroupAcl PASSED
kafka.api.PlaintextEndToEndAuthorizationTest > testNoProduceWithDescribeAcl STARTED
kafka.api.PlaintextEndToEndAuthorizationTest > testNoProduceWithDescribeAcl PASSED
kafka.api.PlaintextEndToEndAuthorizationTest > testProduceConsumeViaSubscribe STARTED
kafka.api.PlaintextEndToEndAuthorizationTest > testProduceConsumeViaSubscribe PASSED
kafka.api.PlaintextEndToEndAuthorizationTest > testNoProduceWithoutDescribeAcl STARTED
kafka.api.PlaintextEndToEndAuthorizationTest > testNoProduceWithoutDescribeAcl PASSED
kafka.api.SslConsumerTest > testCoordinatorFailover STARTED
kafka.api.SslConsumerTest > testCoordinatorFailover PASSED
kafka.api.SslConsumerTest > testSimpleConsumption STARTED
ERROR: Could not install GRADLE_4_8_1_HOME
java.lang.NullPointerException
kafka.api.SslConsumerTest > testSimpleConsumption PASSED
kafka.api.PlaintextConsumerTest > testEarliestOrLatestOffsets STARTED
kafka.api.PlaintextConsumerTest > testEarliestOrLatestOffsets PASSED
kafka.api.PlaintextConsumerTest > testPartitionsForAutoCreate STARTED
kafka.api.PlaintextConsumerTest > testPartitionsForAutoCreate PASSED
kafka.api.PlaintextConsumerTest > testShrinkingTopicSubscriptions STARTED
kafka.api.PlaintextConsumerTest > testShrinkingTopicSubscriptions PASSED
kafka.api.PlaintextConsumerTest > testMaxPollIntervalMs STARTED
kafka.api.PlaintextConsumerTest > testMaxPollIntervalMs PASSED
kafka.api.PlaintextConsumerTest > testOffsetsForTimes STARTED
kafka.api.PlaintextConsumerTest > testOffsetsForTimes PASSED
kafka.api.PlaintextConsumerTest > testSubsequentPatternSubscription STARTED
kafka.api.PlaintextConsumerTest > testSubsequentPatternSubscription PASSED
kafka.api.PlaintextConsumerTest > testPerPartitionLeadMetricsCleanUpWithAssign STARTED
kafka.api.PlaintextConsumerTest > testPerPartitionLeadMetricsCleanUpWithAssign PASSED
kafka.api.PlaintextConsumerTest > testConsumeMessagesWithCreateTime STARTED
kafka.api.PlaintextConsumerTest > testConsumeMessagesWithCreateTime PASSED
kafka.api.PlaintextConsumerTest > testAsyncCommit STARTED
kafka.api.PlaintextConsumerTest > testAsyncCommit PASSED
kafka.api.PlaintextConsumerTest > testLowMaxFetchSizeForRequestAndPartition STARTED
ERROR: Could not install GRADLE_4_8_1_HOME
java.lang.NullPointerException
ERROR: Could not install GRADLE_4_8_1_HOME
java.lang.NullPointerException
ERROR: Could not install GRADLE_4_8_1_HOME
java.lang.NullPointerException
ERROR: Could not install GRADLE_4_8_1_HOME
java.lang.NullPointerException
ERROR: Could not install GRADLE_4_8_1_HOME
java.lang.NullPointerException
Build timed out (after 360 minutes). Marking the build as failed.
Build was aborted
[FINDBUGS] Collecting findbugs analysis files...
Setting GRADLE_4_8_1_HOME=/home/jenkins/tools/gradle/4.8.1
[FINDBUGS] Searching for all files in <https://builds.apache.org/job/kafka-2.1-jdk8/ws/> that match the pattern **/build/reports/findbugs/*.xml
[FINDBUGS] No files found. Configuration error?
Setting GRADLE_4_8_1_HOME=/home/jenkins/tools/gradle/4.8.1
No credentials specified
Setting GRADLE_4_8_1_HOME=/home/jenkins/tools/gradle/4.8.1
<Git Blamer> Using GitBlamer to create author and commit information for all warnings.
<Git Blamer> GIT_COMMIT=b60b36e560f4e5e3e766f0de55f06897ed9cd146, workspace=<https://builds.apache.org/job/kafka-2.1-jdk8/ws/>
[FINDBUGS] Computing warning deltas based on reference build #219
Recording test results
Setting GRADLE_4_8_1_HOME=/home/jenkins/tools/gradle/4.8.1
Setting GRADLE_4_8_1_HOME=/home/jenkins/tools/gradle/4.8.1
kafka.api.PlaintextConsumerTest > testLowMaxFetchSizeForRequestAndPartition SKIPPED
> Task :kafka-2.1-jdk8:core:test FAILED
> Task :testScala_2_11 FAILED
FAILURE: Build failed with an exception.
* What went wrong:
Execution failed for task ':kafka-2.1-jdk8:core:test'.
> Process 'Gradle Test Executor 5' finished with non-zero exit value 143
This problem might be caused by incorrect test process configuration.
Please refer to the test execution section in the user guide at https://docs.gradle.org/4.10.3/userguide/java_plugin.html#sec:test_execution
* Try:
Run with --stacktrace option to get the stack trace. Run with --info or --debug option to get more log output. Run with --scan to get full insights.
* Get more help at https://help.gradle.org
BUILD FAILED in 5h 58m 49s
26 actionable tasks: 3 executed, 23 up-to-date
FAILURE: Build failed with an exception.
* What went wrong:
Process 'Gradle Worker Daemon 1' finished with non-zero exit value 143
* Try:
Run with --stacktrace option to get the stack trace. Run with --info or --debug option to get more log output. Run with --scan to get full insights.
* Get more help at https://help.gradle.org
BUILD FAILED in 5h 58m 49s
Jenkins build is back to normal : kafka-2.1-jdk8 #221
Posted by Apache Jenkins Server <je...@builds.apache.org>.
See <https://builds.apache.org/job/kafka-2.1-jdk8/221/display/redirect?page=changes>