You are viewing a plain text version of this content. The canonical link for it is here.
Posted to dev@poi.apache.org by Apache Jenkins Server <je...@builds.apache.org> on 2023/09/22 16:11:33 UTC
Build failed in Jenkins: POI » POI-XMLBeans-DSL-1.21 #4
See <https://ci-builds.apache.org/job/POI/job/POI-XMLBeans-DSL-1.21/4/display/redirect?page=changes>
Changes:
[PJ Fanning] update release guide
[PJ Fanning] update release guide
------------------------------------------
[...truncated 168.11 KB...]
A test/perf/src/org/apache/xmlbeans/test/performance/jibx/POReadAllJibx.java
A test/perf/src/org/apache/xmlbeans/test/performance/jibx/POReadOneJibx.java
A test/perf/src/org/apache/xmlbeans/test/performance/jibx/binding
A test/perf/src/org/apache/xmlbeans/test/performance/jibx/binding/Customer.java
A test/perf/src/org/apache/xmlbeans/test/performance/jibx/binding/JibxPurchaseOrder.java
A test/perf/src/org/apache/xmlbeans/test/performance/jibx/binding/Lineitem.java
A test/perf/src/org/apache/xmlbeans/test/performance/jibx/binding/Shipper.java
A test/perf/src/org/apache/xmlbeans/test/tools
A test/perf/src/org/apache/xmlbeans/test/tools/PerfResultUtil.java
A test/perf/src/org/apache/xmlbeans/test/tools/PerfResultTask.java
A test/perf/build.xml
A test/perf/bin
A test/perf/bin/v2.sh
A test/perf/bin/svn.sh
A test/perf/bin/svn.bat
AU test/perf/bin/v2.bat
A test/perf/bin/parsers.bat
A test/perf/bin/run_jaxb2.bat
A test/perf/bin/run_all.bat
A test/perf/bin/run_all_nonmemory.bat
A test/perf/bin/jaxb2.bat
A test/perf/bin/xerces.sh
A test/perf/bin/castor.sh
A test/perf/bin/jaxb.bat
A test/perf/bin/run_xmlbeans_all.bat
A test/perf/bin/jaxb.sh
A test/perf/bin/xerces.bat
AU test/perf/bin/castor.bat
A test/perf/bin/run_xmlbeans_nonmemory.bat
A test/perf/bin/run_svn.bat
A test/perf/bin/run_svn_nonmemory.bat
A test/perf/bin/run_svn.sh
A test/perf/bin/run_v1_nonmemory.bat
A test/perf/bin/run_v2_nonmemory.bat
A test/perf/bin/run_xerces_nonmemory.bat
A test/perf/bin/run_all.sh
A test/perf/bin/run_v2.sh
A test/perf/bin/run_v1.bat
A test/perf/bin/run_v2.bat
A test/perf/bin/run_jaxb.sh
A test/perf/bin/run_xerces.bat
A test/perf/bin/run_v1.sh
A test/perf/bin/run_castor.bat
A test/perf/bin/run_xerces.sh
A test/perf/bin/run_castor.sh
A test/perf/bin/run_jaxb.bat
A test/perf/bin/v1.sh
A test/perf/bin/jibx.sh
A test/perf/bin/run_jibx.bat
AU test/perf/bin/v1.bat
AU test/perf/bin/jibx.bat
A test/perf/bin/castor.properties
A test/perf/bin/run_jibx.sh
A test/perf/download.properties
A test/perf/cases
AU test/perf/cases/parser_instances.zip
A test/perf/cases/xsd
A test/perf/cases/xsd/non-primitives.xsd
A test/perf/cases/xsd/purchase-order-1.xml
A test/perf/cases/xsd/purchase-order.xsd
A test/perf/cases/xsd/purchase-order-2.xml
A test/perf/cases/xsd/purchase-order-3.xml
A test/perf/cases/xsd/doc.xsd
A test/perf/cases/xsd/purchase-order-4.xml
A test/perf/cases/xsd/purchase-order-5.xml
A test/perf/cases/xsd/purchase-order-6.xml
A test/perf/cases/xsd/purchase-order-7.xml
A test/perf/cases/xsd/purchase-order-jibxbinding.xml
A test/perf/cases/xsd/perf-results.xsd
A test/perf/cases/xsd/primitives.xsd
A test/perf/results.xml
AU test/perf/env.sh
AU test/perf/env.bat
A test/tools
A test/tools/lib
A test/tools/lib/xsl
AU test/tools/lib/xsl/junit.css
AU test/tools/lib/xsl/TestReport.xsl
AU test/tools/lib/xsl/TestReport.xsd
A test/tools/lib/ant-ext
AU test/tools/lib/ant-ext/antexts.jar
AU test/tools/lib/ant-ext/ant-contrib-0.6.jar
AU test/tools/lib/JWhich.jar
A test/docs
AU test/docs/BuildingAndRunningTests.txt
AU test/docs/TestOrganization.txt
AU test/readme.txt
A settings.gradle
AU STATUS
A SECURITY.md
A CHANGES.txt
A .gitignore
AU xbeanenv.sh
AU xbeanenv.cmd
U .
At revision 1912482
ERROR: Not all environment variables could be successfully injected. Check for similarly-named environment variables.
[POI-XMLBeans-DSL-1.21] $ /bin/sh -xe /tmp/jenkins2451341364531126868.sh
+ rm -rf examples excelant integrationtest main ooxml ooxml-schema scratchpad build.javacheck.xml
+ svn status
+ svn revert poi*/src/*/java9/module-info.*
svn: E155010: The node '<https://ci-builds.apache.org/job/POI/job/POI-XMLBeans-DSL-1.21/ws/poi*/src/*'> was not found.
+ true
+ svn revert src/resources/ooxml-lite-report.*
Skipped 'src/resources/ooxml-lite-report.*'
+ echo Java-Home: /home/jenkins/tools/java/latest21
Java-Home: /home/jenkins/tools/java/latest21
+ ls -al /home/jenkins/tools/java/latest21/
total 36
drwxrwxr-x 8 root root 4096 May 10 11:12 .
drwxr-xr-x 35 root root 4096 Jul 19 19:29 ..
drwxrwxr-x 2 root root 4096 May 10 11:12 bin
drwxrwxr-x 5 root root 4096 May 10 11:12 conf
drwxrwxr-x 3 root root 4096 May 10 11:12 include
drwxrwxr-x 2 root root 4096 May 10 11:12 jmods
drwxrwxr-x 72 root root 4096 May 10 11:12 legal
drwxrwxr-x 5 root root 4096 May 10 11:12 lib
-rw-r--r-- 1 root root 1245 May 3 18:14 release
+ ls -al /home/jenkins/tools/java/latest21/bin
total 472
drwxrwxr-x 2 root root 4096 May 10 11:12 .
drwxrwxr-x 8 root root 4096 May 10 11:12 ..
-rwxr-xr-x 1 root root 12384 May 3 18:14 jar
-rwxr-xr-x 1 root root 12392 May 3 18:14 jarsigner
-rwxr-xr-x 1 root root 12328 May 3 18:14 java
-rwxr-xr-x 1 root root 12416 May 3 18:14 javac
-rwxr-xr-x 1 root root 12424 May 3 18:14 javadoc
-rwxr-xr-x 1 root root 12384 May 3 18:14 javap
-rwxr-xr-x 1 root root 12384 May 3 18:14 jcmd
-rwxr-xr-x 1 root root 12456 May 3 18:14 jconsole
-rwxr-xr-x 1 root root 12384 May 3 18:14 jdb
-rwxr-xr-x 1 root root 12392 May 3 18:14 jdeprscan
-rwxr-xr-x 1 root root 12384 May 3 18:14 jdeps
-rwxr-xr-x 1 root root 12384 May 3 18:14 jfr
-rwxr-xr-x 1 root root 12384 May 3 18:14 jhsdb
-rwxr-xr-x 1 root root 12392 May 3 18:14 jimage
-rwxr-xr-x 1 root root 12416 May 3 18:14 jinfo
-rwxr-xr-x 1 root root 12416 May 3 18:14 jlink
-rwxr-xr-x 1 root root 12416 May 3 18:14 jmap
-rwxr-xr-x 1 root root 12384 May 3 18:14 jmod
-rwxr-xr-x 1 root root 12392 May 3 18:14 jpackage
-rwxr-xr-x 1 root root 12384 May 3 18:14 jps
-rwxr-xr-x 1 root root 12424 May 3 18:14 jrunscript
-rwxr-xr-x 1 root root 12392 May 3 18:14 jshell
-rwxr-xr-x 1 root root 12424 May 3 18:14 jstack
-rwxr-xr-x 1 root root 12384 May 3 18:14 jstat
-rwxr-xr-x 1 root root 12392 May 3 18:14 jstatd
-rwxr-xr-x 1 root root 12392 May 3 18:14 jwebserver
-rwxr-xr-x 1 root root 12392 May 3 18:14 keytool
-rwxr-xr-x 1 root root 12416 May 3 18:14 rmiregistry
-rwxr-xr-x 1 root root 12392 May 3 18:14 serialver
+ /home/jenkins/tools/java/latest21/bin/java -version
openjdk version "21-ea" 2023-09-19
OpenJDK Runtime Environment (build 21-ea+21-1778)
OpenJDK 64-Bit Server VM (build 21-ea+21-1778, mixed mode, sharing)
+ echo which java
which java
+ which java
/home/jenkins/tools/java/latest21/bin/java
+ java -version
openjdk version "21-ea" 2023-09-19
OpenJDK Runtime Environment (build 21-ea+21-1778)
OpenJDK 64-Bit Server VM (build 21-ea+21-1778, mixed mode, sharing)
+ echo which javac
which javac
+ which javac
/home/jenkins/tools/java/latest21/bin/javac
+ javac -version
javac 21-ea
+ echo Ant-Home:
Ant-Home:
+ ls -al
total 412
drwxr-xr-x 10 jenkins jenkins 4096 Sep 22 16:11 .
drwxr-xr-x 3 jenkins jenkins 4096 Sep 22 16:08 ..
-rw-r--r-- 1 jenkins jenkins 29182 Sep 22 16:11 build.gradle
-rw-r--r-- 1 jenkins jenkins 54100 Sep 22 16:11 build.xml
-rw-r--r-- 1 jenkins jenkins 11963 Sep 22 16:11 CHANGES.txt
drwxr-xr-x 3 jenkins jenkins 4096 Sep 22 16:11 .github
-rw-r--r-- 1 jenkins jenkins 14 Sep 22 16:11 .gitignore
drwxr-xr-x 3 jenkins jenkins 4096 Sep 22 16:10 gradle
-rw-r--r-- 1 jenkins jenkins 1338 Sep 22 16:11 gradle.properties
-rwxr-xr-x 1 jenkins jenkins 9123 Sep 22 16:11 gradlew
-rw-r--r-- 1 jenkins jenkins 176157 Sep 22 16:11 KEYS
drwxr-xr-x 2 jenkins jenkins 4096 Sep 22 16:11 legal
-rwxr-xr-x 1 jenkins jenkins 12456 Sep 22 16:11 LICENSE-binary.txt
-rwxr-xr-x 1 jenkins jenkins 11884 Sep 22 16:11 LICENSE.txt
-rw-r--r-- 1 jenkins jenkins 2561 Sep 22 16:11 NOTICE-binary.txt
-rw-r--r-- 1 jenkins jenkins 1592 Sep 22 16:11 NOTICE.txt
-rw-r--r-- 1 jenkins jenkins 2227 Sep 22 16:11 README.txt
-rw-r--r-- 1 jenkins jenkins 10995 Sep 22 16:11 release-guide.txt
drwxr-xr-x 16 jenkins jenkins 4096 Sep 22 16:11 samples
-rw-r--r-- 1 jenkins jenkins 238 Sep 22 16:11 SECURITY.md
-rw-r--r-- 1 jenkins jenkins 661 Sep 22 16:11 settings.gradle
drwxr-xr-x 4 jenkins jenkins 4096 Sep 22 16:11 src
-rw-r--r-- 1 jenkins jenkins 369 Sep 22 16:11 STATUS
drwxr-xr-x 4 jenkins jenkins 4096 Sep 22 16:11 .svn
drwxr-xr-x 5 jenkins jenkins 4096 Sep 22 16:11 test
-rw-r--r-- 1 jenkins jenkins 3803 Sep 22 16:11 wrapper.gradle
-rw-r--r-- 1 jenkins jenkins 25 Sep 22 16:11 xbeanenv.cmd
-rwxr-xr-x 1 jenkins jenkins 27 Sep 22 16:11 xbeanenv.sh
drwxr-xr-x 2 jenkins jenkins 4096 Sep 22 16:11 xkit
+ echo which ant
which ant
+ which ant
/usr/bin/ant
+ ant -version
Apache Ant(TM) version 1.10.5 compiled on March 28 2019
+ echo <project default="test"><target name="test"><echo>Java ${ant.java.version}/${java.version}</echo><exec executable="javac"><arg value="-version"/></exec></target></project>
+ ant -f build.javacheck.xml -v
Apache Ant(TM) version 1.10.5 compiled on March 28 2019
Buildfile: <https://ci-builds.apache.org/job/POI/job/POI-XMLBeans-DSL-1.21/ws/build.javacheck.xml>
Detected Java version: 21 in: /usr/local/asfpackages/java/openjdk-21-ea+21
Detected OS: Linux
parsing buildfile <https://ci-builds.apache.org/job/POI/job/POI-XMLBeans-DSL-1.21/ws/build.javacheck.xml> with URI = <https://ci-builds.apache.org/job/POI/job/POI-XMLBeans-DSL-1.21/ws/build.javacheck.xml>
Project base dir set to: <https://ci-builds.apache.org/job/POI/job/POI-XMLBeans-DSL-1.21/ws/>
Build sequence for target(s) `test' is [test]
Complete build sequence is [test, ]
test:
parsing buildfile jar:file:/usr/share/ant/lib/ant.jar!/org/apache/tools/ant/antlib.xml with URI = jar:file:/usr/share/ant/lib/ant.jar!/org/apache/tools/ant/antlib.xml from a zip file
[echo] Java 21/21-ea
[exec] Current OS is Linux
[exec] Executing 'javac' with arguments:
[exec] '-version'
[exec]
[exec] The ' characters around the executable and arguments are
[exec] not part of the command.
[exec] javac 21-ea
BUILD SUCCESSFUL
Total time: 0 seconds
+ exit 0
[Gradle] - Launching build.
ERROR: Not all environment variables could be successfully injected. Check for similarly-named environment variables.
[POI-XMLBeans-DSL-1.21] $ <https://ci-builds.apache.org/job/POI/job/POI-XMLBeans-DSL-1.21/ws/gradlew> clean jenkins jacocoTestReport
Error: Could not find or load main class org.gradle.wrapper.GradleWrapperMain
Caused by: java.lang.ClassNotFoundException: org.gradle.wrapper.GradleWrapperMain
Build step 'Invoke Gradle script' changed build result to FAILURE
Build step 'Invoke Gradle script' marked build as failure
ERROR: Not all environment variables could be successfully injected. Check for similarly-named environment variables.
Archiving artifacts
ERROR: Not all environment variables could be successfully injected. Check for similarly-named environment variables.
Recording test results
ERROR: Not all environment variables could be successfully injected. Check for similarly-named environment variables.
ERROR: Step ?Publish JUnit test result report? failed: No test report files were found. Configuration error?
[SpotBugs] Skipping execution of recorder since overall result is 'FAILURE'
ERROR: Not all environment variables could be successfully injected. Check for similarly-named environment variables.
---------------------------------------------------------------------
To unsubscribe, e-mail: dev-unsubscribe@poi.apache.org
For additional commands, e-mail: dev-help@poi.apache.org
Jenkins build is back to normal : POI » POI-XMLBeans-DSL-1.21 #5
Posted by Apache Jenkins Server <je...@builds.apache.org>.
See <https://ci-builds.apache.org/job/POI/job/POI-XMLBeans-DSL-1.21/5/display/redirect?page=changes>
---------------------------------------------------------------------
To unsubscribe, e-mail: dev-unsubscribe@poi.apache.org
For additional commands, e-mail: dev-help@poi.apache.org