You are viewing a plain text version of this content. The canonical link for it is here.
Posted to yarn-dev@hadoop.apache.org by Apache Jenkins Server <je...@builds.apache.org> on 2013/10/24 07:21:36 UTC
Failed: YARN-891 PreCommit Build #2274
Jira: https://issues.apache.org/jira/browse/YARN-891
Build: https://builds.apache.org/job/PreCommit-YARN-Build/2274/
###################################################################################
########################## LAST 60 LINES OF THE CONSOLE ###########################
[...truncated 3091 lines...]
NOP
{color:red}-1 overall{color}. Here are the results of testing the latest attachment
http://issues.apache.org/jira/secure/attachment/12609987/YARN-891.5.patch
against trunk revision .
{color:green}+1 @author{color}. The patch does not contain any @author tags.
{color:green}+1 tests included{color}. The patch appears to include 6 new or modified test files.
{color:green}+1 javac{color}. The applied patch does not increase the total number of javac compiler warnings.
{color:green}+1 javadoc{color}. The javadoc tool did not generate any warning messages.
{color:green}+1 eclipse:eclipse{color}. The patch built with eclipse:eclipse.
{color:green}+1 findbugs{color}. The patch does not introduce any new Findbugs (version 1.3.9) warnings.
{color:green}+1 release audit{color}. The applied patch does not increase the total number of release audit warnings.
{color:red}-1 core tests{color}. The patch failed these unit tests in hadoop-yarn-project/hadoop-yarn/hadoop-yarn-api hadoop-yarn-project/hadoop-yarn/hadoop-yarn-server/hadoop-yarn-server-resourcemanager:
org.apache.hadoop.yarn.server.resourcemanager.TestRMRestart
{color:green}+1 contrib tests{color}. The patch passed contrib unit tests.
Test results: https://builds.apache.org/job/PreCommit-YARN-Build/2274//testReport/
Console output: https://builds.apache.org/job/PreCommit-YARN-Build/2274//console
This message is automatically generated.
======================================================================
======================================================================
Adding comment to Jira.
======================================================================
======================================================================
Comment added.
ea0314ca2109eaf0f304e55666bfe966c0d0e88f logged out
======================================================================
======================================================================
Finished build.
======================================================================
======================================================================
Build step 'Execute shell' marked build as failure
Archiving artifacts
[description-setter] Could not determine description.
Recording test results
Email was triggered for: Failure
Sending email for trigger: Failure
###################################################################################
############################## FAILED TESTS (if any) ##############################
1 tests failed.
REGRESSION: org.apache.hadoop.yarn.server.resourcemanager.TestRMRestart.testRMRestartOnMaxAppAttempts
Error Message:
App state is not correct (timedout) expected:<FAILED> but was:<FINAL_SAVING>
Stack Trace:
junit.framework.AssertionFailedError: App state is not correct (timedout) expected:<FAILED> but was:<FINAL_SAVING>
at junit.framework.Assert.fail(Assert.java:50)
at junit.framework.Assert.failNotEquals(Assert.java:287)
at junit.framework.Assert.assertEquals(Assert.java:67)
at org.apache.hadoop.yarn.server.resourcemanager.MockRM.waitForState(MockRM.java:101)
at org.apache.hadoop.yarn.server.resourcemanager.TestRMRestart.testRMRestartOnMaxAppAttempts(TestRMRestart.java:734)
Success: YARN-311 PreCommit Build #2278
Posted by Apache Jenkins Server <je...@builds.apache.org>.
Jira: https://issues.apache.org/jira/browse/YARN-311
Build: https://builds.apache.org/job/PreCommit-YARN-Build/2278/
###################################################################################
########################## LAST 60 LINES OF THE CONSOLE ###########################
[...truncated 3098 lines...]
/bin/kill -9 1694
kill: No such process
NOP
{color:green}+1 overall{color}. Here are the results of testing the latest attachment
http://issues.apache.org/jira/secure/attachment/12610153/YARN-311-v10.patch
against trunk revision .
{color:green}+1 @author{color}. The patch does not contain any @author tags.
{color:green}+1 tests included{color}. The patch appears to include 2 new or modified test files.
{color:green}+1 javac{color}. The applied patch does not increase the total number of javac compiler warnings.
{color:green}+1 javadoc{color}. The javadoc tool did not generate any warning messages.
{color:green}+1 eclipse:eclipse{color}. The patch built with eclipse:eclipse.
{color:green}+1 findbugs{color}. The patch does not introduce any new Findbugs (version 1.3.9) warnings.
{color:green}+1 release audit{color}. The applied patch does not increase the total number of release audit warnings.
{color:green}+1 core tests{color}. The patch passed unit tests in hadoop-tools/hadoop-sls hadoop-yarn-project/hadoop-yarn/hadoop-yarn-server/hadoop-yarn-server-resourcemanager.
{color:green}+1 contrib tests{color}. The patch passed contrib unit tests.
Test results: https://builds.apache.org/job/PreCommit-YARN-Build/2278//testReport/
Console output: https://builds.apache.org/job/PreCommit-YARN-Build/2278//console
This message is automatically generated.
======================================================================
======================================================================
Adding comment to Jira.
======================================================================
======================================================================
Comment added.
faa7b6e241475d9fe8524c9d9546259c7230a053 logged out
======================================================================
======================================================================
Finished build.
======================================================================
======================================================================
Archiving artifacts
Description set: YARN-311
Recording test results
Email was triggered for: Success
Sending email for trigger: Success
###################################################################################
############################## FAILED TESTS (if any) ##############################
All tests passed
Failed: YARN-975 PreCommit Build #2277
Posted by Apache Jenkins Server <je...@builds.apache.org>.
Jira: https://issues.apache.org/jira/browse/YARN-975
Build: https://builds.apache.org/job/PreCommit-YARN-Build/2277/
###################################################################################
########################## LAST 60 LINES OF THE CONSOLE ###########################
[...truncated 10 lines...]
No emails were triggered.
[PreCommit-YARN-Build] $ /bin/bash /tmp/hudson5391449731174587615.sh
32768
Running in Jenkins mode
======================================================================
======================================================================
Testing patch for YARN-975.
======================================================================
======================================================================
At revision 1535285.
YARN-975 patch is being downloaded at Thu Oct 24 06:32:23 UTC 2013 from
http://issues.apache.org/jira/secure/attachment/12610063/YARN-975.10.patch
cp: cannot stat `/home/jenkins/buildSupport/lib/*': No such file or directory
The patch does not appear to apply with p0 to p2
PATCH APPLICATION FAILED
{color:red}-1 overall{color}. Here are the results of testing the latest attachment
http://issues.apache.org/jira/secure/attachment/12610063/YARN-975.10.patch
against trunk revision .
{color:red}-1 patch{color}. The patch command could not apply the patch.
Console output: https://builds.apache.org/job/PreCommit-YARN-Build/2277//console
This message is automatically generated.
======================================================================
======================================================================
Adding comment to Jira.
======================================================================
======================================================================
Comment added.
d3ff8b51b8fdb935548b7e48a31b7272b80cd2f6 logged out
======================================================================
======================================================================
Finished build.
======================================================================
======================================================================
Build step 'Execute shell' marked build as failure
Archiving artifacts
[description-setter] Could not determine description.
Recording test results
Editable Email Notification is waiting for a checkpoint on PreCommit-YARN-Build #2276
Email was triggered for: Failure
Sending email for trigger: Failure
###################################################################################
############################## FAILED TESTS (if any) ##############################
No tests ran.
Failed: YARN-1335 PreCommit Build #2276
Posted by Apache Jenkins Server <je...@builds.apache.org>.
Jira: https://issues.apache.org/jira/browse/YARN-1335
Build: https://builds.apache.org/job/PreCommit-YARN-Build/2276/
###################################################################################
########################## LAST 60 LINES OF THE CONSOLE ###########################
[...truncated 3001 lines...]
NOP
{color:red}-1 overall{color}. Here are the results of testing the latest attachment
http://issues.apache.org/jira/secure/attachment/12610061/YARN-1335-1.patch
against trunk revision .
{color:green}+1 @author{color}. The patch does not contain any @author tags.
{color:red}-1 tests included{color}. The patch doesn't appear to include any new or modified tests.
Please justify why no new tests are needed for this patch.
Also please list what manual steps were performed to verify this patch.
{color:green}+1 javac{color}. The applied patch does not increase the total number of javac compiler warnings.
{color:green}+1 javadoc{color}. The javadoc tool did not generate any warning messages.
{color:green}+1 eclipse:eclipse{color}. The patch built with eclipse:eclipse.
{color:green}+1 findbugs{color}. The patch does not introduce any new Findbugs (version 1.3.9) warnings.
{color:green}+1 release audit{color}. The applied patch does not increase the total number of release audit warnings.
{color:green}+1 core tests{color}. The patch passed unit tests in hadoop-yarn-project/hadoop-yarn/hadoop-yarn-server/hadoop-yarn-server-resourcemanager.
{color:green}+1 contrib tests{color}. The patch passed contrib unit tests.
Test results: https://builds.apache.org/job/PreCommit-YARN-Build/2276//testReport/
Console output: https://builds.apache.org/job/PreCommit-YARN-Build/2276//console
This message is automatically generated.
======================================================================
======================================================================
Adding comment to Jira.
======================================================================
======================================================================
Comment added.
0eb376c92fe3a6fe3b7b0d19a033ef77becb82f8 logged out
======================================================================
======================================================================
Finished build.
======================================================================
======================================================================
Build step 'Execute shell' marked build as failure
Archiving artifacts
[description-setter] Could not determine description.
Recording test results
Email was triggered for: Failure
Sending email for trigger: Failure
###################################################################################
############################## FAILED TESTS (if any) ##############################
All tests passed
Failed: YARN-891 PreCommit Build #2275
Posted by Apache Jenkins Server <je...@builds.apache.org>.
Jira: https://issues.apache.org/jira/browse/YARN-891
Build: https://builds.apache.org/job/PreCommit-YARN-Build/2275/
###################################################################################
########################## LAST 60 LINES OF THE CONSOLE ###########################
[...truncated 3087 lines...]
NOP
{color:red}-1 overall{color}. Here are the results of testing the latest attachment
http://issues.apache.org/jira/secure/attachment/12609997/YARN-891.6.patch
against trunk revision .
{color:green}+1 @author{color}. The patch does not contain any @author tags.
{color:green}+1 tests included{color}. The patch appears to include 6 new or modified test files.
{color:green}+1 javac{color}. The applied patch does not increase the total number of javac compiler warnings.
{color:green}+1 javadoc{color}. The javadoc tool did not generate any warning messages.
{color:green}+1 eclipse:eclipse{color}. The patch built with eclipse:eclipse.
{color:green}+1 findbugs{color}. The patch does not introduce any new Findbugs (version 1.3.9) warnings.
{color:green}+1 release audit{color}. The applied patch does not increase the total number of release audit warnings.
{color:red}-1 core tests{color}. The patch failed these unit tests in hadoop-yarn-project/hadoop-yarn/hadoop-yarn-api hadoop-yarn-project/hadoop-yarn/hadoop-yarn-server/hadoop-yarn-server-resourcemanager:
org.apache.hadoop.yarn.server.resourcemanager.recovery.TestZKRMStateStoreZKClientConnections
{color:green}+1 contrib tests{color}. The patch passed contrib unit tests.
Test results: https://builds.apache.org/job/PreCommit-YARN-Build/2275//testReport/
Console output: https://builds.apache.org/job/PreCommit-YARN-Build/2275//console
This message is automatically generated.
======================================================================
======================================================================
Adding comment to Jira.
======================================================================
======================================================================
Comment added.
3cd134c5452efbeee3b7da8d94d57a0774690e7b logged out
======================================================================
======================================================================
Finished build.
======================================================================
======================================================================
Build step 'Execute shell' marked build as failure
Archiving artifacts
[description-setter] Could not determine description.
Recording test results
Email was triggered for: Failure
Sending email for trigger: Failure
###################################################################################
############################## FAILED TESTS (if any) ##############################
1 tests failed.
REGRESSION: org.apache.hadoop.yarn.server.resourcemanager.recovery.TestZKRMStateStoreZKClientConnections.testZKClientDisconnectAndReconnect
Error Message:
Unable to connect to server
Stack Trace:
java.lang.AssertionError: Unable to connect to server
at org.junit.Assert.fail(Assert.java:93)
at org.apache.hadoop.ha.ClientBaseWithFixes.createClient(ClientBaseWithFixes.java:180)
at org.apache.hadoop.yarn.server.resourcemanager.recovery.TestZKRMStateStoreZKClientConnections.access$100(TestZKRMStateStoreZKClientConnections.java:44)