You are viewing a plain text version of this content. The canonical link for it is here.
Posted to builds@hbase.apache.org by Apache Jenkins Server <je...@builds.apache.org> on 2015/04/28 18:18:08 UTC
Build failed in Jenkins: HBase-TRUNK #6426
See <https://builds.apache.org/job/HBase-TRUNK/6426/changes>
Changes:
[matteo.bertozzi] HBASE-13572 Procedure v2 - client truncate table sync
------------------------------------------
[...truncated 4049 lines...]
Running org.apache.hadoop.hbase.coprocessor.TestBatchCoprocessorEndpoint
Tests run: 4, Failures: 0, Errors: 0, Skipped: 0, Time elapsed: 2.028 sec - in org.apache.hadoop.hbase.coprocessor.TestBatchCoprocessorEndpoint
Running org.apache.hadoop.hbase.coprocessor.TestHTableWrapper
Tests run: 13, Failures: 0, Errors: 0, Skipped: 0, Time elapsed: 85.824 sec - in org.apache.hadoop.hbase.coprocessor.TestRegionObserverInterface
Running org.apache.hadoop.hbase.coprocessor.TestRegionServerObserver
Tests run: 1, Failures: 0, Errors: 0, Skipped: 0, Time elapsed: 7.047 sec - in org.apache.hadoop.hbase.coprocessor.TestHTableWrapper
Tests run: 2, Failures: 0, Errors: 0, Skipped: 0, Time elapsed: 208.129 sec - in org.apache.hadoop.hbase.TestIOFencing
Running org.apache.hadoop.hbase.coprocessor.TestRegionServerCoprocessorExceptionWithAbort
Running org.apache.hadoop.hbase.coprocessor.TestClassLoading
Tests run: 1, Failures: 0, Errors: 0, Skipped: 0, Time elapsed: 19.648 sec - in org.apache.hadoop.hbase.coprocessor.TestRegionServerObserver
Tests run: 2, Failures: 0, Errors: 0, Skipped: 0, Time elapsed: 22.161 sec - in org.apache.hadoop.hbase.coprocessor.TestRegionServerCoprocessorExceptionWithAbort
Running org.apache.hadoop.hbase.coprocessor.TestDoubleColumnInterpreter
Tests run: 38, Failures: 0, Errors: 0, Skipped: 0, Time elapsed: 4.958 sec - in org.apache.hadoop.hbase.coprocessor.TestDoubleColumnInterpreter
Tests run: 9, Failures: 0, Errors: 0, Skipped: 0, Time elapsed: 337.3 sec - in org.apache.hadoop.hbase.snapshot.TestExportSnapshot
Tests run: 9, Failures: 0, Errors: 0, Skipped: 0, Time elapsed: 30.09 sec - in org.apache.hadoop.hbase.coprocessor.TestClassLoading
Running org.apache.hadoop.hbase.coprocessor.TestRegionObserverBypass
Running org.apache.hadoop.hbase.coprocessor.TestRowProcessorEndpoint
Running org.apache.hadoop.hbase.coprocessor.TestCoprocessorStop
Tests run: 2, Failures: 0, Errors: 0, Skipped: 0, Time elapsed: 6.891 sec - in org.apache.hadoop.hbase.coprocessor.TestRegionObserverBypass
Running org.apache.hadoop.hbase.coprocessor.TestRegionServerCoprocessorExceptionWithRemove
Running org.apache.hadoop.hbase.coprocessor.TestBigDecimalColumnInterpreter
Tests run: 1, Failures: 0, Errors: 0, Skipped: 0, Time elapsed: 17.145 sec - in org.apache.hadoop.hbase.coprocessor.TestCoprocessorStop
Tests run: 4, Failures: 0, Errors: 0, Skipped: 0, Time elapsed: 21.321 sec - in org.apache.hadoop.hbase.coprocessor.TestRowProcessorEndpoint
Tests run: 1, Failures: 0, Errors: 0, Skipped: 0, Time elapsed: 16.55 sec - in org.apache.hadoop.hbase.coprocessor.TestRegionServerCoprocessorExceptionWithRemove
Tests run: 38, Failures: 0, Errors: 0, Skipped: 0, Time elapsed: 5.306 sec - in org.apache.hadoop.hbase.coprocessor.TestBigDecimalColumnInterpreter
Running org.apache.hadoop.hbase.TestGlobalMemStoreSize
Running org.apache.hadoop.hbase.coprocessor.TestMasterObserver
Running org.apache.hadoop.hbase.coprocessor.TestCoprocessorEndpoint
Running org.apache.hadoop.hbase.coprocessor.TestWALObserver
Tests run: 1, Failures: 0, Errors: 0, Skipped: 0, Time elapsed: 17.328 sec - in org.apache.hadoop.hbase.TestGlobalMemStoreSize
Tests run: 6, Failures: 0, Errors: 0, Skipped: 0, Time elapsed: 9.523 sec - in org.apache.hadoop.hbase.coprocessor.TestWALObserver
Tests run: 9, Failures: 0, Errors: 0, Skipped: 0, Time elapsed: 380.177 sec - in org.apache.hadoop.hbase.snapshot.TestSecureExportSnapshot
Running org.apache.hadoop.hbase.TestMetaTableLocator
Tests run: 7, Failures: 0, Errors: 0, Skipped: 0, Time elapsed: 4.083 sec - in org.apache.hadoop.hbase.TestMetaTableLocator
Running org.apache.hadoop.hbase.TestJMXListener
Running org.apache.hadoop.hbase.zookeeper.TestZKMulti
Tests run: 8, Failures: 0, Errors: 0, Skipped: 0, Time elapsed: 0.64 sec - in org.apache.hadoop.hbase.zookeeper.TestZKMulti
Running org.apache.hadoop.hbase.zookeeper.lock.TestZKInterProcessReadWriteLock
Running org.apache.hadoop.hbase.zookeeper.TestZooKeeperACL
Tests run: 6, Failures: 0, Errors: 0, Skipped: 0, Time elapsed: 0.304 sec - in org.apache.hadoop.hbase.zookeeper.TestZooKeeperACL
Tests run: 7, Failures: 0, Errors: 0, Skipped: 0, Time elapsed: 37.391 sec - in org.apache.hadoop.hbase.coprocessor.TestMasterObserver
Running org.apache.hadoop.hbase.zookeeper.TestZKLeaderManager
Tests run: 1, Failures: 0, Errors: 0, Skipped: 0, Time elapsed: 0.103 sec - in org.apache.hadoop.hbase.zookeeper.TestZKLeaderManager
Running org.apache.hadoop.hbase.zookeeper.TestRecoverableZooKeeper
Tests run: 1, Failures: 0, Errors: 0, Skipped: 0, Time elapsed: 1.253 sec - in org.apache.hadoop.hbase.zookeeper.TestRecoverableZooKeeper
Tests run: 2, Failures: 0, Errors: 1, Skipped: 0, Time elapsed: 17.162 sec <<< FAILURE! - in org.apache.hadoop.hbase.TestJMXListener
testStart(org.apache.hadoop.hbase.TestJMXListener) Time elapsed: 0.069 sec <<< ERROR!
java.io.IOException: Failed to retrieve RMIServer stub: javax.naming.ServiceUnavailableException [Root exception is java.rmi.ConnectException: Connection refused to host: localhost; nested exception is:
java.net.ConnectException: Connection refused]
at java.net.PlainSocketImpl.socketConnect(Native Method)
at java.net.AbstractPlainSocketImpl.doConnect(AbstractPlainSocketImpl.java:339)
at java.net.AbstractPlainSocketImpl.connectToAddress(AbstractPlainSocketImpl.java:200)
at java.net.AbstractPlainSocketImpl.connect(AbstractPlainSocketImpl.java:182)
at java.net.SocksSocketImpl.connect(SocksSocketImpl.java:392)
at java.net.Socket.connect(Socket.java:579)
at java.net.Socket.connect(Socket.java:528)
at java.net.Socket.<init>(Socket.java:425)
at java.net.Socket.<init>(Socket.java:208)
at sun.rmi.transport.proxy.RMIDirectSocketFactory.createSocket(RMIDirectSocketFactory.java:40)
at sun.rmi.transport.proxy.RMIMasterSocketFactory.createSocket(RMIMasterSocketFactory.java:147)
at sun.rmi.transport.tcp.TCPEndpoint.newSocket(TCPEndpoint.java:613)
at sun.rmi.transport.tcp.TCPChannel.createConnection(TCPChannel.java:216)
at sun.rmi.transport.tcp.TCPChannel.newConnection(TCPChannel.java:202)
at sun.rmi.server.UnicastRef.newCall(UnicastRef.java:341)
at sun.rmi.registry.RegistryImpl_Stub.lookup(Unknown Source)
at com.sun.jndi.rmi.registry.RegistryContext.lookup(RegistryContext.java:114)
at com.sun.jndi.toolkit.url.GenericURLContext.lookup(GenericURLContext.java:203)
at javax.naming.InitialContext.lookup(InitialContext.java:411)
at javax.management.remote.rmi.RMIConnector.findRMIServerJNDI(RMIConnector.java:1936)
at javax.management.remote.rmi.RMIConnector.findRMIServer(RMIConnector.java:1903)
at javax.management.remote.rmi.RMIConnector.connect(RMIConnector.java:286)
at javax.management.remote.JMXConnectorFactory.connect(JMXConnectorFactory.java:268)
at javax.management.remote.JMXConnectorFactory.connect(JMXConnectorFactory.java:227)
at org.apache.hadoop.hbase.TestJMXListener.testStart(TestJMXListener.java:70)
Running org.apache.hadoop.hbase.zookeeper.TestZooKeeperNodeTracker
Running org.apache.hadoop.hbase.zookeeper.TestHQuorumPeer
Tests run: 3, Failures: 0, Errors: 0, Skipped: 0, Time elapsed: 2.361 sec - in org.apache.hadoop.hbase.zookeeper.TestZooKeeperNodeTracker
Running org.apache.hadoop.hbase.TestClusterBootOrder
Tests run: 6, Failures: 0, Errors: 0, Skipped: 0, Time elapsed: 24.472 sec - in org.apache.hadoop.hbase.zookeeper.lock.TestZKInterProcessReadWriteLock
Running org.apache.hadoop.hbase.TestPartialResultsFromClientSide
Tests run: 4, Failures: 0, Errors: 0, Skipped: 0, Time elapsed: 23.327 sec - in org.apache.hadoop.hbase.zookeeper.TestHQuorumPeer
Tests run: 2, Failures: 0, Errors: 0, Skipped: 0, Time elapsed: 32.777 sec - in org.apache.hadoop.hbase.TestClusterBootOrder
Tests run: 13, Failures: 0, Errors: 0, Skipped: 0, Time elapsed: 75.403 sec - in org.apache.hadoop.hbase.TestPartialResultsFromClientSide
Tests run: 6, Failures: 0, Errors: 0, Skipped: 0, Time elapsed: 552.973 sec - in org.apache.hadoop.hbase.coprocessor.TestCoprocessorEndpoint
Results :
Failed tests:
TestCreateTableProcedure.testRollbackAndDoubleExecution:195->testSimpleCreate:115 f1 family dir does not exist
Tests in error:
TestJMXListener.testStart:70 » IO Failed to retrieve RMIServer stub: javax.nam...
TestHFileOutputFormat2.testMRIncrementalLoadWithSplit:380->doIncrementalLoadTest:441 » IO
Tests run: 2427, Failures: 1, Errors: 2, Skipped: 17
[INFO] ------------------------------------------------------------------------
[INFO] Reactor Summary:
[INFO]
[INFO] HBase ............................................. SUCCESS [ 2.811 s]
[INFO] HBase - Checkstyle ................................ SUCCESS [ 0.680 s]
[INFO] HBase - Annotations ............................... SUCCESS [ 0.195 s]
[INFO] HBase - Protocol .................................. SUCCESS [ 2.622 s]
[INFO] HBase - Common .................................... SUCCESS [03:10 min]
[INFO] HBase - Procedure ................................. SUCCESS [01:34 min]
[INFO] HBase - Client .................................... SUCCESS [01:49 min]
[INFO] HBase - Hadoop Compatibility ...................... SUCCESS [ 11.271 s]
[INFO] HBase - Hadoop Two Compatibility .................. SUCCESS [ 14.205 s]
[INFO] HBase - Prefix Tree ............................... SUCCESS [ 17.753 s]
[INFO] HBase - Server .................................... FAILURE [ 01:53 h]
[INFO] HBase - Testing Util .............................. SKIPPED
[INFO] HBase - Thrift .................................... SKIPPED
[INFO] HBase - Shell ..................................... SKIPPED
[INFO] HBase - Integration Tests ......................... SKIPPED
[INFO] HBase - Examples .................................. SKIPPED
[INFO] HBase - Rest ...................................... SKIPPED
[INFO] HBase - Assembly .................................. SKIPPED
[INFO] ------------------------------------------------------------------------
[INFO] BUILD FAILURE
[INFO] ------------------------------------------------------------------------
[INFO] Total time: 02:00 h
[INFO] Finished at: 2015-04-28T16:14:36+00:00
[INFO] Final Memory: 61M/602M
[INFO] ------------------------------------------------------------------------
[ERROR] Failed to execute goal org.apache.maven.plugins:maven-surefire-plugin:2.18:test (secondPartTestsExecution) on project hbase-server: There was a timeout or other error in the fork -> [Help 1]
[ERROR]
[ERROR] To see the full stack trace of the errors, re-run Maven with the -e switch.
[ERROR] Re-run Maven using the -X switch to enable full debug logging.
[ERROR]
[ERROR] For more information about the errors and possible solutions, please read the following articles:
[ERROR] [Help 1] http://cwiki.apache.org/confluence/display/MAVEN/MojoFailureException
[ERROR]
[ERROR] After correcting the problems, you can resume the build with the command
[ERROR] mvn <goals> -rf :hbase-server
Build step 'Invoke top-level Maven targets' marked build as failure
Performing Post build task...
Match found for :.* : True
Logical operation result is TRUE
Running script : ZOMBIE_TESTS_COUNT=`jps | grep surefirebooter | wc -l`
if [[ $ZOMBIE_TESTS_COUNT != 0 ]] ; then
#It seems sometimes the tests are not dying immediately. Let's give them 10s
echo "Suspicious java process found - waiting 10s to see if there are just slow to stop"
sleep 10
ZOMBIE_TESTS_COUNT=`jps | grep surefirebooter | wc -l`
if [[ $ZOMBIE_TESTS_COUNT != 0 ]] ; then
echo "There are $ZOMBIE_TESTS_COUNT zombie tests, they should have been killed by surefire but survived"
echo "************ BEGIN zombies jstack extract"
ZB_STACK=`jps | grep surefirebooter | cut -d ' ' -f 1 | xargs -n 1 jstack | grep ".test" | grep "\.java"`
jps | grep surefirebooter | cut -d ' ' -f 1 | xargs -n 1 jstack
echo "************ END zombies jstack extract"
JIRA_COMMENT="$JIRA_COMMENT
{color:red}-1 core zombie tests{color}. There are ${ZOMBIE_TESTS_COUNT} zombie test(s): ${ZB_STACK}"
BAD=1
jps | grep surefirebooter | cut -d ' ' -f 1 | xargs kill -9
else
echo "We're ok: there is no zombie test, but some tests took some time to stop"
fi
else
echo "We're ok: there is no zombie test"
fi
[HBase-TRUNK] $ /bin/bash -xe /tmp/hudson5334444016529770348.sh
++ jps
++ grep surefirebooter
++ wc -l
+ ZOMBIE_TESTS_COUNT=1
+ [[ 1 != 0 ]]
+ echo 'Suspicious java process found - waiting 10s to see if there are just slow to stop'
Suspicious java process found - waiting 10s to see if there are just slow to stop
+ sleep 10
++ jps
++ grep surefirebooter
++ wc -l
+ ZOMBIE_TESTS_COUNT=1
+ [[ 1 != 0 ]]
+ echo 'There are 1 zombie tests, they should have been killed by surefire but survived'
There are 1 zombie tests, they should have been killed by surefire but survived
+ echo '************ BEGIN zombies jstack extract'
************ BEGIN zombies jstack extract
++ jps
++ grep surefirebooter
++ grep .test
++ cut -d ' ' -f 1
++ xargs -n 1 jstack
++ grep '\.java'
+ ZB_STACK=
POST BUILD TASK : FAILURE
END OF POST BUILD TASK : 0
Archiving artifacts
Sending artifact delta relative to HBase-TRUNK #6422
Archived 2137 artifacts
Archive block size is 32768
Received 74 blocks and 430391654 bytes
Compression is 0.6%
Took 2 min 44 sec
Recording test results
[FINDBUGS] Collecting findbugs analysis files...
[FINDBUGS] Finding all files that match the pattern **/findbugs.xml,**/findbugsXml.xml
[FINDBUGS] Parsing 24 files in <https://builds.apache.org/job/HBase-TRUNK/ws/>
[FINDBUGS] Successfully parsed file <https://builds.apache.org/job/HBase-TRUNK/6426/artifact/hbase-annotations/target/findbugs.xml> of module with 0 warnings.
[FINDBUGS] Successfully parsed file <https://builds.apache.org/job/HBase-TRUNK/6426/artifact/hbase-annotations/target/findbugsXml.xml> of module with 0 warnings.
[FINDBUGS] Successfully parsed file <https://builds.apache.org/job/HBase-TRUNK/6426/artifact/hbase-client/target/findbugs.xml> of module with 0 warnings.
[FINDBUGS] Successfully parsed file <https://builds.apache.org/job/HBase-TRUNK/6426/artifact/hbase-client/target/findbugsXml.xml> of module with 8 warnings.
[FINDBUGS] Successfully parsed file <https://builds.apache.org/job/HBase-TRUNK/6426/artifact/hbase-common/target/findbugs.xml> of module with 0 warnings.
[FINDBUGS] Successfully parsed file <https://builds.apache.org/job/HBase-TRUNK/6426/artifact/hbase-common/target/findbugsXml.xml> of module with 1 warnings.
[FINDBUGS] Successfully parsed file <https://builds.apache.org/job/HBase-TRUNK/6426/artifact/hbase-examples/target/findbugs.xml> of module with 0 warnings.
[FINDBUGS] Successfully parsed file <https://builds.apache.org/job/HBase-TRUNK/6426/artifact/hbase-examples/target/findbugsXml.xml> of module with 0 warnings.
[FINDBUGS] Successfully parsed file <https://builds.apache.org/job/HBase-TRUNK/6426/artifact/hbase-hadoop-compat/target/findbugs.xml> of module with 0 warnings.
[FINDBUGS] Successfully parsed file <https://builds.apache.org/job/HBase-TRUNK/6426/artifact/hbase-hadoop-compat/target/findbugsXml.xml> of module with 0 warnings.
[FINDBUGS] Successfully parsed file <https://builds.apache.org/job/HBase-TRUNK/6426/artifact/hbase-hadoop2-compat/target/findbugs.xml> of module with 0 warnings.
[FINDBUGS] Successfully parsed file <https://builds.apache.org/job/HBase-TRUNK/6426/artifact/hbase-hadoop2-compat/target/findbugsXml.xml> of module with 0 warnings.
[FINDBUGS] Successfully parsed file <https://builds.apache.org/job/HBase-TRUNK/6426/artifact/hbase-prefix-tree/target/findbugs.xml> of module with 0 warnings.
[FINDBUGS] Successfully parsed file <https://builds.apache.org/job/HBase-TRUNK/6426/artifact/hbase-prefix-tree/target/findbugsXml.xml> of module with 0 warnings.
[FINDBUGS] Successfully parsed file <https://builds.apache.org/job/HBase-TRUNK/6426/artifact/hbase-procedure/target/findbugs.xml> of module with 0 warnings.
[FINDBUGS] Successfully parsed file <https://builds.apache.org/job/HBase-TRUNK/6426/artifact/hbase-procedure/target/findbugsXml.xml> of module with 1 warnings.
[FINDBUGS] Successfully parsed file <https://builds.apache.org/job/HBase-TRUNK/6426/artifact/hbase-protocol/target/findbugs.xml> of module with 0 warnings.
[FINDBUGS] Successfully parsed file <https://builds.apache.org/job/HBase-TRUNK/6426/artifact/hbase-protocol/target/findbugsXml.xml> of module with 0 warnings.
[FINDBUGS] Successfully parsed file <https://builds.apache.org/job/HBase-TRUNK/6426/artifact/hbase-rest/target/findbugs.xml> of module with 0 warnings.
[FINDBUGS] Successfully parsed file <https://builds.apache.org/job/HBase-TRUNK/6426/artifact/hbase-rest/target/findbugsXml.xml> of module with 2 warnings.
[FINDBUGS] Successfully parsed file <https://builds.apache.org/job/HBase-TRUNK/6426/artifact/hbase-server/target/findbugs.xml> of module with 0 warnings.
[FINDBUGS] Successfully parsed file <https://builds.apache.org/job/HBase-TRUNK/6426/artifact/hbase-server/target/findbugsXml.xml> of module with 61 warnings.
[FINDBUGS] Successfully parsed file <https://builds.apache.org/job/HBase-TRUNK/6426/artifact/hbase-thrift/target/findbugs.xml> of module with 0 warnings.
[FINDBUGS] Successfully parsed file <https://builds.apache.org/job/HBase-TRUNK/6426/artifact/hbase-thrift/target/findbugsXml.xml> of module with 0 warnings.
[FINDBUGS] Computing warning deltas based on reference build #6422
[CHECKSTYLE] Collecting checkstyle analysis files...
[CHECKSTYLE] Finding all files that match the pattern **/checkstyle-result.xml
[CHECKSTYLE] Parsing 18 files in <https://builds.apache.org/job/HBase-TRUNK/ws/>
[CHECKSTYLE] Successfully parsed file <https://builds.apache.org/job/HBase-TRUNK/6426/artifact/hbase-annotations/target/checkstyle-result.xml> of module with 0 warnings.
[CHECKSTYLE] Successfully parsed file <https://builds.apache.org/job/HBase-TRUNK/6426/artifact/hbase-assembly/target/checkstyle-result.xml> of module with 0 warnings.
[CHECKSTYLE] Successfully parsed file <https://builds.apache.org/job/HBase-TRUNK/6426/artifact/hbase-checkstyle/target/checkstyle-result.xml> of module with 0 warnings.
[CHECKSTYLE] Successfully parsed file <https://builds.apache.org/job/HBase-TRUNK/6426/artifact/hbase-client/target/checkstyle-result.xml> of module with 212 warnings.
[CHECKSTYLE] Successfully parsed file <https://builds.apache.org/job/HBase-TRUNK/6426/artifact/hbase-common/target/checkstyle-result.xml> of module with 125 warnings.
[CHECKSTYLE] Successfully parsed file <https://builds.apache.org/job/HBase-TRUNK/6426/artifact/hbase-examples/target/checkstyle-result.xml> of module with 30 warnings.
[CHECKSTYLE] Successfully parsed file <https://builds.apache.org/job/HBase-TRUNK/6426/artifact/hbase-hadoop-compat/target/checkstyle-result.xml> of module with 2 warnings.
[CHECKSTYLE] Successfully parsed file <https://builds.apache.org/job/HBase-TRUNK/6426/artifact/hbase-hadoop2-compat/target/checkstyle-result.xml> of module with 47 warnings.
[CHECKSTYLE] Successfully parsed file <https://builds.apache.org/job/HBase-TRUNK/6426/artifact/hbase-it/target/checkstyle-result.xml> of module with 0 warnings.
[CHECKSTYLE] Successfully parsed file <https://builds.apache.org/job/HBase-TRUNK/6426/artifact/hbase-prefix-tree/target/checkstyle-result.xml> of module with 25 warnings.
[CHECKSTYLE] Successfully parsed file <https://builds.apache.org/job/HBase-TRUNK/6426/artifact/hbase-procedure/target/checkstyle-result.xml> of module with 0 warnings.
[CHECKSTYLE] Successfully parsed file <https://builds.apache.org/job/HBase-TRUNK/6426/artifact/hbase-protocol/target/checkstyle-result.xml> of module with 3 warnings.
[CHECKSTYLE] Successfully parsed file <https://builds.apache.org/job/HBase-TRUNK/6426/artifact/hbase-rest/target/checkstyle-result.xml> of module with 42 warnings.
[CHECKSTYLE] Successfully parsed file <https://builds.apache.org/job/HBase-TRUNK/6426/artifact/hbase-server/target/checkstyle-result.xml> of module with 1379 warnings.
[CHECKSTYLE] Successfully parsed file <https://builds.apache.org/job/HBase-TRUNK/6426/artifact/hbase-shell/target/checkstyle-result.xml> of module with 0 warnings.
[CHECKSTYLE] Successfully parsed file <https://builds.apache.org/job/HBase-TRUNK/6426/artifact/hbase-testing-util/target/checkstyle-result.xml> of module with 0 warnings.
[CHECKSTYLE] Successfully parsed file <https://builds.apache.org/job/HBase-TRUNK/6426/artifact/hbase-thrift/target/checkstyle-result.xml> of module with 32 warnings.
[CHECKSTYLE] Successfully parsed file <https://builds.apache.org/job/HBase-TRUNK/6426/artifact/target/checkstyle-result.xml> of module with 0 warnings.
[CHECKSTYLE] Computing warning deltas based on reference build #6422
Updating HBASE-13572
Build failed in Jenkins: HBase-TRUNK #6430
Posted by Apache Jenkins Server <je...@builds.apache.org>.
See <https://builds.apache.org/job/HBase-TRUNK/6430/changes>
Changes:
[ndimiduk] HBASE-13417 batchCoprocessorService() does not handle NULL keys (Abhishek Singh Chouhan)
------------------------------------------
[...truncated 5094 lines...]
at com.google.inject.internal.cglib.reflect.$FastMethod.invoke(FastMethod.java:53)
at com.google.inject.internal.SingleMethodInjector$1.invoke(SingleMethodInjector.java:56)
at com.google.inject.internal.SingleMethodInjector.inject(SingleMethodInjector.java:90)
at com.google.inject.internal.MembersInjectorImpl.injectMembers(MembersInjectorImpl.java:110)
at com.google.inject.internal.MembersInjectorImpl$1.call(MembersInjectorImpl.java:75)
at com.google.inject.internal.MembersInjectorImpl$1.call(MembersInjectorImpl.java:73)
at com.google.inject.internal.InjectorImpl.callInContext(InjectorImpl.java:1024)
at com.google.inject.internal.MembersInjectorImpl.injectAndNotify(MembersInjectorImpl.java:73)
at com.google.inject.internal.Initializer$InjectableReference.get(Initializer.java:147)
at com.google.inject.internal.Initializer.injectAll(Initializer.java:92)
at com.google.inject.internal.InternalInjectorCreator.injectDynamically(InternalInjectorCreator.java:173)
at com.google.inject.internal.InternalInjectorCreator.build(InternalInjectorCreator.java:109)
at com.google.inject.Guice.createInjector(Guice.java:95)
at org.jclouds.ContextBuilder.buildInjector(ContextBuilder.java:402)
at org.jclouds.ContextBuilder.buildInjector(ContextBuilder.java:326)
at org.jclouds.rest.internal.BaseRestApiExpectTest.createInjector(BaseRestApiExpectTest.java:560)
at org.jclouds.ec2.internal.BaseEC2ExpectTest.setupDefaultRequests(BaseEC2ExpectTest.java:60)
at org.jclouds.ec2.compute.internal.BaseEC2ComputeServiceExpectTest.setupDefaultRequests(BaseEC2ComputeServiceExpectTest.java:76)
at org.jclouds.aws.ec2.compute.internal.BaseAWSEC2ComputeServiceExpectTest.setupDefaultRequests(BaseAWSEC2ComputeServiceExpectTest.java:60)
at sun.reflect.NativeMethodAccessorImpl.invoke0(Native Method)
at sun.reflect.NativeMethodAccessorImpl.invoke(NativeMethodAccessorImpl.java:39)
at sun.reflect.DelegatingMethodAccessorImpl.invoke(DelegatingMethodAccessorImpl.java:25)
at java.lang.reflect.Method.invoke(Method.java:597)
at org.testng.internal.MethodInvocationHelper.invokeMethod(MethodInvocationHelper.java:84)
at org.testng.internal.Invoker.invokeConfigurationMethod(Invoker.java:564)
at org.testng.internal.Invoker.invokeConfigurations(Invoker.java:213)
at org.testng.internal.Invoker.invokeConfigurations(Invoker.java:138)
at org.testng.internal.TestMethodWorker.invokeBeforeClassMethods(TestMethodWorker.java:175)
- locked <0xe613aef0> (a org.testng.TestClass)
at org.testng.internal.TestMethodWorker.run(TestMethodWorker.java:107)
at java.util.concurrent.ThreadPoolExecutor$Worker.runTask(ThreadPoolExecutor.java:895)
at java.util.concurrent.ThreadPoolExecutor$Worker.run(ThreadPoolExecutor.java:918)
at java.lang.Thread.run(Thread.java:662)
"Attach Listener" daemon prio=10 tid=0xace00800 nid=0x56df waiting on condition [0x00000000]
java.lang.Thread.State: RUNNABLE
"com.google.inject.internal.util.$Finalizer" daemon prio=10 tid=0xac494000 nid=0x5673 in Object.wait() [0xae47d000]
java.lang.Thread.State: WAITING (on object monitor)
at java.lang.Object.wait(Native Method)
- waiting on <0xb3cce8f8> (a java.lang.ref.ReferenceQueue$Lock)
at java.lang.ref.ReferenceQueue.remove(ReferenceQueue.java:118)
- locked <0xb3cce8f8> (a java.lang.ref.ReferenceQueue$Lock)
at java.lang.ref.ReferenceQueue.remove(ReferenceQueue.java:134)
at com.google.inject.internal.util.$Finalizer.run(Finalizer.java:114)
"Low Memory Detector" daemon prio=10 tid=0xad659c00 nid=0x5671 runnable [0x00000000]
java.lang.Thread.State: RUNNABLE
"C2 CompilerThread1" daemon prio=10 tid=0xad658000 nid=0x5670 runnable [0x00000000]
java.lang.Thread.State: RUNNABLE
"C2 CompilerThread0" daemon prio=10 tid=0xad656000 nid=0x566f runnable [0x00000000]
java.lang.Thread.State: RUNNABLE
"Signal Dispatcher" daemon prio=10 tid=0xad654800 nid=0x566e runnable [0x00000000]
java.lang.Thread.State: RUNNABLE
"Finalizer" daemon prio=10 tid=0xad646400 nid=0x566d in Object.wait() [0xaec7d000]
java.lang.Thread.State: WAITING (on object monitor)
at java.lang.Object.wait(Native Method)
- waiting on <0xb3d47ca8> (a java.lang.ref.ReferenceQueue$Lock)
at java.lang.ref.ReferenceQueue.remove(ReferenceQueue.java:118)
- locked <0xb3d47ca8> (a java.lang.ref.ReferenceQueue$Lock)
at java.lang.ref.ReferenceQueue.remove(ReferenceQueue.java:134)
at java.lang.ref.Finalizer$FinalizerThread.run(Finalizer.java:171)
"Reference Handler" daemon prio=10 tid=0xad644c00 nid=0x566c in Object.wait() [0xaee7d000]
java.lang.Thread.State: WAITING (on object monitor)
at java.lang.Object.wait(Native Method)
- waiting on <0xb3d47c80> (a java.lang.ref.Reference$Lock)
at java.lang.Object.wait(Object.java:485)
at java.lang.ref.Reference$ReferenceHandler.run(Reference.java:116)
- locked <0xb3d47c80> (a java.lang.ref.Reference$Lock)
"main" prio=10 tid=0xf6705400 nid=0x565d waiting on condition [0xf68f8000]
java.lang.Thread.State: TIMED_WAITING (parking)
at sun.misc.Unsafe.park(Native Method)
- parking to wait for <0xde276b38> (a java.util.concurrent.locks.AbstractQueuedSynchronizer$ConditionObject)
at java.util.concurrent.locks.LockSupport.parkNanos(LockSupport.java:196)
at java.util.concurrent.locks.AbstractQueuedSynchronizer$ConditionObject.awaitNanos(AbstractQueuedSynchronizer.java:2025)
at java.util.concurrent.ThreadPoolExecutor.awaitTermination(ThreadPoolExecutor.java:1261)
at org.testng.TestRunner.privateRun(TestRunner.java:746)
at org.testng.TestRunner.run(TestRunner.java:617)
at org.testng.SuiteRunner.runTest(SuiteRunner.java:348)
at org.testng.SuiteRunner.runSequentially(SuiteRunner.java:343)
at org.testng.SuiteRunner.privateRun(SuiteRunner.java:305)
at org.testng.SuiteRunner.run(SuiteRunner.java:254)
at org.testng.SuiteRunnerWorker.runSuite(SuiteRunnerWorker.java:52)
at org.testng.SuiteRunnerWorker.run(SuiteRunnerWorker.java:86)
at org.testng.TestNG.runSuitesSequentially(TestNG.java:1224)
at org.testng.TestNG.runSuitesLocally(TestNG.java:1149)
at org.testng.TestNG.run(TestNG.java:1057)
at org.apache.maven.surefire.testng.TestNGExecutor.run(TestNGExecutor.java:115)
at org.apache.maven.surefire.testng.TestNGDirectoryTestSuite.executeMulti(TestNGDirectoryTestSuite.java:204)
at org.apache.maven.surefire.testng.TestNGDirectoryTestSuite.execute(TestNGDirectoryTestSuite.java:107)
at org.apache.maven.surefire.testng.TestNGProvider.invoke(TestNGProvider.java:112)
at org.apache.maven.surefire.booter.ForkedBooter.invokeProviderInSameClassLoader(ForkedBooter.java:200)
at org.apache.maven.surefire.booter.ForkedBooter.runSuitesInProcess(ForkedBooter.java:153)
at org.apache.maven.surefire.booter.ForkedBooter.main(ForkedBooter.java:103)
"VM Thread" prio=10 tid=0xad641000 nid=0x566b runnable
"GC task thread#0 (ParallelGC)" prio=10 tid=0xf670cc00 nid=0x565e runnable
"GC task thread#1 (ParallelGC)" prio=10 tid=0xf670e000 nid=0x565f runnable
"GC task thread#2 (ParallelGC)" prio=10 tid=0xf670f800 nid=0x5660 runnable
"GC task thread#3 (ParallelGC)" prio=10 tid=0xf6710c00 nid=0x5661 runnable
"GC task thread#4 (ParallelGC)" prio=10 tid=0xf6712400 nid=0x5662 runnable
"GC task thread#5 (ParallelGC)" prio=10 tid=0xf6713800 nid=0x5663 runnable
"GC task thread#6 (ParallelGC)" prio=10 tid=0xf6715000 nid=0x5664 runnable
"GC task thread#7 (ParallelGC)" prio=10 tid=0xf6716400 nid=0x5665 runnable
"GC task thread#8 (ParallelGC)" prio=10 tid=0xf6717c00 nid=0x5666 runnable
"GC task thread#9 (ParallelGC)" prio=10 tid=0xf6719000 nid=0x5667 runnable
"GC task thread#10 (ParallelGC)" prio=10 tid=0xf671a800 nid=0x5668 runnable
"GC task thread#11 (ParallelGC)" prio=10 tid=0xf671bc00 nid=0x5669 runnable
"GC task thread#12 (ParallelGC)" prio=10 tid=0xf671d400 nid=0x566a runnable
"VM Periodic Task Thread" prio=10 tid=0xad65bc00 nid=0x5672 waiting on condition
JNI global references: 1456
+ echo '************ END zombies jstack extract'
************ END zombies jstack extract
+ JIRA_COMMENT='
{color:red}-1 core zombie tests{color}. There are 1 zombie test(s): at org.jclouds.aws.ec2.AWSEC2ContextBuilderTest.testConvertImageSyntaxWhenStar(AWSEC2ContextBuilderTest.java:64)
at org.testng.internal.MethodInvocationHelper.invokeMethod(MethodInvocationHelper.java:84)
at org.testng.internal.Invoker.invokeMethod(Invoker.java:714)
at org.testng.internal.Invoker.invokeTestMethod(Invoker.java:901)
at org.testng.internal.Invoker.invokeTestMethods(Invoker.java:1231)
at org.testng.internal.TestMethodWorker.invokeTestMethods(TestMethodWorker.java:127)
at org.testng.internal.TestMethodWorker.run(TestMethodWorker.java:111)
at org.jclouds.aws.ec2.AWSEC2ContextBuilderTest.testConvertImageSyntax(AWSEC2ContextBuilderTest.java:55)
at org.testng.internal.MethodInvocationHelper.invokeMethod(MethodInvocationHelper.java:84)
at org.testng.internal.Invoker.invokeMethod(Invoker.java:714)
at org.testng.internal.Invoker.invokeTestMethod(Invoker.java:901)
at org.testng.internal.Invoker.invokeTestMethods(Invoker.java:1231)
at org.testng.internal.TestMethodWorker.invokeTestMethods(TestMethodWorker.java:127)
at org.testng.internal.TestMethodWorker.run(TestMethodWorker.java:111)
at org.jclouds.aws.ec2.AWSEC2ContextBuilderTest.testBlankAmiOwnersRemovesAmiQuery(AWSEC2ContextBuilderTest.java:72)
at org.testng.internal.MethodInvocationHelper.invokeMethod(MethodInvocationHelper.java:84)
at org.testng.internal.Invoker.invokeMethod(Invoker.java:714)
at org.testng.internal.Invoker.invokeTestMethod(Invoker.java:901)
at org.testng.internal.Invoker.invokeTestMethods(Invoker.java:1231)
at org.testng.internal.TestMethodWorker.invokeTestMethods(TestMethodWorker.java:127)
at org.testng.internal.TestMethodWorker.run(TestMethodWorker.java:111)
at org.jclouds.aws.ec2.AWSEC2ContextBuilderTest.testAssignability(AWSEC2ContextBuilderTest.java:46)
at org.testng.internal.MethodInvocationHelper.invokeMethod(MethodInvocationHelper.java:84)
at org.testng.internal.Invoker.invokeMethod(Invoker.java:714)
at org.testng.internal.Invoker.invokeTestMethod(Invoker.java:901)
at org.testng.internal.Invoker.invokeTestMethods(Invoker.java:1231)
at org.testng.internal.TestMethodWorker.invokeTestMethods(TestMethodWorker.java:127)
at org.testng.internal.TestMethodWorker.run(TestMethodWorker.java:111)
at org.testng.TestRunner.privateRun(TestRunner.java:746)
at org.testng.TestRunner.run(TestRunner.java:617)
at org.testng.SuiteRunner.runTest(SuiteRunner.java:348)
at org.testng.SuiteRunner.runSequentially(SuiteRunner.java:343)
at org.testng.SuiteRunner.privateRun(SuiteRunner.java:305)
at org.testng.SuiteRunner.run(SuiteRunner.java:254)
at org.testng.SuiteRunnerWorker.runSuite(SuiteRunnerWorker.java:52)
at org.testng.SuiteRunnerWorker.run(SuiteRunnerWorker.java:86)
at org.testng.TestNG.runSuitesSequentially(TestNG.java:1224)
at org.testng.TestNG.runSuitesLocally(TestNG.java:1149)
at org.testng.TestNG.run(TestNG.java:1057)
at org.apache.maven.surefire.testng.TestNGExecutor.run(TestNGExecutor.java:115)
at org.apache.maven.surefire.testng.TestNGDirectoryTestSuite.executeMulti(TestNGDirectoryTestSuite.java:204)
at org.apache.maven.surefire.testng.TestNGDirectoryTestSuite.execute(TestNGDirectoryTestSuite.java:107)
at org.apache.maven.surefire.testng.TestNGProvider.invoke(TestNGProvider.java:112)'
+ BAD=1
+ jps
+ grep surefirebooter
+ xargs kill -9
+ cut -d ' ' -f 1
POST BUILD TASK : SUCCESS
END OF POST BUILD TASK : 0
Archiving artifacts
Sending artifact delta relative to HBase-TRUNK #6422
Archived 2157 artifacts
Archive block size is 32768
Received 59 blocks and 431115343 bytes
Compression is 0.4%
Took 3 min 15 sec
Recording test results
[FINDBUGS] Collecting findbugs analysis files...
[FINDBUGS] Finding all files that match the pattern **/findbugs.xml,**/findbugsXml.xml
[FINDBUGS] Parsing 24 files in <https://builds.apache.org/job/HBase-TRUNK/ws/>
[FINDBUGS] Successfully parsed file <https://builds.apache.org/job/HBase-TRUNK/6430/artifact/hbase-annotations/target/findbugs.xml> of module with 0 warnings.
[FINDBUGS] Successfully parsed file <https://builds.apache.org/job/HBase-TRUNK/6430/artifact/hbase-annotations/target/findbugsXml.xml> of module with 0 warnings.
[FINDBUGS] Successfully parsed file <https://builds.apache.org/job/HBase-TRUNK/6430/artifact/hbase-client/target/findbugs.xml> of module with 0 warnings.
[FINDBUGS] Successfully parsed file <https://builds.apache.org/job/HBase-TRUNK/6430/artifact/hbase-client/target/findbugsXml.xml> of module with 8 warnings.
[FINDBUGS] Successfully parsed file <https://builds.apache.org/job/HBase-TRUNK/6430/artifact/hbase-common/target/findbugs.xml> of module with 0 warnings.
[FINDBUGS] Successfully parsed file <https://builds.apache.org/job/HBase-TRUNK/6430/artifact/hbase-common/target/findbugsXml.xml> of module with 1 warnings.
[FINDBUGS] Successfully parsed file <https://builds.apache.org/job/HBase-TRUNK/6430/artifact/hbase-examples/target/findbugs.xml> of module with 0 warnings.
[FINDBUGS] Successfully parsed file <https://builds.apache.org/job/HBase-TRUNK/6430/artifact/hbase-examples/target/findbugsXml.xml> of module with 0 warnings.
[FINDBUGS] Successfully parsed file <https://builds.apache.org/job/HBase-TRUNK/6430/artifact/hbase-hadoop-compat/target/findbugs.xml> of module with 0 warnings.
[FINDBUGS] Successfully parsed file <https://builds.apache.org/job/HBase-TRUNK/6430/artifact/hbase-hadoop-compat/target/findbugsXml.xml> of module with 0 warnings.
[FINDBUGS] Successfully parsed file <https://builds.apache.org/job/HBase-TRUNK/6430/artifact/hbase-hadoop2-compat/target/findbugs.xml> of module with 0 warnings.
[FINDBUGS] Successfully parsed file <https://builds.apache.org/job/HBase-TRUNK/6430/artifact/hbase-hadoop2-compat/target/findbugsXml.xml> of module with 0 warnings.
[FINDBUGS] Successfully parsed file <https://builds.apache.org/job/HBase-TRUNK/6430/artifact/hbase-prefix-tree/target/findbugs.xml> of module with 0 warnings.
[FINDBUGS] Successfully parsed file <https://builds.apache.org/job/HBase-TRUNK/6430/artifact/hbase-prefix-tree/target/findbugsXml.xml> of module with 0 warnings.
[FINDBUGS] Successfully parsed file <https://builds.apache.org/job/HBase-TRUNK/6430/artifact/hbase-procedure/target/findbugs.xml> of module with 0 warnings.
[FINDBUGS] Successfully parsed file <https://builds.apache.org/job/HBase-TRUNK/6430/artifact/hbase-procedure/target/findbugsXml.xml> of module with 1 warnings.
[FINDBUGS] Successfully parsed file <https://builds.apache.org/job/HBase-TRUNK/6430/artifact/hbase-protocol/target/findbugs.xml> of module with 0 warnings.
[FINDBUGS] Successfully parsed file <https://builds.apache.org/job/HBase-TRUNK/6430/artifact/hbase-protocol/target/findbugsXml.xml> of module with 0 warnings.
[FINDBUGS] Successfully parsed file <https://builds.apache.org/job/HBase-TRUNK/6430/artifact/hbase-rest/target/findbugs.xml> of module with 0 warnings.
[FINDBUGS] Successfully parsed file <https://builds.apache.org/job/HBase-TRUNK/6430/artifact/hbase-rest/target/findbugsXml.xml> of module with 2 warnings.
[FINDBUGS] Successfully parsed file <https://builds.apache.org/job/HBase-TRUNK/6430/artifact/hbase-server/target/findbugs.xml> of module with 0 warnings.
[FINDBUGS] Successfully parsed file <https://builds.apache.org/job/HBase-TRUNK/6430/artifact/hbase-server/target/findbugsXml.xml> of module with 61 warnings.
[FINDBUGS] Successfully parsed file <https://builds.apache.org/job/HBase-TRUNK/6430/artifact/hbase-thrift/target/findbugs.xml> of module with 0 warnings.
[FINDBUGS] Successfully parsed file <https://builds.apache.org/job/HBase-TRUNK/6430/artifact/hbase-thrift/target/findbugsXml.xml> of module with 0 warnings.
[FINDBUGS] Computing warning deltas based on reference build #6422
[CHECKSTYLE] Collecting checkstyle analysis files...
[CHECKSTYLE] Finding all files that match the pattern **/checkstyle-result.xml
[CHECKSTYLE] Parsing 21 files in <https://builds.apache.org/job/HBase-TRUNK/ws/>
[CHECKSTYLE] Successfully parsed file <https://builds.apache.org/job/HBase-TRUNK/6430/artifact/hbase-annotations/target/checkstyle-result.xml> of module with 0 warnings.
[CHECKSTYLE] Successfully parsed file <https://builds.apache.org/job/HBase-TRUNK/6430/artifact/hbase-assembly/target/checkstyle-result.xml> of module with 0 warnings.
[CHECKSTYLE] Successfully parsed file <https://builds.apache.org/job/HBase-TRUNK/6430/artifact/hbase-checkstyle/target/checkstyle-result.xml> of module with 0 warnings.
[CHECKSTYLE] Successfully parsed file <https://builds.apache.org/job/HBase-TRUNK/6430/artifact/hbase-client/target/checkstyle-result.xml> of module with 212 warnings.
[CHECKSTYLE] Successfully parsed file <https://builds.apache.org/job/HBase-TRUNK/6430/artifact/hbase-common/target/checkstyle-result.xml> of module with 125 warnings.
[CHECKSTYLE] Successfully parsed file <https://builds.apache.org/job/HBase-TRUNK/6430/artifact/hbase-examples/target/checkstyle-result.xml> of module with 30 warnings.
[CHECKSTYLE] Successfully parsed file <https://builds.apache.org/job/HBase-TRUNK/6430/artifact/hbase-hadoop-compat/target/checkstyle-result.xml> of module with 2 warnings.
[CHECKSTYLE] Successfully parsed file <https://builds.apache.org/job/HBase-TRUNK/6430/artifact/hbase-hadoop2-compat/target/checkstyle-result.xml> of module with 47 warnings.
[CHECKSTYLE] Successfully parsed file <https://builds.apache.org/job/HBase-TRUNK/6430/artifact/hbase-it/target/checkstyle-result.xml> of module with 0 warnings.
[CHECKSTYLE] Successfully parsed file <https://builds.apache.org/job/HBase-TRUNK/6430/artifact/hbase-prefix-tree/target/checkstyle-result.xml> of module with 25 warnings.
[CHECKSTYLE] Successfully parsed file <https://builds.apache.org/job/HBase-TRUNK/6430/artifact/hbase-procedure/target/checkstyle-result.xml> of module with 0 warnings.
[CHECKSTYLE] Successfully parsed file <https://builds.apache.org/job/HBase-TRUNK/6430/artifact/hbase-protocol/target/checkstyle-result.xml> of module with 3 warnings.
[CHECKSTYLE] Successfully parsed file <https://builds.apache.org/job/HBase-TRUNK/6430/artifact/hbase-rest/target/checkstyle-result.xml> of module with 42 warnings.
[CHECKSTYLE] Successfully parsed file <https://builds.apache.org/job/HBase-TRUNK/6430/artifact/hbase-server/target/checkstyle-result.xml> of module with 1379 warnings.
[CHECKSTYLE] Successfully parsed file <https://builds.apache.org/job/HBase-TRUNK/6430/artifact/hbase-shaded/hbase-shaded-client/target/checkstyle-result.xml> of module with 0 warnings.
[CHECKSTYLE] Successfully parsed file <https://builds.apache.org/job/HBase-TRUNK/6430/artifact/hbase-shaded/hbase-shaded-server/target/checkstyle-result.xml> of module with 0 warnings.
[CHECKSTYLE] Successfully parsed file <https://builds.apache.org/job/HBase-TRUNK/6430/artifact/hbase-shaded/target/checkstyle-result.xml> of module with 0 warnings.
[CHECKSTYLE] Successfully parsed file <https://builds.apache.org/job/HBase-TRUNK/6430/artifact/hbase-shell/target/checkstyle-result.xml> of module with 0 warnings.
[CHECKSTYLE] Successfully parsed file <https://builds.apache.org/job/HBase-TRUNK/6430/artifact/hbase-testing-util/target/checkstyle-result.xml> of module with 0 warnings.
[CHECKSTYLE] Successfully parsed file <https://builds.apache.org/job/HBase-TRUNK/6430/artifact/hbase-thrift/target/checkstyle-result.xml> of module with 32 warnings.
[CHECKSTYLE] Successfully parsed file <https://builds.apache.org/job/HBase-TRUNK/6430/artifact/target/checkstyle-result.xml> of module with 0 warnings.
[CHECKSTYLE] Computing warning deltas based on reference build #6422
Updating HBASE-13417
Build failed in Jenkins: HBase-TRUNK #6429
Posted by Apache Jenkins Server <je...@builds.apache.org>.
See <https://builds.apache.org/job/HBase-TRUNK/6429/changes>
Changes:
[matteo.bertozzi] HBASE-13578 Remove Arrays.asList().subList() from FSHLog.offer()
------------------------------------------
[...truncated 4809 lines...]
Tests run: 6, Failures: 0, Errors: 0, Skipped: 0, Time elapsed: 5.929 sec - in org.apache.hadoop.hbase.regionserver.TestMinorCompaction
Running org.apache.hadoop.hbase.regionserver.TestRegionServerMetrics
Tests run: 1, Failures: 0, Errors: 0, Skipped: 0, Time elapsed: 35.49 sec - in org.apache.hadoop.hbase.regionserver.TestJoinedScanners
Running org.apache.hadoop.hbase.regionserver.TestTags
Running org.apache.hadoop.hbase.regionserver.TestScannerHeartbeatMessages
Tests run: 10, Failures: 0, Errors: 0, Skipped: 0, Time elapsed: 27.193 sec - in org.apache.hadoop.hbase.regionserver.TestRegionServerMetrics
Running org.apache.hadoop.hbase.regionserver.TestHRegionOnCluster
Tests run: 1, Failures: 0, Errors: 0, Skipped: 0, Time elapsed: 17.158 sec - in org.apache.hadoop.hbase.regionserver.TestHRegionOnCluster
Tests run: 1, Failures: 0, Errors: 0, Skipped: 0, Time elapsed: 26.515 sec - in org.apache.hadoop.hbase.regionserver.TestScannerHeartbeatMessages
Tests run: 4, Failures: 0, Errors: 0, Skipped: 0, Time elapsed: 51.951 sec - in org.apache.hadoop.hbase.regionserver.TestTags
Running org.apache.hadoop.hbase.regionserver.TestRowTooBig
Running org.apache.hadoop.hbase.regionserver.TestPerColumnFamilyFlush
Running org.apache.hadoop.hbase.regionserver.TestSCVFWithMiniCluster
Tests run: 5, Failures: 0, Errors: 0, Skipped: 0, Time elapsed: 0.341 sec - in org.apache.hadoop.hbase.regionserver.TestSCVFWithMiniCluster
Running org.apache.hadoop.hbase.regionserver.TestCompactionState
Tests run: 2, Failures: 0, Errors: 0, Skipped: 0, Time elapsed: 28.227 sec - in org.apache.hadoop.hbase.regionserver.TestRowTooBig
Running org.apache.hadoop.hbase.regionserver.TestSeekOptimizations
Tests run: 6, Failures: 0, Errors: 0, Skipped: 0, Time elapsed: 7.896 sec - in org.apache.hadoop.hbase.regionserver.TestSeekOptimizations
Running org.apache.hadoop.hbase.regionserver.TestRegionReplicas
Tests run: 5, Failures: 0, Errors: 0, Skipped: 0, Time elapsed: 60.022 sec - in org.apache.hadoop.hbase.regionserver.TestCompactionState
Tests run: 12, Failures: 0, Errors: 0, Skipped: 0, Time elapsed: 245.809 sec - in org.apache.hadoop.hbase.regionserver.TestRegionReplicaFailover
Running org.apache.hadoop.hbase.regionserver.TestStoreScanner
Running org.apache.hadoop.hbase.regionserver.TestCompactionWithCoprocessor
Tests run: 16, Failures: 0, Errors: 0, Skipped: 0, Time elapsed: 0.736 sec - in org.apache.hadoop.hbase.regionserver.TestStoreScanner
Running org.apache.hadoop.hbase.regionserver.TestHRegionReplayEvents
Tests run: 26, Failures: 0, Errors: 0, Skipped: 0, Time elapsed: 18.133 sec - in org.apache.hadoop.hbase.regionserver.TestHRegionReplayEvents
Running org.apache.hadoop.hbase.regionserver.TestCacheOnWriteInSchema
Tests run: 3, Failures: 0, Errors: 0, Skipped: 0, Time elapsed: 4.028 sec - in org.apache.hadoop.hbase.regionserver.TestCacheOnWriteInSchema
Tests run: 6, Failures: 0, Errors: 0, Skipped: 0, Time elapsed: 117.809 sec - in org.apache.hadoop.hbase.regionserver.TestPerColumnFamilyFlush
Tests run: 6, Failures: 0, Errors: 0, Skipped: 0, Time elapsed: 552.951 sec - in org.apache.hadoop.hbase.coprocessor.TestCoprocessorEndpoint
Running org.apache.hadoop.hbase.regionserver.wal.TestReadOldRootAndMetaEdits
Tests run: 1, Failures: 0, Errors: 0, Skipped: 0, Time elapsed: 0.491 sec - in org.apache.hadoop.hbase.regionserver.wal.TestReadOldRootAndMetaEdits
Tests run: 5, Failures: 0, Errors: 0, Skipped: 0, Time elapsed: 37.763 sec - in org.apache.hadoop.hbase.regionserver.TestCompactionWithCoprocessor
Running org.apache.hadoop.hbase.regionserver.wal.TestWALReplayCompressed
Running org.apache.hadoop.hbase.regionserver.wal.TestFSHLog
Tests run: 6, Failures: 0, Errors: 0, Skipped: 0, Time elapsed: 5.513 sec - in org.apache.hadoop.hbase.regionserver.wal.TestFSHLog
Running org.apache.hadoop.hbase.regionserver.wal.TestLogRollAbort
Running org.apache.hadoop.hbase.regionserver.wal.TestSecureWALReplay
Running org.apache.hadoop.hbase.regionserver.wal.TestWALReplay
Tests run: 2, Failures: 0, Errors: 0, Skipped: 0, Time elapsed: 25.282 sec - in org.apache.hadoop.hbase.regionserver.wal.TestLogRollAbort
Running org.apache.hadoop.hbase.regionserver.wal.TestLogRolling
Tests run: 9, Failures: 0, Errors: 0, Skipped: 0, Time elapsed: 42.508 sec - in org.apache.hadoop.hbase.regionserver.wal.TestWALReplayCompressed
Running org.apache.hadoop.hbase.regionserver.wal.TestProtobufLog
Tests run: 9, Failures: 0, Errors: 0, Skipped: 0, Time elapsed: 40.38 sec - in org.apache.hadoop.hbase.regionserver.wal.TestWALReplay
Tests run: 1, Failures: 0, Errors: 0, Skipped: 0, Time elapsed: 1.811 sec - in org.apache.hadoop.hbase.regionserver.wal.TestProtobufLog
Tests run: 9, Failures: 0, Errors: 0, Skipped: 0, Time elapsed: 44.233 sec - in org.apache.hadoop.hbase.regionserver.wal.TestSecureWALReplay
Running org.apache.hadoop.hbase.regionserver.wal.TestDurability
Tests run: 3, Failures: 0, Errors: 0, Skipped: 0, Time elapsed: 3.929 sec - in org.apache.hadoop.hbase.regionserver.wal.TestDurability
Running org.apache.hadoop.hbase.regionserver.wal.TestLogRollPeriod
Running org.apache.hadoop.hbase.regionserver.TestScannerWithBulkload
Running org.apache.hadoop.hbase.regionserver.TestEncryptionRandomKeying
Tests run: 1, Failures: 0, Errors: 0, Skipped: 0, Time elapsed: 1.448 sec - in org.apache.hadoop.hbase.regionserver.TestEncryptionRandomKeying
Tests run: 3, Failures: 0, Errors: 0, Skipped: 0, Time elapsed: 14.86 sec - in org.apache.hadoop.hbase.regionserver.TestScannerWithBulkload
Running org.apache.hadoop.hbase.regionserver.TestDefaultMemStore
Running org.apache.hadoop.hbase.regionserver.TestMasterAddressTracker
Tests run: 5, Failures: 0, Errors: 0, Skipped: 0, Time elapsed: 1.288 sec - in org.apache.hadoop.hbase.regionserver.TestMasterAddressTracker
Running org.apache.hadoop.hbase.regionserver.TestSplitTransactionOnCluster
Tests run: 7, Failures: 0, Errors: 0, Skipped: 0, Time elapsed: 197.194 sec - in org.apache.hadoop.hbase.regionserver.TestRegionReplicas
Tests run: 24, Failures: 0, Errors: 0, Skipped: 0, Time elapsed: 31.124 sec - in org.apache.hadoop.hbase.regionserver.TestDefaultMemStore
Running org.apache.hadoop.hbase.regionserver.TestParallelPut
Tests run: 2, Failures: 0, Errors: 0, Skipped: 0, Time elapsed: 59.583 sec - in org.apache.hadoop.hbase.regionserver.wal.TestLogRollPeriod
Running org.apache.hadoop.hbase.regionserver.TestRegionServerOnlineConfigChange
Running org.apache.hadoop.hbase.regionserver.TestCompaction
Tests run: 2, Failures: 0, Errors: 0, Skipped: 0, Time elapsed: 2.521 sec - in org.apache.hadoop.hbase.regionserver.TestRegionServerOnlineConfigChange
Running org.apache.hadoop.hbase.regionserver.TestRegionMergeTransactionOnCluster
Tests run: 5, Failures: 0, Errors: 0, Skipped: 0, Time elapsed: 35.365 sec - in org.apache.hadoop.hbase.regionserver.TestCompaction
Running org.apache.hadoop.hbase.regionserver.TestRecoveredEdits
Tests run: 5, Failures: 0, Errors: 0, Skipped: 0, Time elapsed: 31.186 sec - in org.apache.hadoop.hbase.regionserver.TestRegionMergeTransactionOnCluster
Running org.apache.hadoop.hbase.regionserver.TestGetClosestAtOrBefore
Tests run: 15, Failures: 0, Errors: 0, Skipped: 0, Time elapsed: 85.423 sec - in org.apache.hadoop.hbase.regionserver.TestSplitTransactionOnCluster
Tests run: 3, Failures: 0, Errors: 0, Skipped: 0, Time elapsed: 2.679 sec - in org.apache.hadoop.hbase.regionserver.TestGetClosestAtOrBefore
Running org.apache.hadoop.hbase.regionserver.TestRegionServerReportForDuty
Running org.apache.hadoop.hbase.regionserver.TestCompoundBloomFilter
Tests run: 1, Failures: 0, Errors: 0, Skipped: 0, Time elapsed: 17.224 sec - in org.apache.hadoop.hbase.regionserver.TestRecoveredEdits
Tests run: 2, Failures: 0, Errors: 0, Skipped: 0, Time elapsed: 76.782 sec - in org.apache.hadoop.hbase.regionserver.TestParallelPut
Running org.apache.hadoop.hbase.regionserver.TestHRegion
Running org.apache.hadoop.hbase.regionserver.compactions.TestCompactionWithThroughputController
Tests run: 1, Failures: 0, Errors: 0, Skipped: 0, Time elapsed: 20.925 sec - in org.apache.hadoop.hbase.regionserver.TestRegionServerReportForDuty
Running org.apache.hadoop.hbase.regionserver.TestAtomicOperation
Tests run: 3, Failures: 0, Errors: 0, Skipped: 0, Time elapsed: 25.104 sec - in org.apache.hadoop.hbase.regionserver.TestCompoundBloomFilter
Running org.apache.hadoop.hbase.regionserver.TestFSErrorsExposed
Tests run: 5, Failures: 0, Errors: 0, Skipped: 0, Time elapsed: 220.399 sec - in org.apache.hadoop.hbase.regionserver.wal.TestLogRolling
Running org.apache.hadoop.hbase.regionserver.TestRSKilledWhenInitializing
Tests run: 3, Failures: 0, Errors: 0, Skipped: 0, Time elapsed: 64.536 sec - in org.apache.hadoop.hbase.regionserver.compactions.TestCompactionWithThroughputController
Running org.apache.hadoop.hbase.regionserver.TestMultiColumnScanner
Tests run: 3, Failures: 0, Errors: 0, Skipped: 0, Time elapsed: 54.904 sec - in org.apache.hadoop.hbase.regionserver.TestFSErrorsExposed
Running org.apache.hadoop.hbase.regionserver.TestStore
Tests run: 1, Failures: 0, Errors: 0, Skipped: 0, Time elapsed: 28.655 sec - in org.apache.hadoop.hbase.regionserver.TestRSKilledWhenInitializing
Tests run: 18, Failures: 0, Errors: 0, Skipped: 0, Time elapsed: 16.025 sec - in org.apache.hadoop.hbase.regionserver.TestStore
Running org.apache.hadoop.hbase.TestMetaTableLocator
Tests run: 7, Failures: 0, Errors: 0, Skipped: 0, Time elapsed: 4.641 sec - in org.apache.hadoop.hbase.TestMetaTableLocator
Running org.apache.hadoop.hbase.namespace.TestNamespaceAuditor
Tests run: 12, Failures: 0, Errors: 0, Skipped: 0, Time elapsed: 111.761 sec - in org.apache.hadoop.hbase.regionserver.TestMultiColumnScanner
Tests run: 8, Failures: 0, Errors: 0, Skipped: 0, Time elapsed: 69.887 sec - in org.apache.hadoop.hbase.namespace.TestNamespaceAuditor
Tests run: 6, Failures: 0, Errors: 0, Skipped: 0, Time elapsed: 266.919 sec - in org.apache.hadoop.hbase.regionserver.TestAtomicOperation
Tests run: 92, Failures: 0, Errors: 0, Skipped: 0, Time elapsed: 322.911 sec - in org.apache.hadoop.hbase.regionserver.TestHRegion
Results :
Tests in error:
TestJMXListener.testStart:70 » IO Failed to retrieve RMIServer stub: javax.nam...
Tests run: 2445, Failures: 0, Errors: 1, Skipped: 17
[INFO] ------------------------------------------------------------------------
[INFO] Reactor Summary:
[INFO]
[INFO] HBase ............................................. SUCCESS [ 2.991 s]
[INFO] HBase - Checkstyle ................................ SUCCESS [ 0.720 s]
[INFO] HBase - Annotations ............................... SUCCESS [ 0.240 s]
[INFO] HBase - Protocol .................................. SUCCESS [ 2.718 s]
[INFO] HBase - Common .................................... SUCCESS [03:25 min]
[INFO] HBase - Procedure ................................. SUCCESS [01:28 min]
[INFO] HBase - Client .................................... SUCCESS [01:48 min]
[INFO] HBase - Hadoop Compatibility ...................... SUCCESS [ 11.441 s]
[INFO] HBase - Hadoop Two Compatibility .................. SUCCESS [ 14.545 s]
[INFO] HBase - Prefix Tree ............................... SUCCESS [ 19.519 s]
[INFO] HBase - Server .................................... FAILURE [ 01:46 h]
[INFO] HBase - Testing Util .............................. SKIPPED
[INFO] HBase - Thrift .................................... SKIPPED
[INFO] HBase - Shell ..................................... SKIPPED
[INFO] HBase - Integration Tests ......................... SKIPPED
[INFO] HBase - Examples .................................. SKIPPED
[INFO] HBase - Rest ...................................... SKIPPED
[INFO] HBase - Assembly .................................. SKIPPED
[INFO] HBase - Shaded .................................... SKIPPED
[INFO] HBase - Shaded - Client ........................... SKIPPED
[INFO] HBase - Shaded - Server ........................... SKIPPED
[INFO] ------------------------------------------------------------------------
[INFO] BUILD FAILURE
[INFO] ------------------------------------------------------------------------
[INFO] Total time: 01:54 h
[INFO] Finished at: 2015-04-28T23:24:53+00:00
[INFO] Final Memory: 61M/596M
[INFO] ------------------------------------------------------------------------
[ERROR] Failed to execute goal org.apache.maven.plugins:maven-surefire-plugin:2.18:test (secondPartTestsExecution) on project hbase-server: There are test failures.
[ERROR]
[ERROR] Please refer to <https://builds.apache.org/job/HBase-TRUNK/ws/hbase-server/target/surefire-reports> for the individual test results.
[ERROR] -> [Help 1]
[ERROR]
[ERROR] To see the full stack trace of the errors, re-run Maven with the -e switch.
[ERROR] Re-run Maven using the -X switch to enable full debug logging.
[ERROR]
[ERROR] For more information about the errors and possible solutions, please read the following articles:
[ERROR] [Help 1] http://cwiki.apache.org/confluence/display/MAVEN/MojoFailureException
[ERROR]
[ERROR] After correcting the problems, you can resume the build with the command
[ERROR] mvn <goals> -rf :hbase-server
Build step 'Invoke top-level Maven targets' marked build as failure
Performing Post build task...
Match found for :.* : True
Logical operation result is TRUE
Running script : ZOMBIE_TESTS_COUNT=`jps | grep surefirebooter | wc -l`
if [[ $ZOMBIE_TESTS_COUNT != 0 ]] ; then
#It seems sometimes the tests are not dying immediately. Let's give them 10s
echo "Suspicious java process found - waiting 10s to see if there are just slow to stop"
sleep 10
ZOMBIE_TESTS_COUNT=`jps | grep surefirebooter | wc -l`
if [[ $ZOMBIE_TESTS_COUNT != 0 ]] ; then
echo "There are $ZOMBIE_TESTS_COUNT zombie tests, they should have been killed by surefire but survived"
echo "************ BEGIN zombies jstack extract"
ZB_STACK=`jps | grep surefirebooter | cut -d ' ' -f 1 | xargs -n 1 jstack | grep ".test" | grep "\.java"`
jps | grep surefirebooter | cut -d ' ' -f 1 | xargs -n 1 jstack
echo "************ END zombies jstack extract"
JIRA_COMMENT="$JIRA_COMMENT
{color:red}-1 core zombie tests{color}. There are ${ZOMBIE_TESTS_COUNT} zombie test(s): ${ZB_STACK}"
BAD=1
jps | grep surefirebooter | cut -d ' ' -f 1 | xargs kill -9
else
echo "We're ok: there is no zombie test, but some tests took some time to stop"
fi
else
echo "We're ok: there is no zombie test"
fi
[HBase-TRUNK] $ /bin/bash -xe /tmp/hudson1957984086033254955.sh
++ jps
++ grep surefirebooter
++ wc -l
+ ZOMBIE_TESTS_COUNT=0
+ [[ 0 != 0 ]]
+ echo 'We'\''re ok: there is no zombie test'
We're ok: there is no zombie test
POST BUILD TASK : SUCCESS
END OF POST BUILD TASK : 0
Archiving artifacts
Sending artifact delta relative to HBase-TRUNK #6422
Archived 2157 artifacts
Archive block size is 32768
Received 60 blocks and 433095134 bytes
Compression is 0.5%
Took 2 min 41 sec
Recording test results
[FINDBUGS] Collecting findbugs analysis files...
[FINDBUGS] Finding all files that match the pattern **/findbugs.xml,**/findbugsXml.xml
[FINDBUGS] Parsing 24 files in <https://builds.apache.org/job/HBase-TRUNK/ws/>
[FINDBUGS] Successfully parsed file <https://builds.apache.org/job/HBase-TRUNK/6429/artifact/hbase-annotations/target/findbugs.xml> of module with 0 warnings.
[FINDBUGS] Successfully parsed file <https://builds.apache.org/job/HBase-TRUNK/6429/artifact/hbase-annotations/target/findbugsXml.xml> of module with 0 warnings.
[FINDBUGS] Successfully parsed file <https://builds.apache.org/job/HBase-TRUNK/6429/artifact/hbase-client/target/findbugs.xml> of module with 0 warnings.
[FINDBUGS] Successfully parsed file <https://builds.apache.org/job/HBase-TRUNK/6429/artifact/hbase-client/target/findbugsXml.xml> of module with 8 warnings.
[FINDBUGS] Successfully parsed file <https://builds.apache.org/job/HBase-TRUNK/6429/artifact/hbase-common/target/findbugs.xml> of module with 0 warnings.
[FINDBUGS] Successfully parsed file <https://builds.apache.org/job/HBase-TRUNK/6429/artifact/hbase-common/target/findbugsXml.xml> of module with 1 warnings.
[FINDBUGS] Successfully parsed file <https://builds.apache.org/job/HBase-TRUNK/6429/artifact/hbase-examples/target/findbugs.xml> of module with 0 warnings.
[FINDBUGS] Successfully parsed file <https://builds.apache.org/job/HBase-TRUNK/6429/artifact/hbase-examples/target/findbugsXml.xml> of module with 0 warnings.
[FINDBUGS] Successfully parsed file <https://builds.apache.org/job/HBase-TRUNK/6429/artifact/hbase-hadoop-compat/target/findbugs.xml> of module with 0 warnings.
[FINDBUGS] Successfully parsed file <https://builds.apache.org/job/HBase-TRUNK/6429/artifact/hbase-hadoop-compat/target/findbugsXml.xml> of module with 0 warnings.
[FINDBUGS] Successfully parsed file <https://builds.apache.org/job/HBase-TRUNK/6429/artifact/hbase-hadoop2-compat/target/findbugs.xml> of module with 0 warnings.
[FINDBUGS] Successfully parsed file <https://builds.apache.org/job/HBase-TRUNK/6429/artifact/hbase-hadoop2-compat/target/findbugsXml.xml> of module with 0 warnings.
[FINDBUGS] Successfully parsed file <https://builds.apache.org/job/HBase-TRUNK/6429/artifact/hbase-prefix-tree/target/findbugs.xml> of module with 0 warnings.
[FINDBUGS] Successfully parsed file <https://builds.apache.org/job/HBase-TRUNK/6429/artifact/hbase-prefix-tree/target/findbugsXml.xml> of module with 0 warnings.
[FINDBUGS] Successfully parsed file <https://builds.apache.org/job/HBase-TRUNK/6429/artifact/hbase-procedure/target/findbugs.xml> of module with 0 warnings.
[FINDBUGS] Successfully parsed file <https://builds.apache.org/job/HBase-TRUNK/6429/artifact/hbase-procedure/target/findbugsXml.xml> of module with 1 warnings.
[FINDBUGS] Successfully parsed file <https://builds.apache.org/job/HBase-TRUNK/6429/artifact/hbase-protocol/target/findbugs.xml> of module with 0 warnings.
[FINDBUGS] Successfully parsed file <https://builds.apache.org/job/HBase-TRUNK/6429/artifact/hbase-protocol/target/findbugsXml.xml> of module with 0 warnings.
[FINDBUGS] Successfully parsed file <https://builds.apache.org/job/HBase-TRUNK/6429/artifact/hbase-rest/target/findbugs.xml> of module with 0 warnings.
[FINDBUGS] Successfully parsed file <https://builds.apache.org/job/HBase-TRUNK/6429/artifact/hbase-rest/target/findbugsXml.xml> of module with 2 warnings.
[FINDBUGS] Successfully parsed file <https://builds.apache.org/job/HBase-TRUNK/6429/artifact/hbase-server/target/findbugs.xml> of module with 0 warnings.
[FINDBUGS] Successfully parsed file <https://builds.apache.org/job/HBase-TRUNK/6429/artifact/hbase-server/target/findbugsXml.xml> of module with 61 warnings.
[FINDBUGS] Successfully parsed file <https://builds.apache.org/job/HBase-TRUNK/6429/artifact/hbase-thrift/target/findbugs.xml> of module with 0 warnings.
[FINDBUGS] Successfully parsed file <https://builds.apache.org/job/HBase-TRUNK/6429/artifact/hbase-thrift/target/findbugsXml.xml> of module with 0 warnings.
[FINDBUGS] Computing warning deltas based on reference build #6422
[CHECKSTYLE] Collecting checkstyle analysis files...
[CHECKSTYLE] Finding all files that match the pattern **/checkstyle-result.xml
[CHECKSTYLE] Parsing 21 files in <https://builds.apache.org/job/HBase-TRUNK/ws/>
[CHECKSTYLE] Successfully parsed file <https://builds.apache.org/job/HBase-TRUNK/6429/artifact/hbase-annotations/target/checkstyle-result.xml> of module with 0 warnings.
[CHECKSTYLE] Successfully parsed file <https://builds.apache.org/job/HBase-TRUNK/6429/artifact/hbase-assembly/target/checkstyle-result.xml> of module with 0 warnings.
[CHECKSTYLE] Successfully parsed file <https://builds.apache.org/job/HBase-TRUNK/6429/artifact/hbase-checkstyle/target/checkstyle-result.xml> of module with 0 warnings.
[CHECKSTYLE] Successfully parsed file <https://builds.apache.org/job/HBase-TRUNK/6429/artifact/hbase-client/target/checkstyle-result.xml> of module with 212 warnings.
[CHECKSTYLE] Successfully parsed file <https://builds.apache.org/job/HBase-TRUNK/6429/artifact/hbase-common/target/checkstyle-result.xml> of module with 125 warnings.
[CHECKSTYLE] Successfully parsed file <https://builds.apache.org/job/HBase-TRUNK/6429/artifact/hbase-examples/target/checkstyle-result.xml> of module with 30 warnings.
[CHECKSTYLE] Successfully parsed file <https://builds.apache.org/job/HBase-TRUNK/6429/artifact/hbase-hadoop-compat/target/checkstyle-result.xml> of module with 2 warnings.
[CHECKSTYLE] Successfully parsed file <https://builds.apache.org/job/HBase-TRUNK/6429/artifact/hbase-hadoop2-compat/target/checkstyle-result.xml> of module with 47 warnings.
[CHECKSTYLE] Successfully parsed file <https://builds.apache.org/job/HBase-TRUNK/6429/artifact/hbase-it/target/checkstyle-result.xml> of module with 0 warnings.
[CHECKSTYLE] Successfully parsed file <https://builds.apache.org/job/HBase-TRUNK/6429/artifact/hbase-prefix-tree/target/checkstyle-result.xml> of module with 25 warnings.
[CHECKSTYLE] Successfully parsed file <https://builds.apache.org/job/HBase-TRUNK/6429/artifact/hbase-procedure/target/checkstyle-result.xml> of module with 0 warnings.
[CHECKSTYLE] Successfully parsed file <https://builds.apache.org/job/HBase-TRUNK/6429/artifact/hbase-protocol/target/checkstyle-result.xml> of module with 3 warnings.
[CHECKSTYLE] Successfully parsed file <https://builds.apache.org/job/HBase-TRUNK/6429/artifact/hbase-rest/target/checkstyle-result.xml> of module with 42 warnings.
[CHECKSTYLE] Successfully parsed file <https://builds.apache.org/job/HBase-TRUNK/6429/artifact/hbase-server/target/checkstyle-result.xml> of module with 1379 warnings.
[CHECKSTYLE] Successfully parsed file <https://builds.apache.org/job/HBase-TRUNK/6429/artifact/hbase-shaded/hbase-shaded-client/target/checkstyle-result.xml> of module with 0 warnings.
[CHECKSTYLE] Successfully parsed file <https://builds.apache.org/job/HBase-TRUNK/6429/artifact/hbase-shaded/hbase-shaded-server/target/checkstyle-result.xml> of module with 0 warnings.
[CHECKSTYLE] Successfully parsed file <https://builds.apache.org/job/HBase-TRUNK/6429/artifact/hbase-shaded/target/checkstyle-result.xml> of module with 0 warnings.
[CHECKSTYLE] Successfully parsed file <https://builds.apache.org/job/HBase-TRUNK/6429/artifact/hbase-shell/target/checkstyle-result.xml> of module with 0 warnings.
[CHECKSTYLE] Successfully parsed file <https://builds.apache.org/job/HBase-TRUNK/6429/artifact/hbase-testing-util/target/checkstyle-result.xml> of module with 0 warnings.
[CHECKSTYLE] Successfully parsed file <https://builds.apache.org/job/HBase-TRUNK/6429/artifact/hbase-thrift/target/checkstyle-result.xml> of module with 32 warnings.
[CHECKSTYLE] Successfully parsed file <https://builds.apache.org/job/HBase-TRUNK/6429/artifact/target/checkstyle-result.xml> of module with 0 warnings.
[CHECKSTYLE] Computing warning deltas based on reference build #6422
Updating HBASE-13578
Build failed in Jenkins: HBase-TRUNK #6428
Posted by Apache Jenkins Server <je...@builds.apache.org>.
See <https://builds.apache.org/job/HBase-TRUNK/6428/changes>
Changes:
[eclark] HBASE-13517 Publish a client artifact with shaded dependencies
------------------------------------------
[...truncated 4807 lines...]
Running org.apache.hadoop.hbase.wal.TestDefaultWALProvider
Tests run: 5, Failures: 0, Errors: 0, Skipped: 0, Time elapsed: 10.463 sec - in org.apache.hadoop.hbase.wal.TestDefaultWALProvider
Tests run: 5, Failures: 0, Errors: 0, Skipped: 0, Time elapsed: 24.374 sec - in org.apache.hadoop.hbase.wal.TestBoundedRegionGroupingProvider
Running org.apache.hadoop.hbase.wal.TestWALSplitCompressed
Tests run: 1, Failures: 0, Errors: 0, Skipped: 0, Time elapsed: 32.9 sec - in org.apache.hadoop.hbase.wal.TestWALFiltering
Running org.apache.hadoop.hbase.backup.example.TestZooKeeperTableArchiveClient
Tests run: 3, Failures: 0, Errors: 0, Skipped: 0, Time elapsed: 4.593 sec - in org.apache.hadoop.hbase.backup.example.TestZooKeeperTableArchiveClient
Running org.apache.hadoop.hbase.backup.TestHFileArchiving
Running org.apache.hadoop.hbase.zookeeper.TestHQuorumPeer
Tests run: 56, Failures: 0, Errors: 0, Skipped: 0, Time elapsed: 334.506 sec - in org.apache.hadoop.hbase.security.access.TestAccessController
Tests run: 4, Failures: 0, Errors: 0, Skipped: 0, Time elapsed: 1.625 sec - in org.apache.hadoop.hbase.zookeeper.TestHQuorumPeer
Running org.apache.hadoop.hbase.zookeeper.lock.TestZKInterProcessReadWriteLock
Running org.apache.hadoop.hbase.zookeeper.TestRecoverableZooKeeper
Tests run: 1, Failures: 0, Errors: 0, Skipped: 0, Time elapsed: 1.283 sec - in org.apache.hadoop.hbase.zookeeper.TestRecoverableZooKeeper
Running org.apache.hadoop.hbase.zookeeper.TestZKLeaderManager
Tests run: 1, Failures: 0, Errors: 0, Skipped: 0, Time elapsed: 0.122 sec - in org.apache.hadoop.hbase.zookeeper.TestZKLeaderManager
Running org.apache.hadoop.hbase.zookeeper.TestZooKeeperACL
Tests run: 6, Failures: 0, Errors: 0, Skipped: 0, Time elapsed: 0.318 sec - in org.apache.hadoop.hbase.zookeeper.TestZooKeeperACL
Tests run: 6, Failures: 0, Errors: 0, Skipped: 0, Time elapsed: 24.51 sec - in org.apache.hadoop.hbase.zookeeper.lock.TestZKInterProcessReadWriteLock
Running org.apache.hadoop.hbase.zookeeper.TestZooKeeperNodeTracker
Tests run: 3, Failures: 0, Errors: 0, Skipped: 0, Time elapsed: 1.332 sec - in org.apache.hadoop.hbase.zookeeper.TestZooKeeperNodeTracker
Running org.apache.hadoop.hbase.zookeeper.TestZKMulti
Tests run: 8, Failures: 0, Errors: 0, Skipped: 0, Time elapsed: 0.631 sec - in org.apache.hadoop.hbase.zookeeper.TestZKMulti
Running org.apache.hadoop.hbase.TestPartialResultsFromClientSide
Running org.apache.hadoop.hbase.mapreduce.TestTableInputFormatScan2
Tests run: 5, Failures: 0, Errors: 0, Skipped: 0, Time elapsed: 82.482 sec - in org.apache.hadoop.hbase.backup.TestHFileArchiving
Tests run: 13, Failures: 0, Errors: 0, Skipped: 0, Time elapsed: 72.072 sec - in org.apache.hadoop.hbase.TestPartialResultsFromClientSide
Running org.apache.hadoop.hbase.mapreduce.TestTableMapReduce
Running org.apache.hadoop.hbase.mapreduce.TestHLogRecordReader
Tests run: 2, Failures: 0, Errors: 0, Skipped: 0, Time elapsed: 1.447 sec - in org.apache.hadoop.hbase.mapreduce.TestHLogRecordReader
Running org.apache.hadoop.hbase.mapreduce.TestImportExport
Tests run: 31, Failures: 0, Errors: 0, Skipped: 0, Time elapsed: 207.868 sec - in org.apache.hadoop.hbase.wal.TestWALSplit
Tests run: 31, Failures: 0, Errors: 0, Skipped: 0, Time elapsed: 215.246 sec - in org.apache.hadoop.hbase.wal.TestWALSplitCompressed
Running org.apache.hadoop.hbase.mapreduce.TestWALPlayer
Running org.apache.hadoop.hbase.mapreduce.TestCopyTable
Tests run: 4, Failures: 0, Errors: 0, Skipped: 0, Time elapsed: 69.714 sec - in org.apache.hadoop.hbase.mapreduce.TestWALPlayer
Running org.apache.hadoop.hbase.mapreduce.TestImportTSVWithOperationAttributes
Tests run: 2, Failures: 0, Errors: 0, Skipped: 0, Time elapsed: 205.098 sec - in org.apache.hadoop.hbase.mapreduce.TestTableMapReduce
Tests run: 7, Failures: 0, Errors: 0, Skipped: 0, Time elapsed: 269.57 sec - in org.apache.hadoop.hbase.mapreduce.TestTableInputFormatScan2
Running org.apache.hadoop.hbase.mapreduce.TestRowCounter
Running org.apache.hadoop.hbase.mapreduce.TestImportTsv
Tests run: 5, Failures: 0, Errors: 0, Skipped: 0, Time elapsed: 156.119 sec - in org.apache.hadoop.hbase.mapreduce.TestCopyTable
Tests run: 2, Failures: 0, Errors: 0, Skipped: 0, Time elapsed: 89.557 sec - in org.apache.hadoop.hbase.mapreduce.TestImportTSVWithOperationAttributes
Running org.apache.hadoop.hbase.mapreduce.TestLoadIncrementalHFilesUseSecurityEndPoint
Running org.apache.hadoop.hbase.mapreduce.TestSecureLoadIncrementalHFiles
Tests run: 16, Failures: 0, Errors: 0, Skipped: 0, Time elapsed: 109.747 sec - in org.apache.hadoop.hbase.mapreduce.TestLoadIncrementalHFilesUseSecurityEndPoint
Tests run: 16, Failures: 0, Errors: 0, Skipped: 0, Time elapsed: 118.85 sec - in org.apache.hadoop.hbase.mapreduce.TestSecureLoadIncrementalHFiles
Running org.apache.hadoop.hbase.mapreduce.TestTableInputFormat
Running org.apache.hadoop.hbase.mapreduce.TestTimeRangeMapRed
Tests run: 6, Failures: 0, Errors: 0, Skipped: 0, Time elapsed: 211.139 sec - in org.apache.hadoop.hbase.mapreduce.TestRowCounter
Running org.apache.hadoop.hbase.mapreduce.TestTableSnapshotInputFormat
Tests run: 1, Failures: 0, Errors: 0, Skipped: 0, Time elapsed: 56.721 sec - in org.apache.hadoop.hbase.mapreduce.TestTimeRangeMapRed
Tests run: 12, Failures: 0, Errors: 0, Skipped: 0, Time elapsed: 445.333 sec - in org.apache.hadoop.hbase.mapreduce.TestImportExport
Running org.apache.hadoop.hbase.mapreduce.TestLoadIncrementalHFiles
Running org.apache.hadoop.hbase.mapreduce.TestImportTSVWithTTLs
Tests run: 8, Failures: 0, Errors: 0, Skipped: 0, Time elapsed: 96.631 sec - in org.apache.hadoop.hbase.mapreduce.TestTableInputFormat
Tests run: 10, Failures: 0, Errors: 0, Skipped: 0, Time elapsed: 281.953 sec - in org.apache.hadoop.hbase.mapreduce.TestImportTsv
Running org.apache.hadoop.hbase.mapreduce.TestLoadIncrementalHFilesSplitRecovery
Running org.apache.hadoop.hbase.mapreduce.TestHRegionPartitioner
Tests run: 1, Failures: 0, Errors: 0, Skipped: 0, Time elapsed: 7.547 sec - in org.apache.hadoop.hbase.mapreduce.TestHRegionPartitioner
Tests run: 1, Failures: 0, Errors: 0, Skipped: 0, Time elapsed: 66.703 sec - in org.apache.hadoop.hbase.mapreduce.TestImportTSVWithTTLs
Running org.apache.hadoop.hbase.mapreduce.TestHFileOutputFormat
Tests run: 5, Failures: 0, Errors: 0, Skipped: 0, Time elapsed: 39.904 sec - in org.apache.hadoop.hbase.mapreduce.TestLoadIncrementalHFilesSplitRecovery
Running org.apache.hadoop.hbase.mapreduce.TestImportTSVWithVisibilityLabels
Tests run: 16, Failures: 0, Errors: 0, Skipped: 0, Time elapsed: 117.254 sec - in org.apache.hadoop.hbase.mapreduce.TestLoadIncrementalHFiles
Running org.apache.hadoop.hbase.mapreduce.TestHFileOutputFormat2
Running org.apache.hadoop.hbase.mapreduce.TestMultithreadedTableMapper
Tests run: 1, Failures: 0, Errors: 0, Skipped: 0, Time elapsed: 113.226 sec - in org.apache.hadoop.hbase.mapreduce.TestMultithreadedTableMapper
Tests run: 7, Failures: 0, Errors: 0, Skipped: 0, Time elapsed: 322.138 sec - in org.apache.hadoop.hbase.mapreduce.TestTableSnapshotInputFormat
Running org.apache.hadoop.hbase.mapreduce.TestTableInputFormatScan1
Running org.apache.hadoop.hbase.mapreduce.TestCellCounter
Tests run: 5, Failures: 0, Errors: 0, Skipped: 0, Time elapsed: 226.361 sec - in org.apache.hadoop.hbase.mapreduce.TestImportTSVWithVisibilityLabels
Running org.apache.hadoop.hbase.mapreduce.TestWALRecordReader
Tests run: 2, Failures: 0, Errors: 0, Skipped: 0, Time elapsed: 1.48 sec - in org.apache.hadoop.hbase.mapreduce.TestWALRecordReader
Running org.apache.hadoop.hbase.mapreduce.TestMultiTableInputFormat
Tests run: 13, Failures: 0, Errors: 0, Skipped: 1, Time elapsed: 327.205 sec - in org.apache.hadoop.hbase.mapreduce.TestHFileOutputFormat
Running org.apache.hadoop.hbase.mapreduce.TestSecureLoadIncrementalHFilesSplitRecovery
Tests run: 13, Failures: 0, Errors: 0, Skipped: 1, Time elapsed: 339.498 sec - in org.apache.hadoop.hbase.mapreduce.TestHFileOutputFormat2
Tests run: 5, Failures: 0, Errors: 0, Skipped: 0, Time elapsed: 33.597 sec - in org.apache.hadoop.hbase.mapreduce.TestSecureLoadIncrementalHFilesSplitRecovery
Running org.apache.hadoop.hbase.filter.TestMultiRowRangeFilter
Running org.apache.hadoop.hbase.filter.TestScanRowPrefix
Tests run: 1, Failures: 0, Errors: 0, Skipped: 0, Time elapsed: 8.75 sec - in org.apache.hadoop.hbase.filter.TestScanRowPrefix
Tests run: 18, Failures: 0, Errors: 0, Skipped: 0, Time elapsed: 25.527 sec - in org.apache.hadoop.hbase.filter.TestMultiRowRangeFilter
Running org.apache.hadoop.hbase.filter.TestFilterWithScanLimits
Running org.apache.hadoop.hbase.filter.TestFuzzyRowAndColumnRangeFilter
Tests run: 1, Failures: 0, Errors: 0, Skipped: 0, Time elapsed: 4.512 sec - in org.apache.hadoop.hbase.filter.TestFuzzyRowAndColumnRangeFilter
Tests run: 7, Failures: 0, Errors: 0, Skipped: 0, Time elapsed: 272.948 sec - in org.apache.hadoop.hbase.mapreduce.TestTableInputFormatScan1
Tests run: 7, Failures: 0, Errors: 0, Skipped: 0, Time elapsed: 254.381 sec - in org.apache.hadoop.hbase.mapreduce.TestCellCounter
Tests run: 4, Failures: 0, Errors: 0, Skipped: 0, Time elapsed: 200.139 sec - in org.apache.hadoop.hbase.mapreduce.TestMultiTableInputFormat
Running org.apache.hadoop.hbase.filter.TestColumnRangeFilter
Running org.apache.hadoop.hbase.filter.TestFilterWrapper
Tests run: 1, Failures: 0, Errors: 0, Skipped: 0, Time elapsed: 5.137 sec - in org.apache.hadoop.hbase.filter.TestFilterWrapper
Running org.apache.hadoop.hbase.TestMetaTableAccessor
Tests run: 1, Failures: 0, Errors: 0, Skipped: 0, Time elapsed: 12.857 sec - in org.apache.hadoop.hbase.filter.TestColumnRangeFilter
Tests run: 1, Failures: 0, Errors: 0, Skipped: 0, Time elapsed: 54.478 sec - in org.apache.hadoop.hbase.filter.TestFilterWithScanLimits
Tests run: 12, Failures: 0, Errors: 0, Skipped: 0, Time elapsed: 17.152 sec - in org.apache.hadoop.hbase.TestMetaTableAccessor
Results :
Tests in error:
TestJMXListener.testStart:70 » IO Failed to retrieve RMIServer stub: javax.nam...
Tests run: 2445, Failures: 0, Errors: 1, Skipped: 17
[INFO] ------------------------------------------------------------------------
[INFO] Reactor Summary:
[INFO]
[INFO] HBase ............................................. SUCCESS [ 2.888 s]
[INFO] HBase - Checkstyle ................................ SUCCESS [ 0.656 s]
[INFO] HBase - Annotations ............................... SUCCESS [ 0.219 s]
[INFO] HBase - Protocol .................................. SUCCESS [ 2.623 s]
[INFO] HBase - Common .................................... SUCCESS [03:04 min]
[INFO] HBase - Procedure ................................. SUCCESS [01:28 min]
[INFO] HBase - Client .................................... SUCCESS [01:47 min]
[INFO] HBase - Hadoop Compatibility ...................... SUCCESS [ 11.333 s]
[INFO] HBase - Hadoop Two Compatibility .................. SUCCESS [ 14.538 s]
[INFO] HBase - Prefix Tree ............................... SUCCESS [ 17.691 s]
[INFO] HBase - Server .................................... FAILURE [ 01:45 h]
[INFO] HBase - Testing Util .............................. SKIPPED
[INFO] HBase - Thrift .................................... SKIPPED
[INFO] HBase - Shell ..................................... SKIPPED
[INFO] HBase - Integration Tests ......................... SKIPPED
[INFO] HBase - Examples .................................. SKIPPED
[INFO] HBase - Rest ...................................... SKIPPED
[INFO] HBase - Assembly .................................. SKIPPED
[INFO] HBase - Shaded .................................... SKIPPED
[INFO] HBase - Shaded - Client ........................... SKIPPED
[INFO] HBase - Shaded - Server ........................... SKIPPED
[INFO] ------------------------------------------------------------------------
[INFO] BUILD FAILURE
[INFO] ------------------------------------------------------------------------
[INFO] Total time: 01:52 h
[INFO] Finished at: 2015-04-28T21:11:39+00:00
[INFO] Final Memory: 61M/556M
[INFO] ------------------------------------------------------------------------
[ERROR] Failed to execute goal org.apache.maven.plugins:maven-surefire-plugin:2.18:test (secondPartTestsExecution) on project hbase-server: There are test failures.
[ERROR]
[ERROR] Please refer to <https://builds.apache.org/job/HBase-TRUNK/ws/hbase-server/target/surefire-reports> for the individual test results.
[ERROR] -> [Help 1]
[ERROR]
[ERROR] To see the full stack trace of the errors, re-run Maven with the -e switch.
[ERROR] Re-run Maven using the -X switch to enable full debug logging.
[ERROR]
[ERROR] For more information about the errors and possible solutions, please read the following articles:
[ERROR] [Help 1] http://cwiki.apache.org/confluence/display/MAVEN/MojoFailureException
[ERROR]
[ERROR] After correcting the problems, you can resume the build with the command
[ERROR] mvn <goals> -rf :hbase-server
Build step 'Invoke top-level Maven targets' marked build as failure
Performing Post build task...
Match found for :.* : True
Logical operation result is TRUE
Running script : ZOMBIE_TESTS_COUNT=`jps | grep surefirebooter | wc -l`
if [[ $ZOMBIE_TESTS_COUNT != 0 ]] ; then
#It seems sometimes the tests are not dying immediately. Let's give them 10s
echo "Suspicious java process found - waiting 10s to see if there are just slow to stop"
sleep 10
ZOMBIE_TESTS_COUNT=`jps | grep surefirebooter | wc -l`
if [[ $ZOMBIE_TESTS_COUNT != 0 ]] ; then
echo "There are $ZOMBIE_TESTS_COUNT zombie tests, they should have been killed by surefire but survived"
echo "************ BEGIN zombies jstack extract"
ZB_STACK=`jps | grep surefirebooter | cut -d ' ' -f 1 | xargs -n 1 jstack | grep ".test" | grep "\.java"`
jps | grep surefirebooter | cut -d ' ' -f 1 | xargs -n 1 jstack
echo "************ END zombies jstack extract"
JIRA_COMMENT="$JIRA_COMMENT
{color:red}-1 core zombie tests{color}. There are ${ZOMBIE_TESTS_COUNT} zombie test(s): ${ZB_STACK}"
BAD=1
jps | grep surefirebooter | cut -d ' ' -f 1 | xargs kill -9
else
echo "We're ok: there is no zombie test, but some tests took some time to stop"
fi
else
echo "We're ok: there is no zombie test"
fi
[HBase-TRUNK] $ /bin/bash -xe /tmp/hudson3880632918275382689.sh
++ jps
++ grep surefirebooter
++ wc -l
+ ZOMBIE_TESTS_COUNT=0
+ [[ 0 != 0 ]]
+ echo 'We'\''re ok: there is no zombie test'
We're ok: there is no zombie test
POST BUILD TASK : SUCCESS
END OF POST BUILD TASK : 0
Archiving artifacts
Sending artifact delta relative to HBase-TRUNK #6422
Archived 2157 artifacts
Archive block size is 32768
Received 60 blocks and 424846577 bytes
Compression is 0.5%
Took 2 min 39 sec
Recording test results
[FINDBUGS] Collecting findbugs analysis files...
[FINDBUGS] Finding all files that match the pattern **/findbugs.xml,**/findbugsXml.xml
[FINDBUGS] Parsing 24 files in <https://builds.apache.org/job/HBase-TRUNK/ws/>
[FINDBUGS] Successfully parsed file <https://builds.apache.org/job/HBase-TRUNK/6428/artifact/hbase-annotations/target/findbugs.xml> of module with 0 warnings.
[FINDBUGS] Successfully parsed file <https://builds.apache.org/job/HBase-TRUNK/6428/artifact/hbase-annotations/target/findbugsXml.xml> of module with 0 warnings.
[FINDBUGS] Successfully parsed file <https://builds.apache.org/job/HBase-TRUNK/6428/artifact/hbase-client/target/findbugs.xml> of module with 0 warnings.
[FINDBUGS] Successfully parsed file <https://builds.apache.org/job/HBase-TRUNK/6428/artifact/hbase-client/target/findbugsXml.xml> of module with 8 warnings.
[FINDBUGS] Successfully parsed file <https://builds.apache.org/job/HBase-TRUNK/6428/artifact/hbase-common/target/findbugs.xml> of module with 0 warnings.
[FINDBUGS] Successfully parsed file <https://builds.apache.org/job/HBase-TRUNK/6428/artifact/hbase-common/target/findbugsXml.xml> of module with 1 warnings.
[FINDBUGS] Successfully parsed file <https://builds.apache.org/job/HBase-TRUNK/6428/artifact/hbase-examples/target/findbugs.xml> of module with 0 warnings.
[FINDBUGS] Successfully parsed file <https://builds.apache.org/job/HBase-TRUNK/6428/artifact/hbase-examples/target/findbugsXml.xml> of module with 0 warnings.
[FINDBUGS] Successfully parsed file <https://builds.apache.org/job/HBase-TRUNK/6428/artifact/hbase-hadoop-compat/target/findbugs.xml> of module with 0 warnings.
[FINDBUGS] Successfully parsed file <https://builds.apache.org/job/HBase-TRUNK/6428/artifact/hbase-hadoop-compat/target/findbugsXml.xml> of module with 0 warnings.
[FINDBUGS] Successfully parsed file <https://builds.apache.org/job/HBase-TRUNK/6428/artifact/hbase-hadoop2-compat/target/findbugs.xml> of module with 0 warnings.
[FINDBUGS] Successfully parsed file <https://builds.apache.org/job/HBase-TRUNK/6428/artifact/hbase-hadoop2-compat/target/findbugsXml.xml> of module with 0 warnings.
[FINDBUGS] Successfully parsed file <https://builds.apache.org/job/HBase-TRUNK/6428/artifact/hbase-prefix-tree/target/findbugs.xml> of module with 0 warnings.
[FINDBUGS] Successfully parsed file <https://builds.apache.org/job/HBase-TRUNK/6428/artifact/hbase-prefix-tree/target/findbugsXml.xml> of module with 0 warnings.
[FINDBUGS] Successfully parsed file <https://builds.apache.org/job/HBase-TRUNK/6428/artifact/hbase-procedure/target/findbugs.xml> of module with 0 warnings.
[FINDBUGS] Successfully parsed file <https://builds.apache.org/job/HBase-TRUNK/6428/artifact/hbase-procedure/target/findbugsXml.xml> of module with 1 warnings.
[FINDBUGS] Successfully parsed file <https://builds.apache.org/job/HBase-TRUNK/6428/artifact/hbase-protocol/target/findbugs.xml> of module with 0 warnings.
[FINDBUGS] Successfully parsed file <https://builds.apache.org/job/HBase-TRUNK/6428/artifact/hbase-protocol/target/findbugsXml.xml> of module with 0 warnings.
[FINDBUGS] Successfully parsed file <https://builds.apache.org/job/HBase-TRUNK/6428/artifact/hbase-rest/target/findbugs.xml> of module with 0 warnings.
[FINDBUGS] Successfully parsed file <https://builds.apache.org/job/HBase-TRUNK/6428/artifact/hbase-rest/target/findbugsXml.xml> of module with 2 warnings.
[FINDBUGS] Successfully parsed file <https://builds.apache.org/job/HBase-TRUNK/6428/artifact/hbase-server/target/findbugs.xml> of module with 0 warnings.
[FINDBUGS] Successfully parsed file <https://builds.apache.org/job/HBase-TRUNK/6428/artifact/hbase-server/target/findbugsXml.xml> of module with 61 warnings.
[FINDBUGS] Successfully parsed file <https://builds.apache.org/job/HBase-TRUNK/6428/artifact/hbase-thrift/target/findbugs.xml> of module with 0 warnings.
[FINDBUGS] Successfully parsed file <https://builds.apache.org/job/HBase-TRUNK/6428/artifact/hbase-thrift/target/findbugsXml.xml> of module with 0 warnings.
[FINDBUGS] Computing warning deltas based on reference build #6422
[CHECKSTYLE] Collecting checkstyle analysis files...
[CHECKSTYLE] Finding all files that match the pattern **/checkstyle-result.xml
[CHECKSTYLE] Parsing 21 files in <https://builds.apache.org/job/HBase-TRUNK/ws/>
[CHECKSTYLE] Successfully parsed file <https://builds.apache.org/job/HBase-TRUNK/6428/artifact/hbase-annotations/target/checkstyle-result.xml> of module with 0 warnings.
[CHECKSTYLE] Successfully parsed file <https://builds.apache.org/job/HBase-TRUNK/6428/artifact/hbase-assembly/target/checkstyle-result.xml> of module with 0 warnings.
[CHECKSTYLE] Successfully parsed file <https://builds.apache.org/job/HBase-TRUNK/6428/artifact/hbase-checkstyle/target/checkstyle-result.xml> of module with 0 warnings.
[CHECKSTYLE] Successfully parsed file <https://builds.apache.org/job/HBase-TRUNK/6428/artifact/hbase-client/target/checkstyle-result.xml> of module with 212 warnings.
[CHECKSTYLE] Successfully parsed file <https://builds.apache.org/job/HBase-TRUNK/6428/artifact/hbase-common/target/checkstyle-result.xml> of module with 125 warnings.
[CHECKSTYLE] Successfully parsed file <https://builds.apache.org/job/HBase-TRUNK/6428/artifact/hbase-examples/target/checkstyle-result.xml> of module with 30 warnings.
[CHECKSTYLE] Successfully parsed file <https://builds.apache.org/job/HBase-TRUNK/6428/artifact/hbase-hadoop-compat/target/checkstyle-result.xml> of module with 2 warnings.
[CHECKSTYLE] Successfully parsed file <https://builds.apache.org/job/HBase-TRUNK/6428/artifact/hbase-hadoop2-compat/target/checkstyle-result.xml> of module with 47 warnings.
[CHECKSTYLE] Successfully parsed file <https://builds.apache.org/job/HBase-TRUNK/6428/artifact/hbase-it/target/checkstyle-result.xml> of module with 0 warnings.
[CHECKSTYLE] Successfully parsed file <https://builds.apache.org/job/HBase-TRUNK/6428/artifact/hbase-prefix-tree/target/checkstyle-result.xml> of module with 25 warnings.
[CHECKSTYLE] Successfully parsed file <https://builds.apache.org/job/HBase-TRUNK/6428/artifact/hbase-procedure/target/checkstyle-result.xml> of module with 0 warnings.
[CHECKSTYLE] Successfully parsed file <https://builds.apache.org/job/HBase-TRUNK/6428/artifact/hbase-protocol/target/checkstyle-result.xml> of module with 3 warnings.
[CHECKSTYLE] Successfully parsed file <https://builds.apache.org/job/HBase-TRUNK/6428/artifact/hbase-rest/target/checkstyle-result.xml> of module with 42 warnings.
[CHECKSTYLE] Successfully parsed file <https://builds.apache.org/job/HBase-TRUNK/6428/artifact/hbase-server/target/checkstyle-result.xml> of module with 1379 warnings.
[CHECKSTYLE] Successfully parsed file <https://builds.apache.org/job/HBase-TRUNK/6428/artifact/hbase-shaded/hbase-shaded-client/target/checkstyle-result.xml> of module with 0 warnings.
[CHECKSTYLE] Successfully parsed file <https://builds.apache.org/job/HBase-TRUNK/6428/artifact/hbase-shaded/hbase-shaded-server/target/checkstyle-result.xml> of module with 0 warnings.
[CHECKSTYLE] Successfully parsed file <https://builds.apache.org/job/HBase-TRUNK/6428/artifact/hbase-shaded/target/checkstyle-result.xml> of module with 0 warnings.
[CHECKSTYLE] Successfully parsed file <https://builds.apache.org/job/HBase-TRUNK/6428/artifact/hbase-shell/target/checkstyle-result.xml> of module with 0 warnings.
[CHECKSTYLE] Successfully parsed file <https://builds.apache.org/job/HBase-TRUNK/6428/artifact/hbase-testing-util/target/checkstyle-result.xml> of module with 0 warnings.
[CHECKSTYLE] Successfully parsed file <https://builds.apache.org/job/HBase-TRUNK/6428/artifact/hbase-thrift/target/checkstyle-result.xml> of module with 32 warnings.
[CHECKSTYLE] Successfully parsed file <https://builds.apache.org/job/HBase-TRUNK/6428/artifact/target/checkstyle-result.xml> of module with 0 warnings.
[CHECKSTYLE] Computing warning deltas based on reference build #6422
Updating HBASE-13517
Build failed in Jenkins: HBase-TRUNK #6427
Posted by Apache Jenkins Server <je...@builds.apache.org>.
See <https://builds.apache.org/job/HBase-TRUNK/6427/changes>
Changes:
[busbey] HBASE-11677 Making Logger instance modifiers consistent.
------------------------------------------
[...truncated 17114 lines...]
at java.util.concurrent.ThreadPoolExecutor.getTask(ThreadPoolExecutor.java:1068)
at java.util.concurrent.ThreadPoolExecutor.runWorker(ThreadPoolExecutor.java:1130)
at java.util.concurrent.ThreadPoolExecutor$Worker.run(ThreadPoolExecutor.java:615)
at java.lang.Thread.run(Thread.java:724)
"snapshot-hfile-cleaner-cache-refresher" daemon prio=10 tid=0x202a8400 nid=0x68cb in Object.wait() [0x1fb59000]
java.lang.Thread.State: TIMED_WAITING (on object monitor)
at java.lang.Object.wait(Native Method)
at java.util.TimerThread.mainLoop(Timer.java:552)
- locked <0x478b3908> (a java.util.TaskQueue)
at java.util.TimerThread.run(Timer.java:505)
"snapshot-log-cleaner-cache-refresher" daemon prio=10 tid=0x202a5400 nid=0x68c9 in Object.wait() [0x1fbfb000]
java.lang.Thread.State: TIMED_WAITING (on object monitor)
at java.lang.Object.wait(Native Method)
at java.util.TimerThread.mainLoop(Timer.java:552)
- locked <0x478b41f8> (a java.util.TaskQueue)
at java.util.TimerThread.run(Timer.java:505)
"hemera:37536.activeMasterManager-EventThread" daemon prio=10 tid=0x202a0400 nid=0x68bd waiting on condition [0x1fc4c000]
java.lang.Thread.State: WAITING (parking)
at sun.misc.Unsafe.park(Native Method)
- parking to wait for <0x4788f700> (a java.util.concurrent.locks.AbstractQueuedSynchronizer$ConditionObject)
at java.util.concurrent.locks.LockSupport.park(LockSupport.java:186)
at java.util.concurrent.locks.AbstractQueuedSynchronizer$ConditionObject.await(AbstractQueuedSynchronizer.java:2043)
at java.util.concurrent.LinkedBlockingQueue.take(LinkedBlockingQueue.java:442)
at org.apache.zookeeper.ClientCnxn$EventThread.run(ClientCnxn.java:494)
"hemera:37536.activeMasterManager-SendThread(localhost:52294)" daemon prio=10 tid=0x2029f000 nid=0x68bc waiting on condition [0x1fc9d000]
java.lang.Thread.State: TIMED_WAITING (sleeping)
at java.lang.Thread.sleep(Native Method)
at org.apache.zookeeper.client.StaticHostProvider.next(StaticHostProvider.java:101)
at org.apache.zookeeper.ClientCnxn$SendThread.startConnect(ClientCnxn.java:940)
at org.apache.zookeeper.ClientCnxn$SendThread.run(ClientCnxn.java:1003)
"org.apache.hadoop.hdfs.PeerCache@12ea9f0" daemon prio=10 tid=0x23974c00 nid=0x6757 waiting on condition [0x208c4000]
java.lang.Thread.State: TIMED_WAITING (sleeping)
at java.lang.Thread.sleep(Native Method)
at org.apache.hadoop.hdfs.PeerCache.run(PeerCache.java:244)
at org.apache.hadoop.hdfs.PeerCache.access$000(PeerCache.java:41)
at org.apache.hadoop.hdfs.PeerCache$1.run(PeerCache.java:119)
at java.lang.Thread.run(Thread.java:724)
"Timer for 'NameNode' metrics system" daemon prio=10 tid=0x24df1000 nid=0x598e in Object.wait() [0x28f7d000]
java.lang.Thread.State: TIMED_WAITING (on object monitor)
at java.lang.Object.wait(Native Method)
at java.util.TimerThread.mainLoop(Timer.java:552)
- locked <0x44a53508> (a java.util.TaskQueue)
at java.util.TimerThread.run(Timer.java:505)
"Service Thread" daemon prio=10 tid=0x29027000 nid=0x53ac runnable [0x00000000]
java.lang.Thread.State: RUNNABLE
"C2 CompilerThread1" daemon prio=10 tid=0x29025400 nid=0x53ab waiting on condition [0x00000000]
java.lang.Thread.State: RUNNABLE
"C2 CompilerThread0" daemon prio=10 tid=0x29023400 nid=0x53aa waiting on condition [0x00000000]
java.lang.Thread.State: RUNNABLE
"Signal Dispatcher" daemon prio=10 tid=0x29021800 nid=0x53a9 runnable [0x00000000]
java.lang.Thread.State: RUNNABLE
"Finalizer" daemon prio=10 tid=0x294e7000 nid=0x538a in Object.wait() [0x3397d000]
java.lang.Thread.State: WAITING (on object monitor)
at java.lang.Object.wait(Native Method)
at java.lang.ref.ReferenceQueue.remove(ReferenceQueue.java:135)
- locked <0x447cc388> (a java.lang.ref.ReferenceQueue$Lock)
at java.lang.ref.ReferenceQueue.remove(ReferenceQueue.java:151)
at java.lang.ref.Finalizer$FinalizerThread.run(Finalizer.java:189)
"Reference Handler" daemon prio=10 tid=0x294e5000 nid=0x5389 in Object.wait() [0xf6855000]
java.lang.Thread.State: WAITING (on object monitor)
at java.lang.Object.wait(Native Method)
at java.lang.Object.wait(Object.java:503)
at java.lang.ref.Reference$ReferenceHandler.run(Reference.java:133)
- locked <0x447bb6a0> (a java.lang.ref.Reference$Lock)
"main" prio=10 tid=0xf6706800 nid=0x5163 in Object.wait() [0xf693e000]
java.lang.Thread.State: TIMED_WAITING (on object monitor)
at java.lang.Object.wait(Native Method)
at org.apache.hadoop.hbase.client.RpcRetryingCaller.callWithRetries(RpcRetryingCaller.java:168)
- locked <0xd6e84098> (a java.util.concurrent.atomic.AtomicBoolean)
at org.apache.hadoop.hbase.client.HBaseAdmin.executeCallable(HBaseAdmin.java:3917)
at org.apache.hadoop.hbase.client.HBaseAdmin.access$700(HBaseAdmin.java:187)
at org.apache.hadoop.hbase.client.HBaseAdmin$ProcedureFuture.getProcedureResult(HBaseAdmin.java:4190)
at org.apache.hadoop.hbase.client.HBaseAdmin$ProcedureFuture.waitProcedureResult(HBaseAdmin.java:4142)
at org.apache.hadoop.hbase.client.HBaseAdmin$ProcedureFuture.get(HBaseAdmin.java:4098)
at org.apache.hadoop.hbase.client.HBaseAdmin.createTable(HBaseAdmin.java:560)
at org.apache.hadoop.hbase.client.HBaseAdmin.createTable(HBaseAdmin.java:490)
at org.apache.hadoop.hbase.regionserver.wal.TestLogRollAbort.testRSAbortWithUnflushedEdits(TestLogRollAbort.java:139)
at sun.reflect.NativeMethodAccessorImpl.invoke0(Native Method)
at sun.reflect.NativeMethodAccessorImpl.invoke(NativeMethodAccessorImpl.java:57)
at sun.reflect.DelegatingMethodAccessorImpl.invoke(DelegatingMethodAccessorImpl.java:43)
at java.lang.reflect.Method.invoke(Method.java:606)
at org.junit.runners.model.FrameworkMethod$1.runReflectiveCall(FrameworkMethod.java:47)
at org.junit.internal.runners.model.ReflectiveCallable.run(ReflectiveCallable.java:12)
at org.junit.runners.model.FrameworkMethod.invokeExplosively(FrameworkMethod.java:44)
at org.junit.internal.runners.statements.InvokeMethod.evaluate(InvokeMethod.java:17)
at org.junit.internal.runners.statements.RunBefores.evaluate(RunBefores.java:26)
at org.junit.internal.runners.statements.RunAfters.evaluate(RunAfters.java:27)
at org.junit.runners.ParentRunner.runLeaf(ParentRunner.java:271)
at org.junit.runners.BlockJUnit4ClassRunner.runChild(BlockJUnit4ClassRunner.java:70)
at org.junit.runners.BlockJUnit4ClassRunner.runChild(BlockJUnit4ClassRunner.java:50)
at org.junit.runners.ParentRunner$3.run(ParentRunner.java:238)
at org.junit.runners.ParentRunner$1.schedule(ParentRunner.java:63)
at org.junit.runners.ParentRunner.runChildren(ParentRunner.java:236)
at org.junit.runners.ParentRunner.access$000(ParentRunner.java:53)
at org.junit.runners.ParentRunner$2.evaluate(ParentRunner.java:229)
at org.junit.internal.runners.statements.RunBefores.evaluate(RunBefores.java:26)
at org.junit.runners.ParentRunner.run(ParentRunner.java:309)
at org.junit.runners.Suite.runChild(Suite.java:127)
at org.junit.runners.Suite.runChild(Suite.java:26)
at org.junit.runners.ParentRunner$3.run(ParentRunner.java:238)
at org.junit.runners.ParentRunner$1.schedule(ParentRunner.java:63)
at org.junit.runners.ParentRunner.runChildren(ParentRunner.java:236)
at org.junit.runners.ParentRunner.access$000(ParentRunner.java:53)
at org.junit.runners.ParentRunner$2.evaluate(ParentRunner.java:229)
at org.junit.runners.ParentRunner.run(ParentRunner.java:309)
at org.junit.runner.JUnitCore.run(JUnitCore.java:160)
at org.junit.runner.JUnitCore.run(JUnitCore.java:138)
at org.apache.maven.surefire.junitcore.JUnitCoreWrapper.createRequestAndRun(JUnitCoreWrapper.java:107)
at org.apache.maven.surefire.junitcore.JUnitCoreWrapper.executeEager(JUnitCoreWrapper.java:77)
at org.apache.maven.surefire.junitcore.JUnitCoreWrapper.execute(JUnitCoreWrapper.java:53)
at org.apache.maven.surefire.junitcore.JUnitCoreProvider.invoke(JUnitCoreProvider.java:144)
at org.apache.maven.surefire.booter.ForkedBooter.invokeProviderInSameClassLoader(ForkedBooter.java:203)
at org.apache.maven.surefire.booter.ForkedBooter.runSuitesInProcess(ForkedBooter.java:155)
at org.apache.maven.surefire.booter.ForkedBooter.main(ForkedBooter.java:103)
"VM Thread" prio=10 tid=0x297f8800 nid=0x5371 runnable
"GC task thread#0 (ParallelGC)" prio=10 tid=0xf6710c00 nid=0x5333 runnable
"GC task thread#1 (ParallelGC)" prio=10 tid=0xf6712000 nid=0x5334 runnable
"GC task thread#2 (ParallelGC)" prio=10 tid=0xf6713800 nid=0x5337 runnable
"GC task thread#3 (ParallelGC)" prio=10 tid=0xf6715000 nid=0x533f runnable
"GC task thread#4 (ParallelGC)" prio=10 tid=0xf6716400 nid=0x5342 runnable
"GC task thread#5 (ParallelGC)" prio=10 tid=0xf6717c00 nid=0x5345 runnable
"GC task thread#6 (ParallelGC)" prio=10 tid=0xf6719400 nid=0x5347 runnable
"GC task thread#7 (ParallelGC)" prio=10 tid=0xf671a800 nid=0x5349 runnable
"GC task thread#8 (ParallelGC)" prio=10 tid=0xf671c000 nid=0x534c runnable
"GC task thread#9 (ParallelGC)" prio=10 tid=0xf671d800 nid=0x534f runnable
"GC task thread#10 (ParallelGC)" prio=10 tid=0xf671f000 nid=0x5352 runnable
"GC task thread#11 (ParallelGC)" prio=10 tid=0xf6720400 nid=0x5356 runnable
"GC task thread#12 (ParallelGC)" prio=10 tid=0xf6721c00 nid=0x5359 runnable
"GC task thread#13 (ParallelGC)" prio=10 tid=0xf6723400 nid=0x535b runnable
"GC task thread#14 (ParallelGC)" prio=10 tid=0xf6724800 nid=0x535e runnable
"GC task thread#15 (ParallelGC)" prio=10 tid=0xf6726000 nid=0x5361 runnable
"GC task thread#16 (ParallelGC)" prio=10 tid=0xf6727800 nid=0x5363 runnable
"GC task thread#17 (ParallelGC)" prio=10 tid=0xf6728c00 nid=0x5365 runnable
"VM Periodic Task Thread" prio=10 tid=0x29029000 nid=0x53b0 waiting on condition
JNI global references: 290
+ echo '************ END zombies jstack extract'
************ END zombies jstack extract
+ JIRA_COMMENT='
{color:red}-1 core zombie tests{color}. There are 8 zombie test(s): at org.apache.hadoop.hbase.io.hfile.TestScannerSelectionUsingTTL.testScannerSelection(TestScannerSelectionUsingTTL.java:117)
at org.apache.hadoop.hbase.io.hfile.TestCacheOnWrite.testNotCachingDataBlocksDuringCompactionInternals(TestCacheOnWrite.java:468)
at org.apache.hadoop.hbase.io.hfile.TestCacheOnWrite.testNotCachingDataBlocksDuringCompaction(TestCacheOnWrite.java:493)
at org.apache.hadoop.hbase.io.hfile.TestForceCacheImportantBlocks.testCacheBlocks(TestForceCacheImportantBlocks.java:116)
at org.apache.hadoop.hbase.regionserver.wal.TestWALReplay.testReplayEditsAfterRegionMovedWithMultiCF(TestWALReplay.java:241)
at org.apache.hadoop.hbase.io.hfile.TestHFileBlock.testConcurrentReadingInternals(TestHFileBlock.java:739)
at org.apache.hadoop.hbase.io.hfile.TestHFileBlock.testConcurrentReading(TestHFileBlock.java:707)
at org.apache.hadoop.hbase.security.access.TestAccessController.testWrite(TestAccessController.java:760)
at org.apache.hadoop.hbase.regionserver.wal.TestLogRollAbort.testRSAbortWithUnflushedEdits(TestLogRollAbort.java:139)'
+ BAD=1
+ jps
+ grep surefirebooter
+ cut -d ' ' -f 1
+ xargs kill -9
POST BUILD TASK : SUCCESS
END OF POST BUILD TASK : 0
Archiving artifacts
Sending artifact delta relative to HBase-TRUNK #6422
Archived 2139 artifacts
Archive block size is 32768
Received 57 blocks and 423437085 bytes
Compression is 0.4%
Took 3 min 39 sec
Recording test results
[FINDBUGS] Collecting findbugs analysis files...
[FINDBUGS] Finding all files that match the pattern **/findbugs.xml,**/findbugsXml.xml
[FINDBUGS] Parsing 24 files in <https://builds.apache.org/job/HBase-TRUNK/ws/>
[FINDBUGS] Successfully parsed file <https://builds.apache.org/job/HBase-TRUNK/6427/artifact/hbase-annotations/target/findbugs.xml> of module with 0 warnings.
[FINDBUGS] Successfully parsed file <https://builds.apache.org/job/HBase-TRUNK/6427/artifact/hbase-annotations/target/findbugsXml.xml> of module with 0 warnings.
[FINDBUGS] Successfully parsed file <https://builds.apache.org/job/HBase-TRUNK/6427/artifact/hbase-client/target/findbugs.xml> of module with 0 warnings.
[FINDBUGS] Successfully parsed file <https://builds.apache.org/job/HBase-TRUNK/6427/artifact/hbase-client/target/findbugsXml.xml> of module with 8 warnings.
[FINDBUGS] Successfully parsed file <https://builds.apache.org/job/HBase-TRUNK/6427/artifact/hbase-common/target/findbugs.xml> of module with 0 warnings.
[FINDBUGS] Successfully parsed file <https://builds.apache.org/job/HBase-TRUNK/6427/artifact/hbase-common/target/findbugsXml.xml> of module with 1 warnings.
[FINDBUGS] Successfully parsed file <https://builds.apache.org/job/HBase-TRUNK/6427/artifact/hbase-examples/target/findbugs.xml> of module with 0 warnings.
[FINDBUGS] Successfully parsed file <https://builds.apache.org/job/HBase-TRUNK/6427/artifact/hbase-examples/target/findbugsXml.xml> of module with 0 warnings.
[FINDBUGS] Successfully parsed file <https://builds.apache.org/job/HBase-TRUNK/6427/artifact/hbase-hadoop-compat/target/findbugs.xml> of module with 0 warnings.
[FINDBUGS] Successfully parsed file <https://builds.apache.org/job/HBase-TRUNK/6427/artifact/hbase-hadoop-compat/target/findbugsXml.xml> of module with 0 warnings.
[FINDBUGS] Successfully parsed file <https://builds.apache.org/job/HBase-TRUNK/6427/artifact/hbase-hadoop2-compat/target/findbugs.xml> of module with 0 warnings.
[FINDBUGS] Successfully parsed file <https://builds.apache.org/job/HBase-TRUNK/6427/artifact/hbase-hadoop2-compat/target/findbugsXml.xml> of module with 0 warnings.
[FINDBUGS] Successfully parsed file <https://builds.apache.org/job/HBase-TRUNK/6427/artifact/hbase-prefix-tree/target/findbugs.xml> of module with 0 warnings.
[FINDBUGS] Successfully parsed file <https://builds.apache.org/job/HBase-TRUNK/6427/artifact/hbase-prefix-tree/target/findbugsXml.xml> of module with 0 warnings.
[FINDBUGS] Successfully parsed file <https://builds.apache.org/job/HBase-TRUNK/6427/artifact/hbase-procedure/target/findbugs.xml> of module with 0 warnings.
[FINDBUGS] Successfully parsed file <https://builds.apache.org/job/HBase-TRUNK/6427/artifact/hbase-procedure/target/findbugsXml.xml> of module with 1 warnings.
[FINDBUGS] Successfully parsed file <https://builds.apache.org/job/HBase-TRUNK/6427/artifact/hbase-protocol/target/findbugs.xml> of module with 0 warnings.
[FINDBUGS] Successfully parsed file <https://builds.apache.org/job/HBase-TRUNK/6427/artifact/hbase-protocol/target/findbugsXml.xml> of module with 0 warnings.
[FINDBUGS] Successfully parsed file <https://builds.apache.org/job/HBase-TRUNK/6427/artifact/hbase-rest/target/findbugs.xml> of module with 0 warnings.
[FINDBUGS] Successfully parsed file <https://builds.apache.org/job/HBase-TRUNK/6427/artifact/hbase-rest/target/findbugsXml.xml> of module with 2 warnings.
[FINDBUGS] Successfully parsed file <https://builds.apache.org/job/HBase-TRUNK/6427/artifact/hbase-server/target/findbugs.xml> of module with 0 warnings.
[FINDBUGS] Successfully parsed file <https://builds.apache.org/job/HBase-TRUNK/6427/artifact/hbase-server/target/findbugsXml.xml> of module with 61 warnings.
[FINDBUGS] Successfully parsed file <https://builds.apache.org/job/HBase-TRUNK/6427/artifact/hbase-thrift/target/findbugs.xml> of module with 0 warnings.
[FINDBUGS] Successfully parsed file <https://builds.apache.org/job/HBase-TRUNK/6427/artifact/hbase-thrift/target/findbugsXml.xml> of module with 0 warnings.
[FINDBUGS] Computing warning deltas based on reference build #6422
[CHECKSTYLE] Collecting checkstyle analysis files...
[CHECKSTYLE] Finding all files that match the pattern **/checkstyle-result.xml
[CHECKSTYLE] Parsing 18 files in <https://builds.apache.org/job/HBase-TRUNK/ws/>
[CHECKSTYLE] Successfully parsed file <https://builds.apache.org/job/HBase-TRUNK/6427/artifact/hbase-annotations/target/checkstyle-result.xml> of module with 0 warnings.
[CHECKSTYLE] Successfully parsed file <https://builds.apache.org/job/HBase-TRUNK/6427/artifact/hbase-assembly/target/checkstyle-result.xml> of module with 0 warnings.
[CHECKSTYLE] Successfully parsed file <https://builds.apache.org/job/HBase-TRUNK/6427/artifact/hbase-checkstyle/target/checkstyle-result.xml> of module with 0 warnings.
[CHECKSTYLE] Successfully parsed file <https://builds.apache.org/job/HBase-TRUNK/6427/artifact/hbase-client/target/checkstyle-result.xml> of module with 212 warnings.
[CHECKSTYLE] Successfully parsed file <https://builds.apache.org/job/HBase-TRUNK/6427/artifact/hbase-common/target/checkstyle-result.xml> of module with 125 warnings.
[CHECKSTYLE] Successfully parsed file <https://builds.apache.org/job/HBase-TRUNK/6427/artifact/hbase-examples/target/checkstyle-result.xml> of module with 30 warnings.
[CHECKSTYLE] Successfully parsed file <https://builds.apache.org/job/HBase-TRUNK/6427/artifact/hbase-hadoop-compat/target/checkstyle-result.xml> of module with 2 warnings.
[CHECKSTYLE] Successfully parsed file <https://builds.apache.org/job/HBase-TRUNK/6427/artifact/hbase-hadoop2-compat/target/checkstyle-result.xml> of module with 47 warnings.
[CHECKSTYLE] Successfully parsed file <https://builds.apache.org/job/HBase-TRUNK/6427/artifact/hbase-it/target/checkstyle-result.xml> of module with 0 warnings.
[CHECKSTYLE] Successfully parsed file <https://builds.apache.org/job/HBase-TRUNK/6427/artifact/hbase-prefix-tree/target/checkstyle-result.xml> of module with 25 warnings.
[CHECKSTYLE] Successfully parsed file <https://builds.apache.org/job/HBase-TRUNK/6427/artifact/hbase-procedure/target/checkstyle-result.xml> of module with 0 warnings.
[CHECKSTYLE] Successfully parsed file <https://builds.apache.org/job/HBase-TRUNK/6427/artifact/hbase-protocol/target/checkstyle-result.xml> of module with 3 warnings.
[CHECKSTYLE] Successfully parsed file <https://builds.apache.org/job/HBase-TRUNK/6427/artifact/hbase-rest/target/checkstyle-result.xml> of module with 42 warnings.
[CHECKSTYLE] Successfully parsed file <https://builds.apache.org/job/HBase-TRUNK/6427/artifact/hbase-server/target/checkstyle-result.xml> of module with 1379 warnings.
[CHECKSTYLE] Successfully parsed file <https://builds.apache.org/job/HBase-TRUNK/6427/artifact/hbase-shell/target/checkstyle-result.xml> of module with 0 warnings.
[CHECKSTYLE] Successfully parsed file <https://builds.apache.org/job/HBase-TRUNK/6427/artifact/hbase-testing-util/target/checkstyle-result.xml> of module with 0 warnings.
[CHECKSTYLE] Successfully parsed file <https://builds.apache.org/job/HBase-TRUNK/6427/artifact/hbase-thrift/target/checkstyle-result.xml> of module with 32 warnings.
[CHECKSTYLE] Successfully parsed file <https://builds.apache.org/job/HBase-TRUNK/6427/artifact/target/checkstyle-result.xml> of module with 0 warnings.
[CHECKSTYLE] Computing warning deltas based on reference build #6422
Updating HBASE-11677