You are viewing a plain text version of this content. The canonical link for it is here.
Posted to builds@cassandra.apache.org by Apache Jenkins Server <je...@builds.apache.org> on 2026/04/30 14:53:13 UTC

Build complete: Cassandra-6.0 #12 [UNSTABLE] 8fd2443afcf785b2862a5a23efdee85c968d9654

-------------------------------------------------------------------------------
  Build Cassandra-6.0 #12 Still unstable
  URL: https://ci-cassandra.apache.org/job/Cassandra-6.0/12/
  -------------------------------------------------------------------------------
  Changes:
  [David Capwell] Fix single token batch atomicity with Accord/non-Accord batches by using


  -------------------------------------------------------------------------------
  Failed Tests:
  89 tests failed.
FAILED:  dtest-latest.cdc_test.TestCDC.Tests / dtest-latest jdk17 25/64 / test_insertion_and_commitlog_behavior_after_reaching_cdc_total_space
FAILED:  dtest-latest.disk_balance_test.TestDiskBalance.Tests / dtest-latest jdk11 44/64 / test_disk_balance_replace_different_address
FAILED:  dtest-latest.materialized_views_test.TestMaterializedViews.Tests / dtest-latest jdk11 63/64 / test_drop_with_stopped_build
FAILED:  dtest-latest.secondary_indexes_test.TestSecondaryIndexes.Tests / dtest-latest jdk11 64/64 / test_6924_dropping_cf
FAILED:  dtest-latest.secondary_indexes_test.TestSecondaryIndexes.Tests / dtest-latest jdk11 63/64 / test_6924_dropping_ks
FAILED:  dtest-novnode.materialized_views_test.TestMaterializedViews.Tests / dtest-novnode jdk11 54/64 / test_drop_table
FAILED:  dtest-novnode.materialized_views_test.TestMaterializedViews.Tests / dtest-novnode jdk11 42/64 / test_view_metadata_cleanup
FAILED:  dtest-novnode.materialized_views_test.TestMaterializedViews.Tests / dtest-novnode jdk17 42/64 / test_view_metadata_cleanup
FAILED:  dtest-novnode.repair_tests.repair_test.TestRepair.Tests / dtest-novnode jdk11 6/64 / test_dead_sync_participant
FAILED:  dtest-upgrade-large.upgrade_tests.upgrade_through_versions_test.TestUpgrade_current_5_0_x_To_indev_6_0_x.Tests / dtest-upgrade-large jdk11 1/40 / test_bootstrap
FAILED:  dtest-upgrade-large.upgrade_tests.upgrade_through_versions_test.TestUpgrade_current_5_0_x_To_indev_6_0_x.Tests / dtest-upgrade-large jdk11 2/40 / test_bootstrap_multidc
FAILED:  dtest-upgrade-novnode.upgrade_tests.cql_tests.TestCQLNodes3RF3_Upgrade_indev_4_0_x_To_indev_6_0_x.Tests / dtest-upgrade-novnode jdk11 61/160 / test_conditional_delete
FAILED:  dtest.materialized_views_test.TestMaterializedViews.Tests / dtest jdk11 36/64 / test_view_metadata_cleanup
FAILED:  dtest.repair_tests.repair_test.TestRepair.Tests / dtest jdk11 11/64 / test_dead_sync_participant
FAILED:  dtest.replace_address_test.TestReplaceAddress.Tests / dtest jdk17 18/64 / test_fail_without_replace
FAILED:  org.apache.cassandra.db.commitlog.BatchCommitLogTest.Tests / test-cdc jdk17 15/20 / testBatchCLShutDownImmediately[1]-cdc_jdk17_x86_64
FAILED:  org.apache.cassandra.db.compaction.CompactionStrategyManagerTest.Tests / test-latest jdk17 10/20 / testAutomaticUpgradeConcurrency-latest_jdk17_x86_64
FAILED:  org.apache.cassandra.db.compaction.UnifiedCompactionStrategyTest.Tests / test-cdc jdk11 14/20 / testDropExpiredSSTables-cdc_jdk11_x86_64
FAILED:  org.apache.cassandra.distributed.test.accord.AccordMoveTest.Tests / jvm-dtest jdk21 5/16 / moveTest-_jdk21_x86_64
FAILED:  org.apache.cassandra.distributed.test.accord.AccordProgressLogTest.Tests / jvm-dtest jdk11 7/16 / testFetchTimeWindow-_jdk11_x86_64
FAILED:  org.apache.cassandra.distributed.upgrade.MixedModeMessageForwardTest.Tests / jvm-dtest-upgrade jdk11 4/6 / checkWritesForwardedToOtherDcTest-_jdk11_x86_64
FAILED:  org.apache.cassandra.repair.autorepair.AutoRepairParameterizedTest.Tests / test-compression jdk21 8/20 / testMetrics[repairType=PREVIEW_REPAIRED]-cassandra.testtag_IS_UNDEFINED
FAILED:  org.apache.cassandra.simulator.test.TrivialSimulationTest.Tests / simulator-dtest jdk11 2/2 / trivialTest-_jdk11_x86_64
FAILED:  org.apache.cassandra.repair.autorepair.AutoRepairParameterizedTest.Tests / test jdk17 8/20 / testSkipRepairSSTableCountHigherThreshold[repairType=PREVIEW_REPAIRED]-cassandra.testtag_IS_UNDEFINED
FAILED:  org.apache.cassandra.distributed.test.accord.MigrationFromAccordWriteRaceTest.Tests / jvm-dtest jdk11 5/16 / testSplitAndRetryNonSerialLoggedBatchTwoTablesTwoPkeyHintedViaBatchLogRoutingFailure-_jdk11_x86_64
FAILED:  org.apache.cassandra.distributed.test.accord.MigrationFromAccordWriteRaceTest.Tests / jvm-dtest jdk17 5/16 / testSplitAndRetryNonSerialLoggedBatchTwoTablesTwoPkeyHintedViaBatchLogRoutingFailure-_jdk17_x86_64
FAILED:  org.apache.cassandra.simulator.test.ShortAccordSimulationTest.Tests / simulator-dtest jdk11 1/2 / simulationTest-_jdk11_x86_64
FAILED:  org.apache.cassandra.simulator.test.ShortPaxosSimulationTest.Tests / simulator-dtest jdk11 2/2 / selfReconcileTest-cassandra.testtag_IS_UNDEFINED
FAILED:  dtest-upgrade-large-novnode.upgrade_tests.upgrade_through_versions_test.TestUpgrade_current_6_0_x_To_indev_6_0_x.Tests / dtest-upgrade-large-novnode jdk11 8/40 / test_bootstrap_multidc
FAILED:  dtest-upgrade-large-novnode.upgrade_tests.upgrade_through_versions_test.TestUpgrade_current_6_0_x_To_indev_6_0_x.Tests / dtest-upgrade-large-novnode jdk11 9/40 / test_parallel_upgrade
FAILED:  dtest-upgrade-large-novnode.upgrade_tests.upgrade_through_versions_test.TestUpgrade_current_6_0_x_To_indev_6_0_x.Tests / dtest-upgrade-large-novnode jdk11 11/40 / test_parallel_upgrade_with_internode_ssl
FAILED:  dtest-upgrade-large-novnode.upgrade_tests.upgrade_through_versions_test.TestUpgrade_current_6_0_x_To_indev_6_0_x.Tests / dtest-upgrade-large-novnode jdk11 12/40 / test_rolling_upgrade_with_internode_ssl
FAILED:  dtest-upgrade-large-novnode.upgrade_tests.upgrade_through_versions_test.TestUpgrade_indev_6_0_x_To_indev_trunk.Tests / dtest-upgrade-large-novnode jdk11 31/40 / test_bootstrap
FAILED:  dtest-upgrade-large-novnode.upgrade_tests.upgrade_through_versions_test.TestUpgrade_indev_6_0_x_To_indev_trunk.Tests / dtest-upgrade-large-novnode jdk11 32/40 / test_bootstrap_multidc
FAILED:  dtest-upgrade-large-novnode.upgrade_tests.upgrade_through_versions_test.TestUpgrade_indev_6_0_x_To_indev_trunk.Tests / dtest-upgrade-large-novnode jdk11 33/40 / test_parallel_upgrade
FAILED:  dtest-upgrade-large-novnode.upgrade_tests.upgrade_through_versions_test.TestUpgrade_indev_6_0_x_To_indev_trunk.Tests / dtest-upgrade-large-novnode jdk11 35/40 / test_parallel_upgrade_with_internode_ssl
FAILED:  dtest-upgrade-large-novnode.upgrade_tests.upgrade_through_versions_test.TestUpgrade_indev_6_0_x_To_indev_trunk.Tests / dtest-upgrade-large-novnode jdk11 34/40 / test_rolling_upgrade
FAILED:  dtest-upgrade-large-novnode.upgrade_tests.upgrade_through_versions_test.TestUpgrade_indev_6_0_x_To_indev_trunk.Tests / dtest-upgrade-large-novnode jdk11 36/40 / test_rolling_upgrade_with_internode_ssl
FAILED:  dtest-upgrade-large.upgrade_tests.upgrade_through_versions_test.TestUpgrade_current_6_0_x_To_indev_6_0_x.Tests / dtest-upgrade-large jdk11 11/40 / test_parallel_upgrade_with_internode_ssl
FAILED:  dtest-upgrade-large.upgrade_tests.upgrade_through_versions_test.TestUpgrade_current_6_0_x_To_indev_6_0_x.Tests / dtest-upgrade-large jdk11 12/40 / test_rolling_upgrade_with_internode_ssl
FAILED:  dtest-upgrade-large.upgrade_tests.upgrade_through_versions_test.TestUpgrade_indev_6_0_x_To_indev_trunk.Tests / dtest-upgrade-large jdk11 31/40 / test_bootstrap
FAILED:  dtest-upgrade-large.upgrade_tests.upgrade_through_versions_test.TestUpgrade_indev_6_0_x_To_indev_trunk.Tests / dtest-upgrade-large jdk11 32/40 / test_bootstrap_multidc
FAILED:  dtest-upgrade-large.upgrade_tests.upgrade_through_versions_test.TestUpgrade_indev_6_0_x_To_indev_trunk.Tests / dtest-upgrade-large jdk11 33/40 / test_parallel_upgrade
FAILED:  dtest-upgrade-large.upgrade_tests.upgrade_through_versions_test.TestUpgrade_indev_6_0_x_To_indev_trunk.Tests / dtest-upgrade-large jdk11 35/40 / test_parallel_upgrade_with_internode_ssl
FAILED:  dtest-upgrade-large.upgrade_tests.upgrade_through_versions_test.TestUpgrade_indev_6_0_x_To_indev_trunk.Tests / dtest-upgrade-large jdk11 34/40 / test_rolling_upgrade
FAILED:  dtest-upgrade-large.upgrade_tests.upgrade_through_versions_test.TestUpgrade_indev_6_0_x_To_indev_trunk.Tests / dtest-upgrade-large jdk11 36/40 / test_rolling_upgrade_with_internode_ssl
FAILED:  junit.framework.TestSuite.Tests / jvm-dtest jdk17 5/16 / org.apache.cassandra.distributed.test.accord.MigrationFromAccordWriteRaceTest-_jdk17_x86_64
FAILED:  dtest-upgrade-large-novnode.upgrade_tests.upgrade_through_versions_test.TestUpgrade_current_6_0_x_To_indev_6_0_x.Tests / dtest-upgrade-large-novnode jdk11 7/40 / test_bootstrap
FAILED:  dtest-upgrade-large-novnode.upgrade_tests.upgrade_through_versions_test.TestUpgrade_current_6_0_x_To_indev_6_0_x.Tests / dtest-upgrade-large-novnode jdk11 10/40 / test_rolling_upgrade
FAILED:  dtest-upgrade-large.upgrade_tests.upgrade_through_versions_test.TestUpgrade_current_6_0_x_To_indev_6_0_x.Tests / dtest-upgrade-large jdk11 7/40 / test_bootstrap
FAILED:  dtest-upgrade-large.upgrade_tests.upgrade_through_versions_test.TestUpgrade_current_6_0_x_To_indev_6_0_x.Tests / dtest-upgrade-large jdk11 8/40 / test_bootstrap_multidc
FAILED:  dtest-upgrade-large.upgrade_tests.upgrade_through_versions_test.TestUpgrade_current_6_0_x_To_indev_6_0_x.Tests / dtest-upgrade-large jdk11 9/40 / test_parallel_upgrade
FAILED:  dtest-upgrade-large.upgrade_tests.upgrade_through_versions_test.TestUpgrade_current_6_0_x_To_indev_6_0_x.Tests / dtest-upgrade-large jdk11 10/40 / test_rolling_upgrade
FAILED:  dtest-latest.bootstrap_test.TestBootstrap.Tests / dtest-latest jdk21 7/64 / test_consistent_range_movement_false_with_rf1_should_succeed
FAILED:  dtest-latest.bootstrap_test.TestBootstrap.Tests / dtest-latest jdk17 7/64 / test_consistent_range_movement_false_with_rf1_should_succeed
FAILED:  dtest-latest.bootstrap_test.TestBootstrap.Tests / dtest-latest jdk11 7/64 / test_consistent_range_movement_false_with_rf1_should_succeed
FAILED:  dtest-latest.bootstrap_test.TestBootstrap.Tests / dtest-latest jdk11 6/64 / test_consistent_range_movement_true_with_rf1_should_fail
FAILED:  dtest-latest.bootstrap_test.TestBootstrap.Tests / dtest-latest jdk21 6/64 / test_consistent_range_movement_true_with_rf1_should_fail
FAILED:  dtest-latest.bootstrap_test.TestBootstrap.Tests / dtest-latest jdk17 6/64 / test_consistent_range_movement_true_with_rf1_should_fail
FAILED:  dtest-latest.client_request_metrics_test.TestClientRequestMetrics.Tests / dtest-latest jdk11 34/64 / test_client_request_metrics
FAILED:  dtest-latest.client_request_metrics_test.TestClientRequestMetrics.Tests / dtest-latest jdk21 34/64 / test_client_request_metrics
FAILED:  dtest-latest.client_request_metrics_test.TestClientRequestMetrics.Tests / dtest-latest jdk17 34/64 / test_client_request_metrics
FAILED:  dtest-latest.replace_address_test.TestReplaceAddress.Tests / dtest-latest jdk21 23/64 / test_replace_with_insufficient_replicas
FAILED:  dtest-latest.replace_address_test.TestReplaceAddress.Tests / dtest-latest jdk11 23/64 / test_replace_with_insufficient_replicas
FAILED:  dtest-latest.replace_address_test.TestReplaceAddress.Tests / dtest-latest jdk11 23/64 / test_replace_with_insufficient_replicas
FAILED:  dtest-latest.replace_address_test.TestReplaceAddress.Tests / dtest-latest jdk17 23/64 / test_replace_with_insufficient_replicas
FAILED:  dtest-latest.replace_address_test.TestReplaceAddress.Tests / dtest-latest jdk21 23/64 / test_replace_with_insufficient_replicas
FAILED:  dtest-latest.replace_address_test.TestReplaceAddress.Tests / dtest-latest jdk21 23/64 / test_replace_with_insufficient_replicas
FAILED:  dtest-latest.replace_address_test.TestReplaceAddress.Tests / dtest-latest jdk17 23/64 / test_replace_with_insufficient_replicas
FAILED:  dtest-latest.replace_address_test.TestReplaceAddress.Tests / dtest-latest jdk17 23/64 / test_replace_with_insufficient_replicas
FAILED:  dtest-latest.replace_address_test.TestReplaceAddress.Tests / dtest-latest jdk11 23/64 / test_replace_with_insufficient_replicas
FAILED:  junit.framework.TestSuite.Tests / jvm-dtest jdk11 5/16 / org.apache.cassandra.distributed.test.accord.MigrationFromAccordWriteRaceTest-_jdk11_x86_64
FAILED:  org.apache.cassandra.distributed.test.cql3.FullAccordInteropMultiNodeTableWalkTest.Tests / jvm-dtest jdk11 11/16 / test-_jdk11_x86_64
FAILED:  org.apache.cassandra.distributed.test.cql3.FullAccordInteropMultiNodeTableWalkTest.Tests / jvm-dtest jdk17 11/16 / test-_jdk17_x86_64
FAILED:  org.apache.cassandra.distributed.test.cql3.FullAccordInteropMultiNodeTableWalkTest.Tests / jvm-dtest jdk21 11/16 / test-_jdk21_x86_64
FAILED:  org.apache.cassandra.distributed.upgrade.ClusterMetadataUpgradeHarryTest.Tests / jvm-dtest-upgrade jdk11 4/6 / simpleUpgradeTest-cassandra.testtag_IS_UNDEFINED
FAILED:  org.apache.cassandra.fuzz.topology.AccordBootstrapTest.Tests / jvm-dtest jdk21 12/16 / terminated successfully-cassandra.testtag_IS_UNDEFINED
FAILED:  org.apache.cassandra.fuzz.topology.AccordBootstrapTest.Tests / jvm-dtest jdk11 12/16 / terminated successfully-cassandra.testtag_IS_UNDEFINED
FAILED:  org.apache.cassandra.fuzz.topology.AccordBootstrapTest.Tests / jvm-dtest jdk17 12/16 / terminated successfully-cassandra.testtag_IS_UNDEFINED
FAILED:  org.apache.cassandra.fuzz.topology.JournalGCTest.Tests / jvm-dtest jdk11 2/16 / journalGCTest-_jdk11_x86_64
FAILED:  org.apache.cassandra.fuzz.topology.JournalGCTest.Tests / jvm-dtest jdk17 2/16 / journalGCTest-_jdk17_x86_64
FAILED:  org.apache.cassandra.fuzz.topology.JournalGCTest.Tests / jvm-dtest jdk21 2/16 / journalGCTest-_jdk21_x86_64
FAILED:  org.apache.cassandra.index.accord.RouteIndexTest.Tests / test-system-keyspace-directory jdk21 11/20 / test-cassandra.testtag_IS_UNDEFINED
FAILED:  org.apache.cassandra.index.accord.RouteIndexTest.Tests / test-system-keyspace-directory jdk11 11/20 / test-cassandra.testtag_IS_UNDEFINED
FAILED:  org.apache.cassandra.index.accord.RouteIndexTest.Tests / test-oa jdk11 11/20 / test-cassandra.testtag_IS_UNDEFINED
FAILED:  org.apache.cassandra.index.accord.RouteIndexTest.Tests / test jdk21 11/20 / test-cassandra.testtag_IS_UNDEFINED
FAILED:  org.apache.cassandra.index.accord.RouteIndexTest.Tests / test-latest jdk17 11/20 / test-cassandra.testtag_IS_UNDEFINED
FAILED:  org.apache.cassandra.index.accord.RouteIndexTest.Tests / test-compression jdk21 11/20 / test-cassandra.testtag_IS_UNDEFINED
FAILED:  org.apache.cassandra.index.accord.RouteIndexTest.Tests / test-latest jdk11 11/20 / test-cassandra.testtag_IS_UNDEFINED

  -------------------------------------------------------------------------------
  For complete test report and logs see https://nightlies.apache.org/cassandra/Cassandra-6.0/12/