You are viewing a plain text version of this content. The canonical link for it is here.
Posted to builds@cassandra.apache.org by Apache Jenkins Server <je...@builds.apache.org> on 2026/09/06 15:13:56 UTC
Build complete: Cassandra-5.0 #664 [UNSTABLE] a0bbd43d3d72f252b86357045b56e1bd680f0e56
-------------------------------------------------------------------------------
Build Cassandra-5.0 #664 Still unstable
URL: https://ci-cassandra.apache.org/job/Cassandra-5.0/664/
-------------------------------------------------------------------------------
Changes:
No changes
-------------------------------------------------------------------------------
Failed Tests:
5 tests failed.
FAILED: dtest-large-latest.disk_balance_test.TestDiskBalance.Tests / dtest-large-latest jdk17 3/6 / test_disk_balance_bootstrap
FAILED: dtest.materialized_views_test.TestMaterializedViews.Tests / dtest jdk17 18/64 / test_drop_with_stopped_build
FAILED: dtest-novnode.secondary_indexes_test.TestSecondaryIndexes.Tests / dtest-novnode jdk11 35/64 / test_6924_dropping_ks
FAILED: dtest-novnode.repair_tests.repair_test.TestRepair.Tests / dtest-novnode jdk17 44/64 / test_wide_row_repair_lcs
FAILED: dtest-novnode.repair_tests.repair_test.TestRepair.Tests / dtest-novnode jdk11 44/64 / test_wide_row_repair_lcs
-------------------------------------------------------------------------------
For complete test report and logs see https://nightlies.apache.org/cassandra/Cassandra-5.0/664/