You are viewing a plain text version of this content. The canonical link for it is here.
Posted to dev@hbase.apache.org by Apache Jenkins Server <je...@builds.apache.org> on 2013/03/29 01:58:35 UTC
Build failed in Jenkins: HBase-TRUNK-on-Hadoop-2.0.0 #467
See <https://builds.apache.org/job/HBase-TRUNK-on-Hadoop-2.0.0/467/changes>
Changes:
[stack] Add note that filter language can work in shell too
[stack] Add note on running mlockall on startup to pin servers in physical mem
[tedyu] HBASE-8152 Avoid creating empty reference file when splitkey is outside the key range of a store file (clockfly)
[tedyu] HBASE-8063 Addendum adds HalfStoreFileReader#passesKeyRangeFilter()
[jxiang] HBASE-8144 Limit number of attempts to assign a region
[tedyu] HBASE-8164 TestTableLockManager fails intermittently in trunk builds (Ted Yu)
[tedyu] HBASE-8195 hbase.table.archive.directory reference should be removed from hbase-default.xml (Jean-Marc)
------------------------------------------
[...truncated 23122 lines...]
Forking command line: /bin/sh -c cd /x1/jenkins/jenkins-slave/workspace/HBase-TRUNK-on-Hadoop-2.0.0/trunk/hbase-server && /x1/jenkins/tools/java/jdk1.6.0_32-32/jre/bin/java -enableassertions -Xmx1900m -Djava.security.egd=file:/dev/./urandom -Djava.net.preferIPv4Stack=true -jar /x1/jenkins/jenkins-slave/workspace/HBase-TRUNK-on-Hadoop-2.0.0/trunk/hbase-server/target/surefire/surefirebooter4213117842028324304.jar /x1/jenkins/jenkins-slave/workspace/HBase-TRUNK-on-Hadoop-2.0.0/trunk/hbase-server/target/surefire/surefire4092837374230187250tmp /x1/jenkins/jenkins-slave/workspace/HBase-TRUNK-on-Hadoop-2.0.0/trunk/hbase-server/target/surefire/surefire_1872790173367951003730tmp
Running org.apache.hadoop.hbase.rest.TestRowResource
Tests run: 12, Failures: 0, Errors: 0, Skipped: 0, Time elapsed: 10.763 sec
Forking command line: /bin/sh -c cd /x1/jenkins/jenkins-slave/workspace/HBase-TRUNK-on-Hadoop-2.0.0/trunk/hbase-server && /x1/jenkins/tools/java/jdk1.6.0_32-32/jre/bin/java -enableassertions -Xmx1900m -Djava.security.egd=file:/dev/./urandom -Djava.net.preferIPv4Stack=true -jar /x1/jenkins/jenkins-slave/workspace/HBase-TRUNK-on-Hadoop-2.0.0/trunk/hbase-server/target/surefire/surefirebooter4092537442212325948.jar /x1/jenkins/jenkins-slave/workspace/HBase-TRUNK-on-Hadoop-2.0.0/trunk/hbase-server/target/surefire/surefire8784052089549852617tmp /x1/jenkins/jenkins-slave/workspace/HBase-TRUNK-on-Hadoop-2.0.0/trunk/hbase-server/target/surefire/surefire_1885346886859334156966tmp
Running org.apache.hadoop.hbase.rest.TestVersionResource
Tests run: 7, Failures: 0, Errors: 0, Skipped: 0, Time elapsed: 7.336 sec
Forking command line: /bin/sh -c cd /x1/jenkins/jenkins-slave/workspace/HBase-TRUNK-on-Hadoop-2.0.0/trunk/hbase-server && /x1/jenkins/tools/java/jdk1.6.0_32-32/jre/bin/java -enableassertions -Xmx1900m -Djava.security.egd=file:/dev/./urandom -Djava.net.preferIPv4Stack=true -jar /x1/jenkins/jenkins-slave/workspace/HBase-TRUNK-on-Hadoop-2.0.0/trunk/hbase-server/target/surefire/surefirebooter4585095247587328447.jar /x1/jenkins/jenkins-slave/workspace/HBase-TRUNK-on-Hadoop-2.0.0/trunk/hbase-server/target/surefire/surefire8586015626188413218tmp /x1/jenkins/jenkins-slave/workspace/HBase-TRUNK-on-Hadoop-2.0.0/trunk/hbase-server/target/surefire/surefire_1897249211091877175477tmp
Running org.apache.hadoop.hbase.rest.TestStatusResource
Tests run: 2, Failures: 0, Errors: 0, Skipped: 0, Time elapsed: 9.33 sec
Forking command line: /bin/sh -c cd /x1/jenkins/jenkins-slave/workspace/HBase-TRUNK-on-Hadoop-2.0.0/trunk/hbase-server && /x1/jenkins/tools/java/jdk1.6.0_32-32/jre/bin/java -enableassertions -Xmx1900m -Djava.security.egd=file:/dev/./urandom -Djava.net.preferIPv4Stack=true -jar /x1/jenkins/jenkins-slave/workspace/HBase-TRUNK-on-Hadoop-2.0.0/trunk/hbase-server/target/surefire/surefirebooter45886665495472287.jar /x1/jenkins/jenkins-slave/workspace/HBase-TRUNK-on-Hadoop-2.0.0/trunk/hbase-server/target/surefire/surefire5497023848993900420tmp /x1/jenkins/jenkins-slave/workspace/HBase-TRUNK-on-Hadoop-2.0.0/trunk/hbase-server/target/surefire/surefire_1901326932622922377533tmp
Running org.apache.hadoop.hbase.rest.TestScannerResource
Tests run: 5, Failures: 0, Errors: 0, Skipped: 0, Time elapsed: 20.271 sec
Forking command line: /bin/sh -c cd /x1/jenkins/jenkins-slave/workspace/HBase-TRUNK-on-Hadoop-2.0.0/trunk/hbase-server && /x1/jenkins/tools/java/jdk1.6.0_32-32/jre/bin/java -enableassertions -Xmx1900m -Djava.security.egd=file:/dev/./urandom -Djava.net.preferIPv4Stack=true -jar /x1/jenkins/jenkins-slave/workspace/HBase-TRUNK-on-Hadoop-2.0.0/trunk/hbase-server/target/surefire/surefirebooter1591846263356865525.jar /x1/jenkins/jenkins-slave/workspace/HBase-TRUNK-on-Hadoop-2.0.0/trunk/hbase-server/target/surefire/surefire5831300268116002505tmp /x1/jenkins/jenkins-slave/workspace/HBase-TRUNK-on-Hadoop-2.0.0/trunk/hbase-server/target/surefire/surefire_1914701649530957586347tmp
Running org.apache.hadoop.hbase.rest.TestScannersWithFilters
Tests run: 10, Failures: 0, Errors: 0, Skipped: 0, Time elapsed: 12.555 sec
Forking command line: /bin/sh -c cd /x1/jenkins/jenkins-slave/workspace/HBase-TRUNK-on-Hadoop-2.0.0/trunk/hbase-server && /x1/jenkins/tools/java/jdk1.6.0_32-32/jre/bin/java -enableassertions -Xmx1900m -Djava.security.egd=file:/dev/./urandom -Djava.net.preferIPv4Stack=true -jar /x1/jenkins/jenkins-slave/workspace/HBase-TRUNK-on-Hadoop-2.0.0/trunk/hbase-server/target/surefire/surefirebooter8548391072301514456.jar /x1/jenkins/jenkins-slave/workspace/HBase-TRUNK-on-Hadoop-2.0.0/trunk/hbase-server/target/surefire/surefire2672745938343980176tmp /x1/jenkins/jenkins-slave/workspace/HBase-TRUNK-on-Hadoop-2.0.0/trunk/hbase-server/target/surefire/surefire_1926200408877687255014tmp
Running org.apache.hadoop.hbase.trace.TestHTraceHooks
Tests run: 1, Failures: 0, Errors: 0, Skipped: 0, Time elapsed: 7.634 sec
Forking command line: /bin/sh -c cd /x1/jenkins/jenkins-slave/workspace/HBase-TRUNK-on-Hadoop-2.0.0/trunk/hbase-server && /x1/jenkins/tools/java/jdk1.6.0_32-32/jre/bin/java -enableassertions -Xmx1900m -Djava.security.egd=file:/dev/./urandom -Djava.net.preferIPv4Stack=true -jar /x1/jenkins/jenkins-slave/workspace/HBase-TRUNK-on-Hadoop-2.0.0/trunk/hbase-server/target/surefire/surefirebooter4346093564272302006.jar /x1/jenkins/jenkins-slave/workspace/HBase-TRUNK-on-Hadoop-2.0.0/trunk/hbase-server/target/surefire/surefire876524204220781666tmp /x1/jenkins/jenkins-slave/workspace/HBase-TRUNK-on-Hadoop-2.0.0/trunk/hbase-server/target/surefire/surefire_1938968445046570601578tmp
Running org.apache.hadoop.hbase.io.hfile.TestHFileSeek
Tests run: 1, Failures: 0, Errors: 0, Skipped: 0, Time elapsed: 4.854 sec
Forking command line: /bin/sh -c cd /x1/jenkins/jenkins-slave/workspace/HBase-TRUNK-on-Hadoop-2.0.0/trunk/hbase-server && /x1/jenkins/tools/java/jdk1.6.0_32-32/jre/bin/java -enableassertions -Xmx1900m -Djava.security.egd=file:/dev/./urandom -Djava.net.preferIPv4Stack=true -jar /x1/jenkins/jenkins-slave/workspace/HBase-TRUNK-on-Hadoop-2.0.0/trunk/hbase-server/target/surefire/surefirebooter3904584924182626936.jar /x1/jenkins/jenkins-slave/workspace/HBase-TRUNK-on-Hadoop-2.0.0/trunk/hbase-server/target/surefire/surefire5220102715371736863tmp /x1/jenkins/jenkins-slave/workspace/HBase-TRUNK-on-Hadoop-2.0.0/trunk/hbase-server/target/surefire/surefire_1945070676597149344141tmp
Running org.apache.hadoop.hbase.io.hfile.TestHFileBlockIndex
Tests run: 10, Failures: 0, Errors: 0, Skipped: 0, Time elapsed: 7.829 sec
Forking command line: /bin/sh -c cd /x1/jenkins/jenkins-slave/workspace/HBase-TRUNK-on-Hadoop-2.0.0/trunk/hbase-server && /x1/jenkins/tools/java/jdk1.6.0_32-32/jre/bin/java -enableassertions -Xmx1900m -Djava.security.egd=file:/dev/./urandom -Djava.net.preferIPv4Stack=true -jar /x1/jenkins/jenkins-slave/workspace/HBase-TRUNK-on-Hadoop-2.0.0/trunk/hbase-server/target/surefire/surefirebooter8057233597610551016.jar /x1/jenkins/jenkins-slave/workspace/HBase-TRUNK-on-Hadoop-2.0.0/trunk/hbase-server/target/surefire/surefire3924107884322702831tmp /x1/jenkins/jenkins-slave/workspace/HBase-TRUNK-on-Hadoop-2.0.0/trunk/hbase-server/target/surefire/surefire_1956729140742266588884tmp
Running org.apache.hadoop.hbase.io.hfile.TestHFilePerformance
Tests run: 1, Failures: 0, Errors: 0, Skipped: 0, Time elapsed: 5.737 sec
Forking command line: /bin/sh -c cd /x1/jenkins/jenkins-slave/workspace/HBase-TRUNK-on-Hadoop-2.0.0/trunk/hbase-server && /x1/jenkins/tools/java/jdk1.6.0_32-32/jre/bin/java -enableassertions -Xmx1900m -Djava.security.egd=file:/dev/./urandom -Djava.net.preferIPv4Stack=true -jar /x1/jenkins/jenkins-slave/workspace/HBase-TRUNK-on-Hadoop-2.0.0/trunk/hbase-server/target/surefire/surefirebooter2581421784016612924.jar /x1/jenkins/jenkins-slave/workspace/HBase-TRUNK-on-Hadoop-2.0.0/trunk/hbase-server/target/surefire/surefire8341211298001351214tmp /x1/jenkins/jenkins-slave/workspace/HBase-TRUNK-on-Hadoop-2.0.0/trunk/hbase-server/target/surefire/surefire_1966226267020454549006tmp
Running org.apache.hadoop.hbase.io.hfile.TestForceCacheImportantBlocks
Tests run: 2, Failures: 0, Errors: 0, Skipped: 0, Time elapsed: 20.591 sec
Forking command line: /bin/sh -c cd /x1/jenkins/jenkins-slave/workspace/HBase-TRUNK-on-Hadoop-2.0.0/trunk/hbase-server && /x1/jenkins/tools/java/jdk1.6.0_32-32/jre/bin/java -enableassertions -Xmx1900m -Djava.security.egd=file:/dev/./urandom -Djava.net.preferIPv4Stack=true -jar /x1/jenkins/jenkins-slave/workspace/HBase-TRUNK-on-Hadoop-2.0.0/trunk/hbase-server/target/surefire/surefirebooter8407889604321166929.jar /x1/jenkins/jenkins-slave/workspace/HBase-TRUNK-on-Hadoop-2.0.0/trunk/hbase-server/target/surefire/surefire586715839384363306tmp /x1/jenkins/jenkins-slave/workspace/HBase-TRUNK-on-Hadoop-2.0.0/trunk/hbase-server/target/surefire/surefire_1977476528690878494348tmp
Running org.apache.hadoop.hbase.io.hfile.TestCacheOnWrite
Tests run: 36, Failures: 0, Errors: 0, Skipped: 0, Time elapsed: 32.281 sec
Forking command line: /bin/sh -c cd /x1/jenkins/jenkins-slave/workspace/HBase-TRUNK-on-Hadoop-2.0.0/trunk/hbase-server && /x1/jenkins/tools/java/jdk1.6.0_32-32/jre/bin/java -enableassertions -Xmx1900m -Djava.security.egd=file:/dev/./urandom -Djava.net.preferIPv4Stack=true -jar /x1/jenkins/jenkins-slave/workspace/HBase-TRUNK-on-Hadoop-2.0.0/trunk/hbase-server/target/surefire/surefirebooter568074133599633371.jar /x1/jenkins/jenkins-slave/workspace/HBase-TRUNK-on-Hadoop-2.0.0/trunk/hbase-server/target/surefire/surefire1880143740091773701tmp /x1/jenkins/jenkins-slave/workspace/HBase-TRUNK-on-Hadoop-2.0.0/trunk/hbase-server/target/surefire/surefire_1987548282735559826275tmp
Running org.apache.hadoop.hbase.io.hfile.slab.TestSlabCache
Tests run: 7, Failures: 0, Errors: 0, Skipped: 0, Time elapsed: 17.463 sec
Forking command line: /bin/sh -c cd /x1/jenkins/jenkins-slave/workspace/HBase-TRUNK-on-Hadoop-2.0.0/trunk/hbase-server && /x1/jenkins/tools/java/jdk1.6.0_32-32/jre/bin/java -enableassertions -Xmx1900m -Djava.security.egd=file:/dev/./urandom -Djava.net.preferIPv4Stack=true -jar /x1/jenkins/jenkins-slave/workspace/HBase-TRUNK-on-Hadoop-2.0.0/trunk/hbase-server/target/surefire/surefirebooter5102824359481695546.jar /x1/jenkins/jenkins-slave/workspace/HBase-TRUNK-on-Hadoop-2.0.0/trunk/hbase-server/target/surefire/surefire1441281747195743992tmp /x1/jenkins/jenkins-slave/workspace/HBase-TRUNK-on-Hadoop-2.0.0/trunk/hbase-server/target/surefire/surefire_1997030804871294993561tmp
Running org.apache.hadoop.hbase.security.access.TestAccessController
Tests run: 36, Failures: 0, Errors: 0, Skipped: 0, Time elapsed: 152.101 sec
Forking command line: /bin/sh -c cd /x1/jenkins/jenkins-slave/workspace/HBase-TRUNK-on-Hadoop-2.0.0/trunk/hbase-server && /x1/jenkins/tools/java/jdk1.6.0_32-32/jre/bin/java -enableassertions -Xmx1900m -Djava.security.egd=file:/dev/./urandom -Djava.net.preferIPv4Stack=true -jar /x1/jenkins/jenkins-slave/workspace/HBase-TRUNK-on-Hadoop-2.0.0/trunk/hbase-server/target/surefire/surefirebooter2684450678167716236.jar /x1/jenkins/jenkins-slave/workspace/HBase-TRUNK-on-Hadoop-2.0.0/trunk/hbase-server/target/surefire/surefire8216967809105101455tmp /x1/jenkins/jenkins-slave/workspace/HBase-TRUNK-on-Hadoop-2.0.0/trunk/hbase-server/target/surefire/surefire_2001106854250141366395tmp
Running org.apache.hadoop.hbase.io.hfile.TestHFileBlock
Tests run: 14, Failures: 0, Errors: 0, Skipped: 0, Time elapsed: 49.705 sec
Forking command line: /bin/sh -c cd /x1/jenkins/jenkins-slave/workspace/HBase-TRUNK-on-Hadoop-2.0.0/trunk/hbase-server && /x1/jenkins/tools/java/jdk1.6.0_32-32/jre/bin/java -enableassertions -Xmx1900m -Djava.security.egd=file:/dev/./urandom -Djava.net.preferIPv4Stack=true -jar /x1/jenkins/jenkins-slave/workspace/HBase-TRUNK-on-Hadoop-2.0.0/trunk/hbase-server/target/surefire/surefirebooter7795895815831287965.jar /x1/jenkins/jenkins-slave/workspace/HBase-TRUNK-on-Hadoop-2.0.0/trunk/hbase-server/target/surefire/surefire5177024744419323804tmp /x1/jenkins/jenkins-slave/workspace/HBase-TRUNK-on-Hadoop-2.0.0/trunk/hbase-server/target/surefire/surefire_2012043900438198100909tmp
Running org.apache.hadoop.hbase.io.hfile.TestScannerSelectionUsingTTL
Tests run: 6, Failures: 0, Errors: 0, Skipped: 0, Time elapsed: 62.1 sec
Forking command line: /bin/sh -c cd /x1/jenkins/jenkins-slave/workspace/HBase-TRUNK-on-Hadoop-2.0.0/trunk/hbase-server && /x1/jenkins/tools/java/jdk1.6.0_32-32/jre/bin/java -enableassertions -Xmx1900m -Djava.security.egd=file:/dev/./urandom -Djava.net.preferIPv4Stack=true -jar /x1/jenkins/jenkins-slave/workspace/HBase-TRUNK-on-Hadoop-2.0.0/trunk/hbase-server/target/surefire/surefirebooter2975394169835746331.jar /x1/jenkins/jenkins-slave/workspace/HBase-TRUNK-on-Hadoop-2.0.0/trunk/hbase-server/target/surefire/surefire7256924402960165919tmp /x1/jenkins/jenkins-slave/workspace/HBase-TRUNK-on-Hadoop-2.0.0/trunk/hbase-server/target/surefire/surefire_2027204515754416758741tmp
Running org.apache.hadoop.hbase.io.TestFileLink
Tests run: 3, Failures: 0, Errors: 0, Skipped: 0, Time elapsed: 15.428 sec
Forking command line: /bin/sh -c cd /x1/jenkins/jenkins-slave/workspace/HBase-TRUNK-on-Hadoop-2.0.0/trunk/hbase-server && /x1/jenkins/tools/java/jdk1.6.0_32-32/jre/bin/java -enableassertions -Xmx1900m -Djava.security.egd=file:/dev/./urandom -Djava.net.preferIPv4Stack=true -jar /x1/jenkins/jenkins-slave/workspace/HBase-TRUNK-on-Hadoop-2.0.0/trunk/hbase-server/target/surefire/surefirebooter3328131691574951199.jar /x1/jenkins/jenkins-slave/workspace/HBase-TRUNK-on-Hadoop-2.0.0/trunk/hbase-server/target/surefire/surefire7355262575190633148tmp /x1/jenkins/jenkins-slave/workspace/HBase-TRUNK-on-Hadoop-2.0.0/trunk/hbase-server/target/surefire/surefire_2038776813488570126069tmp
Running org.apache.hadoop.hbase.io.hfile.slab.TestSingleSizeCache
Tests run: 5, Failures: 0, Errors: 0, Skipped: 0, Time elapsed: 30.684 sec
Forking command line: /bin/sh -c cd /x1/jenkins/jenkins-slave/workspace/HBase-TRUNK-on-Hadoop-2.0.0/trunk/hbase-server && /x1/jenkins/tools/java/jdk1.6.0_32-32/jre/bin/java -enableassertions -Xmx1900m -Djava.security.egd=file:/dev/./urandom -Djava.net.preferIPv4Stack=true -jar /x1/jenkins/jenkins-slave/workspace/HBase-TRUNK-on-Hadoop-2.0.0/trunk/hbase-server/target/surefire/surefirebooter8865000876450649900.jar /x1/jenkins/jenkins-slave/workspace/HBase-TRUNK-on-Hadoop-2.0.0/trunk/hbase-server/target/surefire/surefire7504728550699344272tmp /x1/jenkins/jenkins-slave/workspace/HBase-TRUNK-on-Hadoop-2.0.0/trunk/hbase-server/target/surefire/surefire_2043026420296367234216tmp
Running org.apache.hadoop.hbase.io.encoding.TestEncodedSeekers
Tests run: 10, Failures: 0, Errors: 0, Skipped: 0, Time elapsed: 33.977 sec
Forking command line: /bin/sh -c cd /x1/jenkins/jenkins-slave/workspace/HBase-TRUNK-on-Hadoop-2.0.0/trunk/hbase-server && /x1/jenkins/tools/java/jdk1.6.0_32-32/jre/bin/java -enableassertions -Xmx1900m -Djava.security.egd=file:/dev/./urandom -Djava.net.preferIPv4Stack=true -jar /x1/jenkins/jenkins-slave/workspace/HBase-TRUNK-on-Hadoop-2.0.0/trunk/hbase-server/target/surefire/surefirebooter3483145727979155943.jar /x1/jenkins/jenkins-slave/workspace/HBase-TRUNK-on-Hadoop-2.0.0/trunk/hbase-server/target/surefire/surefire4140882311354369169tmp /x1/jenkins/jenkins-slave/workspace/HBase-TRUNK-on-Hadoop-2.0.0/trunk/hbase-server/target/surefire/surefire_2054912739820162985572tmp
Running org.apache.hadoop.hbase.io.encoding.TestBufferedDataBlockEncoder
Tests run: 1, Failures: 0, Errors: 0, Skipped: 0, Time elapsed: 20.078 sec
Forking command line: /bin/sh -c cd /x1/jenkins/jenkins-slave/workspace/HBase-TRUNK-on-Hadoop-2.0.0/trunk/hbase-server && /x1/jenkins/tools/java/jdk1.6.0_32-32/jre/bin/java -enableassertions -Xmx1900m -Djava.security.egd=file:/dev/./urandom -Djava.net.preferIPv4Stack=true -jar /x1/jenkins/jenkins-slave/workspace/HBase-TRUNK-on-Hadoop-2.0.0/trunk/hbase-server/target/surefire/surefirebooter1788444186030560761.jar /x1/jenkins/jenkins-slave/workspace/HBase-TRUNK-on-Hadoop-2.0.0/trunk/hbase-server/target/surefire/surefire1448482815922855137tmp /x1/jenkins/jenkins-slave/workspace/HBase-TRUNK-on-Hadoop-2.0.0/trunk/hbase-server/target/surefire/surefire_2063831927165187650595tmp
Running org.apache.hadoop.hbase.TestRegionRebalancing
Tests run: 2, Failures: 0, Errors: 0, Skipped: 0, Time elapsed: 24.321 sec
Forking command line: /bin/sh -c cd /x1/jenkins/jenkins-slave/workspace/HBase-TRUNK-on-Hadoop-2.0.0/trunk/hbase-server && /x1/jenkins/tools/java/jdk1.6.0_32-32/jre/bin/java -enableassertions -Xmx1900m -Djava.security.egd=file:/dev/./urandom -Djava.net.preferIPv4Stack=true -jar /x1/jenkins/jenkins-slave/workspace/HBase-TRUNK-on-Hadoop-2.0.0/trunk/hbase-server/target/surefire/surefirebooter3129821016275791586.jar /x1/jenkins/jenkins-slave/workspace/HBase-TRUNK-on-Hadoop-2.0.0/trunk/hbase-server/target/surefire/surefire4454554349855741321tmp /x1/jenkins/jenkins-slave/workspace/HBase-TRUNK-on-Hadoop-2.0.0/trunk/hbase-server/target/surefire/surefire_2078310720381306445178tmp
Running org.apache.hadoop.hbase.io.encoding.TestLoadAndSwitchEncodeOnDisk
Tests run: 1, Failures: 0, Errors: 0, Skipped: 0, Time elapsed: 30.795 sec
Forking command line: /bin/sh -c cd /x1/jenkins/jenkins-slave/workspace/HBase-TRUNK-on-Hadoop-2.0.0/trunk/hbase-server && /x1/jenkins/tools/java/jdk1.6.0_32-32/jre/bin/java -enableassertions -Xmx1900m -Djava.security.egd=file:/dev/./urandom -Djava.net.preferIPv4Stack=true -jar /x1/jenkins/jenkins-slave/workspace/HBase-TRUNK-on-Hadoop-2.0.0/trunk/hbase-server/target/surefire/surefirebooter1745901450643388010.jar /x1/jenkins/jenkins-slave/workspace/HBase-TRUNK-on-Hadoop-2.0.0/trunk/hbase-server/target/surefire/surefire1494258745257816017tmp /x1/jenkins/jenkins-slave/workspace/HBase-TRUNK-on-Hadoop-2.0.0/trunk/hbase-server/target/surefire/surefire_208745973276241975964tmp
Running org.apache.hadoop.hbase.mapred.TestTableInputFormat
Tests run: 10, Failures: 0, Errors: 0, Skipped: 0, Time elapsed: 17.389 sec
Forking command line: /bin/sh -c cd /x1/jenkins/jenkins-slave/workspace/HBase-TRUNK-on-Hadoop-2.0.0/trunk/hbase-server && /x1/jenkins/tools/java/jdk1.6.0_32-32/jre/bin/java -enableassertions -Xmx1900m -Djava.security.egd=file:/dev/./urandom -Djava.net.preferIPv4Stack=true -jar /x1/jenkins/jenkins-slave/workspace/HBase-TRUNK-on-Hadoop-2.0.0/trunk/hbase-server/target/surefire/surefirebooter6469138451867332891.jar /x1/jenkins/jenkins-slave/workspace/HBase-TRUNK-on-Hadoop-2.0.0/trunk/hbase-server/target/surefire/surefire218081202764880382tmp /x1/jenkins/jenkins-slave/workspace/HBase-TRUNK-on-Hadoop-2.0.0/trunk/hbase-server/target/surefire/surefire_2093209522436746195746tmp
Running org.apache.hadoop.hbase.io.encoding.TestDataBlockEncoders
Tests run: 12, Failures: 0, Errors: 0, Skipped: 0, Time elapsed: 94.771 sec
Forking command line: /bin/sh -c cd /x1/jenkins/jenkins-slave/workspace/HBase-TRUNK-on-Hadoop-2.0.0/trunk/hbase-server && /x1/jenkins/tools/java/jdk1.6.0_32-32/jre/bin/java -enableassertions -Xmx1900m -Djava.security.egd=file:/dev/./urandom -Djava.net.preferIPv4Stack=true -jar /x1/jenkins/jenkins-slave/workspace/HBase-TRUNK-on-Hadoop-2.0.0/trunk/hbase-server/target/surefire/surefirebooter5837426981469798128.jar /x1/jenkins/jenkins-slave/workspace/HBase-TRUNK-on-Hadoop-2.0.0/trunk/hbase-server/target/surefire/surefire2998879499682381216tmp /x1/jenkins/jenkins-slave/workspace/HBase-TRUNK-on-Hadoop-2.0.0/trunk/hbase-server/target/surefire/surefire_2104004917078353301784tmp
Running org.apache.hadoop.hbase.mapred.TestTableMapReduce
Tests run: 1, Failures: 0, Errors: 0, Skipped: 0, Time elapsed: 40.192 sec
Forking command line: /bin/sh -c cd /x1/jenkins/jenkins-slave/workspace/HBase-TRUNK-on-Hadoop-2.0.0/trunk/hbase-server && /x1/jenkins/tools/java/jdk1.6.0_32-32/jre/bin/java -enableassertions -Xmx1900m -Djava.security.egd=file:/dev/./urandom -Djava.net.preferIPv4Stack=true -jar /x1/jenkins/jenkins-slave/workspace/HBase-TRUNK-on-Hadoop-2.0.0/trunk/hbase-server/target/surefire/surefirebooter5008260606776399818.jar /x1/jenkins/jenkins-slave/workspace/HBase-TRUNK-on-Hadoop-2.0.0/trunk/hbase-server/target/surefire/surefire7947162403008500112tmp /x1/jenkins/jenkins-slave/workspace/HBase-TRUNK-on-Hadoop-2.0.0/trunk/hbase-server/target/surefire/surefire_2115370322019561613558tmp
Running org.apache.hadoop.hbase.replication.TestReplicationDisableInactivePeer
Tests run: 1, Failures: 0, Errors: 0, Skipped: 0, Time elapsed: 31.517 sec
Forking command line: /bin/sh -c cd /x1/jenkins/jenkins-slave/workspace/HBase-TRUNK-on-Hadoop-2.0.0/trunk/hbase-server && /x1/jenkins/tools/java/jdk1.6.0_32-32/jre/bin/java -enableassertions -Xmx1900m -Djava.security.egd=file:/dev/./urandom -Djava.net.preferIPv4Stack=true -jar /x1/jenkins/jenkins-slave/workspace/HBase-TRUNK-on-Hadoop-2.0.0/trunk/hbase-server/target/surefire/surefirebooter5445515847124602447.jar /x1/jenkins/jenkins-slave/workspace/HBase-TRUNK-on-Hadoop-2.0.0/trunk/hbase-server/target/surefire/surefire8666798568342527706tmp /x1/jenkins/jenkins-slave/workspace/HBase-TRUNK-on-Hadoop-2.0.0/trunk/hbase-server/target/surefire/surefire_2124449057852415625592tmp
Running org.apache.hadoop.hbase.replication.TestReplicationZookeeper
Tests run: 4, Failures: 0, Errors: 0, Skipped: 0, Time elapsed: 0.934 sec
Forking command line: /bin/sh -c cd /x1/jenkins/jenkins-slave/workspace/HBase-TRUNK-on-Hadoop-2.0.0/trunk/hbase-server && /x1/jenkins/tools/java/jdk1.6.0_32-32/jre/bin/java -enableassertions -Xmx1900m -Djava.security.egd=file:/dev/./urandom -Djava.net.preferIPv4Stack=true -jar /x1/jenkins/jenkins-slave/workspace/HBase-TRUNK-on-Hadoop-2.0.0/trunk/hbase-server/target/surefire/surefirebooter8862862079816777327.jar /x1/jenkins/jenkins-slave/workspace/HBase-TRUNK-on-Hadoop-2.0.0/trunk/hbase-server/target/surefire/surefire4643232471042745872tmp /x1/jenkins/jenkins-slave/workspace/HBase-TRUNK-on-Hadoop-2.0.0/trunk/hbase-server/target/surefire/surefire_2131840719744518855863tmp
Running org.apache.hadoop.hbase.replication.regionserver.TestReplicationSink
Tests run: 5, Failures: 0, Errors: 0, Skipped: 0, Time elapsed: 9.706 sec
Forking command line: /bin/sh -c cd /x1/jenkins/jenkins-slave/workspace/HBase-TRUNK-on-Hadoop-2.0.0/trunk/hbase-server && /x1/jenkins/tools/java/jdk1.6.0_32-32/jre/bin/java -enableassertions -Xmx1900m -Djava.security.egd=file:/dev/./urandom -Djava.net.preferIPv4Stack=true -jar /x1/jenkins/jenkins-slave/workspace/HBase-TRUNK-on-Hadoop-2.0.0/trunk/hbase-server/target/surefire/surefirebooter6354948580072812520.jar /x1/jenkins/jenkins-slave/workspace/HBase-TRUNK-on-Hadoop-2.0.0/trunk/hbase-server/target/surefire/surefire8285475546875182160tmp /x1/jenkins/jenkins-slave/workspace/HBase-TRUNK-on-Hadoop-2.0.0/trunk/hbase-server/target/surefire/surefire_2145962303418625405328tmp
Running org.apache.hadoop.hbase.replication.regionserver.TestReplicationSourceManager
Tests run: 2, Failures: 0, Errors: 0, Skipped: 0, Time elapsed: 1.226 sec
Forking command line: /bin/sh -c cd /x1/jenkins/jenkins-slave/workspace/HBase-TRUNK-on-Hadoop-2.0.0/trunk/hbase-server && /x1/jenkins/tools/java/jdk1.6.0_32-32/jre/bin/java -enableassertions -Xmx1900m -Djava.security.egd=file:/dev/./urandom -Djava.net.preferIPv4Stack=true -jar /x1/jenkins/jenkins-slave/workspace/HBase-TRUNK-on-Hadoop-2.0.0/trunk/hbase-server/target/surefire/surefirebooter4545544056846441329.jar /x1/jenkins/jenkins-slave/workspace/HBase-TRUNK-on-Hadoop-2.0.0/trunk/hbase-server/target/surefire/surefire1856726176684858819tmp /x1/jenkins/jenkins-slave/workspace/HBase-TRUNK-on-Hadoop-2.0.0/trunk/hbase-server/target/surefire/surefire_2156943248069212468166tmp
Running org.apache.hadoop.hbase.replication.TestReplicationSource
Tests run: 1, Failures: 0, Errors: 0, Skipped: 0, Time elapsed: 2.825 sec
Forking command line: /bin/sh -c cd /x1/jenkins/jenkins-slave/workspace/HBase-TRUNK-on-Hadoop-2.0.0/trunk/hbase-server && /x1/jenkins/tools/java/jdk1.6.0_32-32/jre/bin/java -enableassertions -Xmx1900m -Djava.security.egd=file:/dev/./urandom -Djava.net.preferIPv4Stack=true -jar /x1/jenkins/jenkins-slave/workspace/HBase-TRUNK-on-Hadoop-2.0.0/trunk/hbase-server/target/surefire/surefirebooter4514598131114559697.jar /x1/jenkins/jenkins-slave/workspace/HBase-TRUNK-on-Hadoop-2.0.0/trunk/hbase-server/target/surefire/surefire1784649579707055292tmp /x1/jenkins/jenkins-slave/workspace/HBase-TRUNK-on-Hadoop-2.0.0/trunk/hbase-server/target/surefire/surefire_2168860069449245620199tmp
Running org.apache.hadoop.hbase.replication.TestMultiSlaveReplication
Tests run: 1, Failures: 0, Errors: 0, Skipped: 0, Time elapsed: 23.345 sec
Forking command line: /bin/sh -c cd /x1/jenkins/jenkins-slave/workspace/HBase-TRUNK-on-Hadoop-2.0.0/trunk/hbase-server && /x1/jenkins/tools/java/jdk1.6.0_32-32/jre/bin/java -enableassertions -Xmx1900m -Djava.security.egd=file:/dev/./urandom -Djava.net.preferIPv4Stack=true -jar /x1/jenkins/jenkins-slave/workspace/HBase-TRUNK-on-Hadoop-2.0.0/trunk/hbase-server/target/surefire/surefirebooter5854699873228896442.jar /x1/jenkins/jenkins-slave/workspace/HBase-TRUNK-on-Hadoop-2.0.0/trunk/hbase-server/target/surefire/surefire4587368721193958436tmp /x1/jenkins/jenkins-slave/workspace/HBase-TRUNK-on-Hadoop-2.0.0/trunk/hbase-server/target/surefire/surefire_2176493994540642397341tmp
Running org.apache.hadoop.hbase.io.encoding.TestChangingEncoding
Tests run: 4, Failures: 0, Errors: 0, Skipped: 0, Time elapsed: 151.553 sec
Forking command line: /bin/sh -c cd /x1/jenkins/jenkins-slave/workspace/HBase-TRUNK-on-Hadoop-2.0.0/trunk/hbase-server && /x1/jenkins/tools/java/jdk1.6.0_32-32/jre/bin/java -enableassertions -Xmx1900m -Djava.security.egd=file:/dev/./urandom -Djava.net.preferIPv4Stack=true -jar /x1/jenkins/jenkins-slave/workspace/HBase-TRUNK-on-Hadoop-2.0.0/trunk/hbase-server/target/surefire/surefirebooter1085039599253003146.jar /x1/jenkins/jenkins-slave/workspace/HBase-TRUNK-on-Hadoop-2.0.0/trunk/hbase-server/target/surefire/surefire2401110724832910661tmp /x1/jenkins/jenkins-slave/workspace/HBase-TRUNK-on-Hadoop-2.0.0/trunk/hbase-server/target/surefire/surefire_2181717607667605747201tmp
Forking command line: /bin/sh -c cd /x1/jenkins/jenkins-slave/workspace/HBase-TRUNK-on-Hadoop-2.0.0/trunk/hbase-server && /x1/jenkins/tools/java/jdk1.6.0_32-32/jre/bin/java -enableassertions -Xmx1900m -Djava.security.egd=file:/dev/./urandom -Djava.net.preferIPv4Stack=true -jar /x1/jenkins/jenkins-slave/workspace/HBase-TRUNK-on-Hadoop-2.0.0/trunk/hbase-server/target/surefire/surefirebooter7473895399812627256.jar /x1/jenkins/jenkins-slave/workspace/HBase-TRUNK-on-Hadoop-2.0.0/trunk/hbase-server/target/surefire/surefire1925506883040152340tmp /x1/jenkins/jenkins-slave/workspace/HBase-TRUNK-on-Hadoop-2.0.0/trunk/hbase-server/target/surefire/surefire_2194200444115320647977tmp
Running org.apache.hadoop.hbase.util.TestMergeTool
Tests run: 1, Failures: 0, Errors: 0, Skipped: 0, Time elapsed: 13.092 sec
Forking command line: /bin/sh -c cd /x1/jenkins/jenkins-slave/workspace/HBase-TRUNK-on-Hadoop-2.0.0/trunk/hbase-server && /x1/jenkins/tools/java/jdk1.6.0_32-32/jre/bin/java -enableassertions -Xmx1900m -Djava.security.egd=file:/dev/./urandom -Djava.net.preferIPv4Stack=true -jar /x1/jenkins/jenkins-slave/workspace/HBase-TRUNK-on-Hadoop-2.0.0/trunk/hbase-server/target/surefire/surefirebooter4516551397839602370.jar /x1/jenkins/jenkins-slave/workspace/HBase-TRUNK-on-Hadoop-2.0.0/trunk/hbase-server/target/surefire/surefire2176009935882594497tmp /x1/jenkins/jenkins-slave/workspace/HBase-TRUNK-on-Hadoop-2.0.0/trunk/hbase-server/target/surefire/surefire_2204177202607298799530tmp
Running org.apache.hadoop.hbase.util.TestFSTableDescriptors
Tests run: 12, Failures: 0, Errors: 0, Skipped: 0, Time elapsed: 1.251 sec
Running org.apache.hadoop.hbase.replication.TestMasterReplication
Tests run: 2, Failures: 0, Errors: 0, Skipped: 0, Time elapsed: 37.688 sec
Forking command line: /bin/sh -c cd /x1/jenkins/jenkins-slave/workspace/HBase-TRUNK-on-Hadoop-2.0.0/trunk/hbase-server && /x1/jenkins/tools/java/jdk1.6.0_32-32/jre/bin/java -enableassertions -Xmx1900m -Djava.security.egd=file:/dev/./urandom -Djava.net.preferIPv4Stack=true -jar /x1/jenkins/jenkins-slave/workspace/HBase-TRUNK-on-Hadoop-2.0.0/trunk/hbase-server/target/surefire/surefirebooter7771451896303431429.jar /x1/jenkins/jenkins-slave/workspace/HBase-TRUNK-on-Hadoop-2.0.0/trunk/hbase-server/target/surefire/surefire7561532684264139334tmp /x1/jenkins/jenkins-slave/workspace/HBase-TRUNK-on-Hadoop-2.0.0/trunk/hbase-server/target/surefire/surefire_2218483922145372565511tmp
Forking command line: /bin/sh -c cd /x1/jenkins/jenkins-slave/workspace/HBase-TRUNK-on-Hadoop-2.0.0/trunk/hbase-server && /x1/jenkins/tools/java/jdk1.6.0_32-32/jre/bin/java -enableassertions -Xmx1900m -Djava.security.egd=file:/dev/./urandom -Djava.net.preferIPv4Stack=true -jar /x1/jenkins/jenkins-slave/workspace/HBase-TRUNK-on-Hadoop-2.0.0/trunk/hbase-server/target/surefire/surefirebooter9120904979696285194.jar /x1/jenkins/jenkins-slave/workspace/HBase-TRUNK-on-Hadoop-2.0.0/trunk/hbase-server/target/surefire/surefire3570510909771429033tmp /x1/jenkins/jenkins-slave/workspace/HBase-TRUNK-on-Hadoop-2.0.0/trunk/hbase-server/target/surefire/surefire_2227514067456029995911tmp
Running org.apache.hadoop.hbase.replication.TestReplicationQueueFailoverCompressed
Tests run: 1, Failures: 0, Errors: 0, Skipped: 0, Time elapsed: 93.343 sec
Forking command line: /bin/sh -c cd /x1/jenkins/jenkins-slave/workspace/HBase-TRUNK-on-Hadoop-2.0.0/trunk/hbase-server && /x1/jenkins/tools/java/jdk1.6.0_32-32/jre/bin/java -enableassertions -Xmx1900m -Djava.security.egd=file:/dev/./urandom -Djava.net.preferIPv4Stack=true -jar /x1/jenkins/jenkins-slave/workspace/HBase-TRUNK-on-Hadoop-2.0.0/trunk/hbase-server/target/surefire/surefirebooter4190333261320647825.jar /x1/jenkins/jenkins-slave/workspace/HBase-TRUNK-on-Hadoop-2.0.0/trunk/hbase-server/target/surefire/surefire4129697595287290067tmp /x1/jenkins/jenkins-slave/workspace/HBase-TRUNK-on-Hadoop-2.0.0/trunk/hbase-server/target/surefire/surefire_2235210902986357246853tmp
Running org.apache.hadoop.hbase.util.TestIdLock
Tests run: 1, Failures: 0, Errors: 0, Skipped: 0, Time elapsed: 15.331 sec
Forking command line: /bin/sh -c cd /x1/jenkins/jenkins-slave/workspace/HBase-TRUNK-on-Hadoop-2.0.0/trunk/hbase-server && /x1/jenkins/tools/java/jdk1.6.0_32-32/jre/bin/java -enableassertions -Xmx1900m -Djava.security.egd=file:/dev/./urandom -Djava.net.preferIPv4Stack=true -jar /x1/jenkins/jenkins-slave/workspace/HBase-TRUNK-on-Hadoop-2.0.0/trunk/hbase-server/target/surefire/surefirebooter8022334045879999532.jar /x1/jenkins/jenkins-slave/workspace/HBase-TRUNK-on-Hadoop-2.0.0/trunk/hbase-server/target/surefire/surefire2021834970916037897tmp /x1/jenkins/jenkins-slave/workspace/HBase-TRUNK-on-Hadoop-2.0.0/trunk/hbase-server/target/surefire/surefire_2242137189385186476108tmp
Running org.apache.hadoop.hbase.util.TestMergeTable
Tests run: 1, Failures: 0, Errors: 0, Skipped: 0, Time elapsed: 16.312 sec
Forking command line: /bin/sh -c cd /x1/jenkins/jenkins-slave/workspace/HBase-TRUNK-on-Hadoop-2.0.0/trunk/hbase-server && /x1/jenkins/tools/java/jdk1.6.0_32-32/jre/bin/java -enableassertions -Xmx1900m -Djava.security.egd=file:/dev/./urandom -Djava.net.preferIPv4Stack=true -jar /x1/jenkins/jenkins-slave/workspace/HBase-TRUNK-on-Hadoop-2.0.0/trunk/hbase-server/target/surefire/surefirebooter8712655665373393018.jar /x1/jenkins/jenkins-slave/workspace/HBase-TRUNK-on-Hadoop-2.0.0/trunk/hbase-server/target/surefire/surefire3065268520123022632tmp /x1/jenkins/jenkins-slave/workspace/HBase-TRUNK-on-Hadoop-2.0.0/trunk/hbase-server/target/surefire/surefire_2259034991434831387654tmp
Running org.apache.hadoop.hbase.replication.TestReplicationQueueFailover
Tests run: 1, Failures: 0, Errors: 0, Skipped: 0, Time elapsed: 109.301 sec
Forking command line: /bin/sh -c cd /x1/jenkins/jenkins-slave/workspace/HBase-TRUNK-on-Hadoop-2.0.0/trunk/hbase-server && /x1/jenkins/tools/java/jdk1.6.0_32-32/jre/bin/java -enableassertions -Xmx1900m -Djava.security.egd=file:/dev/./urandom -Djava.net.preferIPv4Stack=true -jar /x1/jenkins/jenkins-slave/workspace/HBase-TRUNK-on-Hadoop-2.0.0/trunk/hbase-server/target/surefire/surefirebooter1073480679842076461.jar /x1/jenkins/jenkins-slave/workspace/HBase-TRUNK-on-Hadoop-2.0.0/trunk/hbase-server/target/surefire/surefire5294500928746345212tmp /x1/jenkins/jenkins-slave/workspace/HBase-TRUNK-on-Hadoop-2.0.0/trunk/hbase-server/target/surefire/surefire_2266162074566249904608tmp
Running org.apache.hadoop.hbase.util.TestFSUtils
Tests run: 6, Failures: 0, Errors: 0, Skipped: 0, Time elapsed: 8.716 sec
Forking command line: /bin/sh -c cd /x1/jenkins/jenkins-slave/workspace/HBase-TRUNK-on-Hadoop-2.0.0/trunk/hbase-server && /x1/jenkins/tools/java/jdk1.6.0_32-32/jre/bin/java -enableassertions -Xmx1900m -Djava.security.egd=file:/dev/./urandom -Djava.net.preferIPv4Stack=true -jar /x1/jenkins/jenkins-slave/workspace/HBase-TRUNK-on-Hadoop-2.0.0/trunk/hbase-server/target/surefire/surefirebooter7967970971251610235.jar /x1/jenkins/jenkins-slave/workspace/HBase-TRUNK-on-Hadoop-2.0.0/trunk/hbase-server/target/surefire/surefire9192221450932564549tmp /x1/jenkins/jenkins-slave/workspace/HBase-TRUNK-on-Hadoop-2.0.0/trunk/hbase-server/target/surefire/surefire_2275453154696675153028tmp
Running org.apache.hadoop.hbase.replication.TestReplicationSmallTests
Tests run: 8, Failures: 0, Errors: 0, Skipped: 0, Time elapsed: 80.301 sec
Forking command line: /bin/sh -c cd /x1/jenkins/jenkins-slave/workspace/HBase-TRUNK-on-Hadoop-2.0.0/trunk/hbase-server && /x1/jenkins/tools/java/jdk1.6.0_32-32/jre/bin/java -enableassertions -Xmx1900m -Djava.security.egd=file:/dev/./urandom -Djava.net.preferIPv4Stack=true -jar /x1/jenkins/jenkins-slave/workspace/HBase-TRUNK-on-Hadoop-2.0.0/trunk/hbase-server/target/surefire/surefirebooter2632101116410855447.jar /x1/jenkins/jenkins-slave/workspace/HBase-TRUNK-on-Hadoop-2.0.0/trunk/hbase-server/target/surefire/surefire930435763523570373tmp /x1/jenkins/jenkins-slave/workspace/HBase-TRUNK-on-Hadoop-2.0.0/trunk/hbase-server/target/surefire/surefire_2289132770736157246795tmp
Running org.apache.hadoop.hbase.util.TestProcessBasedCluster
Tests run: 1, Failures: 0, Errors: 0, Skipped: 0, Time elapsed: 0.413 sec
Forking command line: /bin/sh -c cd /x1/jenkins/jenkins-slave/workspace/HBase-TRUNK-on-Hadoop-2.0.0/trunk/hbase-server && /x1/jenkins/tools/java/jdk1.6.0_32-32/jre/bin/java -enableassertions -Xmx1900m -Djava.security.egd=file:/dev/./urandom -Djava.net.preferIPv4Stack=true -jar /x1/jenkins/jenkins-slave/workspace/HBase-TRUNK-on-Hadoop-2.0.0/trunk/hbase-server/target/surefire/surefirebooter2111704034628487444.jar /x1/jenkins/jenkins-slave/workspace/HBase-TRUNK-on-Hadoop-2.0.0/trunk/hbase-server/target/surefire/surefire2856223855319312878tmp /x1/jenkins/jenkins-slave/workspace/HBase-TRUNK-on-Hadoop-2.0.0/trunk/hbase-server/target/surefire/surefire_2296977495092632029636tmp
Running org.apache.hadoop.hbase.util.TestRegionSplitter
Tests run: 5, Failures: 0, Errors: 0, Skipped: 0, Time elapsed: 10.228 sec
Forking command line: /bin/sh -c cd /x1/jenkins/jenkins-slave/workspace/HBase-TRUNK-on-Hadoop-2.0.0/trunk/hbase-server && /x1/jenkins/tools/java/jdk1.6.0_32-32/jre/bin/java -enableassertions -Xmx1900m -Djava.security.egd=file:/dev/./urandom -Djava.net.preferIPv4Stack=true -jar /x1/jenkins/jenkins-slave/workspace/HBase-TRUNK-on-Hadoop-2.0.0/trunk/hbase-server/target/surefire/surefirebooter3676207395846413335.jar /x1/jenkins/jenkins-slave/workspace/HBase-TRUNK-on-Hadoop-2.0.0/trunk/hbase-server/target/surefire/surefire6872501314699526464tmp /x1/jenkins/jenkins-slave/workspace/HBase-TRUNK-on-Hadoop-2.0.0/trunk/hbase-server/target/surefire/surefire_2301520190410806560232tmp
Running org.apache.hadoop.hbase.util.TestCoprocessorScanPolicy
Tests run: 4, Failures: 0, Errors: 0, Skipped: 0, Time elapsed: 16.174 sec
Forking command line: /bin/sh -c cd /x1/jenkins/jenkins-slave/workspace/HBase-TRUNK-on-Hadoop-2.0.0/trunk/hbase-server && /x1/jenkins/tools/java/jdk1.6.0_32-32/jre/bin/java -enableassertions -Xmx1900m -Djava.security.egd=file:/dev/./urandom -Djava.net.preferIPv4Stack=true -jar /x1/jenkins/jenkins-slave/workspace/HBase-TRUNK-on-Hadoop-2.0.0/trunk/hbase-server/target/surefire/surefirebooter3805255971223568651.jar /x1/jenkins/jenkins-slave/workspace/HBase-TRUNK-on-Hadoop-2.0.0/trunk/hbase-server/target/surefire/surefire843949284773562561tmp /x1/jenkins/jenkins-slave/workspace/HBase-TRUNK-on-Hadoop-2.0.0/trunk/hbase-server/target/surefire/surefire_2311317377314482622658tmp
Running org.apache.hadoop.hbase.util.TestFSVisitor
Tests run: 3, Failures: 0, Errors: 0, Skipped: 0, Time elapsed: 4.917 sec
Forking command line: /bin/sh -c cd /x1/jenkins/jenkins-slave/workspace/HBase-TRUNK-on-Hadoop-2.0.0/trunk/hbase-server && /x1/jenkins/tools/java/jdk1.6.0_32-32/jre/bin/java -enableassertions -Xmx1900m -Djava.security.egd=file:/dev/./urandom -Djava.net.preferIPv4Stack=true -jar /x1/jenkins/jenkins-slave/workspace/HBase-TRUNK-on-Hadoop-2.0.0/trunk/hbase-server/target/surefire/surefirebooter376858458283813846.jar /x1/jenkins/jenkins-slave/workspace/HBase-TRUNK-on-Hadoop-2.0.0/trunk/hbase-server/target/surefire/surefire6427793763848486680tmp /x1/jenkins/jenkins-slave/workspace/HBase-TRUNK-on-Hadoop-2.0.0/trunk/hbase-server/target/surefire/surefire_2321316566587031656902tmp
Running org.apache.hadoop.hbase.util.hbck.TestOfflineMetaRebuildBase
Tests run: 1, Failures: 0, Errors: 0, Skipped: 0, Time elapsed: 22.136 sec
Forking command line: /bin/sh -c cd /x1/jenkins/jenkins-slave/workspace/HBase-TRUNK-on-Hadoop-2.0.0/trunk/hbase-server && /x1/jenkins/tools/java/jdk1.6.0_32-32/jre/bin/java -enableassertions -Xmx1900m -Djava.security.egd=file:/dev/./urandom -Djava.net.preferIPv4Stack=true -jar /x1/jenkins/jenkins-slave/workspace/HBase-TRUNK-on-Hadoop-2.0.0/trunk/hbase-server/target/surefire/surefirebooter1066179349238798547.jar /x1/jenkins/jenkins-slave/workspace/HBase-TRUNK-on-Hadoop-2.0.0/trunk/hbase-server/target/surefire/surefire7010508062124256223tmp /x1/jenkins/jenkins-slave/workspace/HBase-TRUNK-on-Hadoop-2.0.0/trunk/hbase-server/target/surefire/surefire_2331349457394502650486tmp
Running org.apache.hadoop.hbase.util.hbck.TestOfflineMetaRebuildOverlap
Tests run: 1, Failures: 0, Errors: 0, Skipped: 0, Time elapsed: 20.909 sec
Forking command line: /bin/sh -c cd /x1/jenkins/jenkins-slave/workspace/HBase-TRUNK-on-Hadoop-2.0.0/trunk/hbase-server && /x1/jenkins/tools/java/jdk1.6.0_32-32/jre/bin/java -enableassertions -Xmx1900m -Djava.security.egd=file:/dev/./urandom -Djava.net.preferIPv4Stack=true -jar /x1/jenkins/jenkins-slave/workspace/HBase-TRUNK-on-Hadoop-2.0.0/trunk/hbase-server/target/surefire/surefirebooter4804712826231293426.jar /x1/jenkins/jenkins-slave/workspace/HBase-TRUNK-on-Hadoop-2.0.0/trunk/hbase-server/target/surefire/surefire5233645963108226887tmp /x1/jenkins/jenkins-slave/workspace/HBase-TRUNK-on-Hadoop-2.0.0/trunk/hbase-server/target/surefire/surefire_2348775636137164189869tmp
Running org.apache.hadoop.hbase.util.hbck.TestOfflineMetaRebuildHole
Tests run: 1, Failures: 0, Errors: 0, Skipped: 0, Time elapsed: 20.339 sec
Forking command line: /bin/sh -c cd /x1/jenkins/jenkins-slave/workspace/HBase-TRUNK-on-Hadoop-2.0.0/trunk/hbase-server && /x1/jenkins/tools/java/jdk1.6.0_32-32/jre/bin/java -enableassertions -Xmx1900m -Djava.security.egd=file:/dev/./urandom -Djava.net.preferIPv4Stack=true -jar /x1/jenkins/jenkins-slave/workspace/HBase-TRUNK-on-Hadoop-2.0.0/trunk/hbase-server/target/surefire/surefirebooter117430689528439415.jar /x1/jenkins/jenkins-slave/workspace/HBase-TRUNK-on-Hadoop-2.0.0/trunk/hbase-server/target/surefire/surefire7997681577217605446tmp /x1/jenkins/jenkins-slave/workspace/HBase-TRUNK-on-Hadoop-2.0.0/trunk/hbase-server/target/surefire/surefire_2351534399281543167972tmp
Running org.apache.hadoop.hbase.util.TestDefaultEnvironmentEdge
Tests run: 1, Failures: 0, Errors: 0, Skipped: 0, Time elapsed: 0.195 sec
Forking command line: /bin/sh -c cd /x1/jenkins/jenkins-slave/workspace/HBase-TRUNK-on-Hadoop-2.0.0/trunk/hbase-server && /x1/jenkins/tools/java/jdk1.6.0_32-32/jre/bin/java -enableassertions -Xmx1900m -Djava.security.egd=file:/dev/./urandom -Djava.net.preferIPv4Stack=true -jar /x1/jenkins/jenkins-slave/workspace/HBase-TRUNK-on-Hadoop-2.0.0/trunk/hbase-server/target/surefire/surefirebooter8322924352932563797.jar /x1/jenkins/jenkins-slave/workspace/HBase-TRUNK-on-Hadoop-2.0.0/trunk/hbase-server/target/surefire/surefire9014309505858284790tmp /x1/jenkins/jenkins-slave/workspace/HBase-TRUNK-on-Hadoop-2.0.0/trunk/hbase-server/target/surefire/surefire_2364678303282788650155tmp
Running org.apache.hadoop.hbase.util.TestMiniClusterLoadEncoded
Tests run: 5, Failures: 0, Errors: 0, Skipped: 0, Time elapsed: 98.248 sec
Running org.apache.hadoop.hbase.TestInfoServers
Tests run: 3, Failures: 0, Errors: 0, Skipped: 0, Time elapsed: 10.262 sec
Running org.apache.hadoop.hbase.util.TestHBaseFsck
Tests run: 35, Failures: 0, Errors: 0, Skipped: 1, Time elapsed: 219.201 sec
Running org.apache.hadoop.hbase.util.TestMiniClusterLoadParallel
Tests run: 4, Failures: 0, Errors: 2, Skipped: 0, Time elapsed: 453.055 sec <<< FAILURE!
Running org.apache.hadoop.hbase.util.TestMiniClusterLoadSequential
Tests run: 4, Failures: 0, Errors: 2, Skipped: 0, Time elapsed: 470.337 sec <<< FAILURE!
Results :
Failed tests: testRowCounterHiddenColumn(org.apache.hadoop.hbase.mapreduce.TestRowCounter)
testMetaExport(org.apache.hadoop.hbase.mapreduce.TestImportExport)
testThreeRSAbort(org.apache.hadoop.hbase.master.TestDistributedLogSplitting): Timedout
testBulkOutputWithAnExistingTable(org.apache.hadoop.hbase.mapreduce.TestImportTsv): expected:<0> but was:<1>
testMRIncrementalLoad(org.apache.hadoop.hbase.mapreduce.TestHFileOutputFormat)
testMRIncrementalLoadWithSplit(org.apache.hadoop.hbase.mapreduce.TestHFileOutputFormat)
Tests in error:
testExportScannerBatching(org.apache.hadoop.hbase.mapreduce.TestImportExport)
testWithFilter(org.apache.hadoop.hbase.mapreduce.TestImportExport)
testAppendClose(org.apache.hadoop.hbase.regionserver.wal.TestHLog): Failed to open hdfs://localhost:57947/user/jenkins/hbase/TestHLog/hlogdirtrue/hlog.1364517229274 for append
testTableReadLock(org.apache.hadoop.hbase.master.TestTableLockManager): test timed out after 600000 milliseconds
testJoinedScanners(org.apache.hadoop.hbase.regionserver.TestJoinedScanners): Failed 16 actions: ConnectException: 16 times,
loadTest[0](org.apache.hadoop.hbase.util.TestMiniClusterLoadParallel): test timed out after 180000 milliseconds
loadTest[1](org.apache.hadoop.hbase.util.TestMiniClusterLoadParallel): test timed out after 180000 milliseconds
loadTest[0](org.apache.hadoop.hbase.util.TestMiniClusterLoadSequential): test timed out after 180000 milliseconds
loadTest[1](org.apache.hadoop.hbase.util.TestMiniClusterLoadSequential): test timed out after 180000 milliseconds
Tests run: 1442, Failures: 6, Errors: 9, Skipped: 13
[INFO]
[INFO] ------------------------------------------------------------------------
[INFO] Skipping HBase
[INFO] This project has been banned from the build due to previous failures.
[INFO] ------------------------------------------------------------------------
[INFO] ------------------------------------------------------------------------
[INFO] Reactor Summary:
[INFO]
[INFO] HBase ............................................. SUCCESS [3.323s]
[INFO] HBase - Common .................................... SUCCESS [16.100s]
[INFO] HBase - Protocol .................................. SUCCESS [11.665s]
[INFO] HBase - Client .................................... SUCCESS [6.924s]
[INFO] HBase - Prefix Tree ............................... SUCCESS [2.512s]
[INFO] HBase - Hadoop Compatibility ...................... SUCCESS [0.428s]
[INFO] HBase - Hadoop Two Compatibility .................. SUCCESS [2.132s]
[INFO] HBase - Server .................................... FAILURE [42:22.849s]
[INFO] HBase - Integration Tests ......................... SKIPPED
[INFO] HBase - Examples .................................. SKIPPED
[INFO] ------------------------------------------------------------------------
[INFO] BUILD FAILURE
[INFO] ------------------------------------------------------------------------
[INFO] Total time: 43:08.659s
[INFO] Finished at: Fri Mar 29 00:58:00 UTC 2013
[INFO] Final Memory: 115M/1078M
[INFO] ------------------------------------------------------------------------
[ERROR] Failed to execute goal org.apache.maven.plugins:maven-surefire-plugin:2.12-TRUNK-HBASE-2:test (secondPartTestsExecution) on project hbase-server: Failure or timeout -> [Help 1]
org.apache.maven.lifecycle.LifecycleExecutionException: Failed to execute goal org.apache.maven.plugins:maven-surefire-plugin:2.12-TRUNK-HBASE-2:test (secondPartTestsExecution) on project hbase-server: Failure or timeout
at org.apache.maven.lifecycle.internal.MojoExecutor.execute(MojoExecutor.java:217)
at org.apache.maven.lifecycle.internal.MojoExecutor.execute(MojoExecutor.java:153)
at org.apache.maven.lifecycle.internal.MojoExecutor.execute(MojoExecutor.java:145)
at org.apache.maven.lifecycle.internal.LifecycleModuleBuilder.buildProject(LifecycleModuleBuilder.java:84)
at org.apache.maven.lifecycle.internal.LifecycleModuleBuilder.buildProject(LifecycleModuleBuilder.java:59)
at org.apache.maven.lifecycle.internal.LifecycleStarter.singleThreadedBuild(LifecycleStarter.java:183)
at org.apache.maven.lifecycle.internal.LifecycleStarter.execute(LifecycleStarter.java:161)
at org.apache.maven.DefaultMaven.doExecute(DefaultMaven.java:320)
at org.apache.maven.DefaultMaven.execute(DefaultMaven.java:156)
at org.apache.maven.cli.MavenCli.execute(MavenCli.java:537)
at org.apache.maven.cli.MavenCli.doMain(MavenCli.java:196)
at org.apache.maven.cli.MavenCli.main(MavenCli.java:141)
at sun.reflect.NativeMethodAccessorImpl.invoke0(Native Method)
at sun.reflect.NativeMethodAccessorImpl.invoke(NativeMethodAccessorImpl.java:39)
at sun.reflect.DelegatingMethodAccessorImpl.invoke(DelegatingMethodAccessorImpl.java:25)
at java.lang.reflect.Method.invoke(Method.java:597)
at org.codehaus.plexus.classworlds.launcher.Launcher.launchEnhanced(Launcher.java:290)
at org.codehaus.plexus.classworlds.launcher.Launcher.launch(Launcher.java:230)
at org.codehaus.plexus.classworlds.launcher.Launcher.mainWithExitCode(Launcher.java:409)
at org.codehaus.plexus.classworlds.launcher.Launcher.main(Launcher.java:352)
Caused by: org.apache.maven.plugin.MojoExecutionException: Failure or timeout
at org.apache.maven.plugin.surefire.SurefirePlugin.assertNoFailureOrTimeout(SurefirePlugin.java:643)
at org.apache.maven.plugin.surefire.SurefirePlugin.handleSummary(SurefirePlugin.java:624)
at org.apache.maven.plugin.surefire.AbstractSurefireMojo.executeAfterPreconditionsChecked(AbstractSurefireMojo.java:137)
at org.apache.maven.plugin.surefire.AbstractSurefireMojo.execute(AbstractSurefireMojo.java:98)
at org.apache.maven.plugin.DefaultBuildPluginManager.executeMojo(DefaultBuildPluginManager.java:101)
at org.apache.maven.lifecycle.internal.MojoExecutor.execute(MojoExecutor.java:209)
... 19 more
[ERROR]
[ERROR]
[ERROR] For more information about the errors and possible solutions, please read the following articles:
[ERROR] [Help 1] http://cwiki.apache.org/confluence/display/MAVEN/MojoExecutionException
[ERROR]
[ERROR] After correcting the problems, you can resume the build with the command
[ERROR] mvn <goals> -rf :hbase-server
Build step 'Invoke top-level Maven targets' marked build as failure
Archiving artifacts
Recording test results
Updating HBASE-8152
Updating HBASE-8164
Updating HBASE-8195
Updating HBASE-8144
Updating HBASE-8063
Build failed in Jenkins: HBase-TRUNK-on-Hadoop-2.0.0 #470
Posted by Apache Jenkins Server <je...@builds.apache.org>.
See <https://builds.apache.org/job/HBase-TRUNK-on-Hadoop-2.0.0/470/changes>
Changes:
[tedyu] HBASE-7904 Addendum turns off vmem check
------------------------------------------
[...truncated 24099 lines...]
Forking command line: /bin/sh -c cd <https://builds.apache.org/job/HBase-TRUNK-on-Hadoop-2.0.0/ws/trunk/hbase-server> && /home/jenkins/tools/java/jdk1.6.0_27-32/jre/bin/java -enableassertions -Xmx1900m -Djava.security.egd=file:/dev/./urandom -Djava.net.preferIPv4Stack=true -jar <https://builds.apache.org/job/HBase-TRUNK-on-Hadoop-2.0.0/ws/trunk/hbase-server/target/surefire/surefirebooter2633700990749674719.jar> <https://builds.apache.org/job/HBase-TRUNK-on-Hadoop-2.0.0/ws/trunk/hbase-server/target/surefire/surefire2717968702526373791tmp> <https://builds.apache.org/job/HBase-TRUNK-on-Hadoop-2.0.0/ws/trunk/hbase-server/target/surefire/surefire_1839218092518855638205tmp>
Running org.apache.hadoop.hbase.regionserver.TestSplitLogWorker
Tests run: 5, Failures: 0, Errors: 0, Skipped: 0, Time elapsed: 14.91 sec
Forking command line: /bin/sh -c cd <https://builds.apache.org/job/HBase-TRUNK-on-Hadoop-2.0.0/ws/trunk/hbase-server> && /home/jenkins/tools/java/jdk1.6.0_27-32/jre/bin/java -enableassertions -Xmx1900m -Djava.security.egd=file:/dev/./urandom -Djava.net.preferIPv4Stack=true -jar <https://builds.apache.org/job/HBase-TRUNK-on-Hadoop-2.0.0/ws/trunk/hbase-server/target/surefire/surefirebooter4588122112020154552.jar> <https://builds.apache.org/job/HBase-TRUNK-on-Hadoop-2.0.0/ws/trunk/hbase-server/target/surefire/surefire1544587891185026698tmp> <https://builds.apache.org/job/HBase-TRUNK-on-Hadoop-2.0.0/ws/trunk/hbase-server/target/surefire/surefire_1848230940079026838025tmp>
Running org.apache.hadoop.hbase.regionserver.TestCompactionWithCoprocessor
Tests run: 17, Failures: 0, Errors: 0, Skipped: 0, Time elapsed: 206.609 sec
Forking command line: /bin/sh -c cd <https://builds.apache.org/job/HBase-TRUNK-on-Hadoop-2.0.0/ws/trunk/hbase-server> && /home/jenkins/tools/java/jdk1.6.0_27-32/jre/bin/java -enableassertions -Xmx1900m -Djava.security.egd=file:/dev/./urandom -Djava.net.preferIPv4Stack=true -jar <https://builds.apache.org/job/HBase-TRUNK-on-Hadoop-2.0.0/ws/trunk/hbase-server/target/surefire/surefirebooter1190263743868658422.jar> <https://builds.apache.org/job/HBase-TRUNK-on-Hadoop-2.0.0/ws/trunk/hbase-server/target/surefire/surefire5561844398168443588tmp> <https://builds.apache.org/job/HBase-TRUNK-on-Hadoop-2.0.0/ws/trunk/hbase-server/target/surefire/surefire_1852789480878439123245tmp>
Running org.apache.hadoop.hbase.regionserver.TestStoreFileBlockCacheSummary
Tests run: 1, Failures: 0, Errors: 0, Skipped: 0, Time elapsed: 33.369 sec
Forking command line: /bin/sh -c cd <https://builds.apache.org/job/HBase-TRUNK-on-Hadoop-2.0.0/ws/trunk/hbase-server> && /home/jenkins/tools/java/jdk1.6.0_27-32/jre/bin/java -enableassertions -Xmx1900m -Djava.security.egd=file:/dev/./urandom -Djava.net.preferIPv4Stack=true -jar <https://builds.apache.org/job/HBase-TRUNK-on-Hadoop-2.0.0/ws/trunk/hbase-server/target/surefire/surefirebooter6395739472981103192.jar> <https://builds.apache.org/job/HBase-TRUNK-on-Hadoop-2.0.0/ws/trunk/hbase-server/target/surefire/surefire6068880047880354130tmp> <https://builds.apache.org/job/HBase-TRUNK-on-Hadoop-2.0.0/ws/trunk/hbase-server/target/surefire/surefire_1862972944816425580199tmp>
Running org.apache.hadoop.hbase.regionserver.TestMemStore
Tests run: 22, Failures: 0, Errors: 0, Skipped: 0, Time elapsed: 273.462 sec
Running org.apache.hadoop.hbase.regionserver.TestStore
Tests run: 15, Failures: 0, Errors: 0, Skipped: 0, Time elapsed: 25.281 sec
Forking command line: /bin/sh -c cd <https://builds.apache.org/job/HBase-TRUNK-on-Hadoop-2.0.0/ws/trunk/hbase-server> && /home/jenkins/tools/java/jdk1.6.0_27-32/jre/bin/java -enableassertions -Xmx1900m -Djava.security.egd=file:/dev/./urandom -Djava.net.preferIPv4Stack=true -jar <https://builds.apache.org/job/HBase-TRUNK-on-Hadoop-2.0.0/ws/trunk/hbase-server/target/surefire/surefirebooter6107592383085107321.jar> <https://builds.apache.org/job/HBase-TRUNK-on-Hadoop-2.0.0/ws/trunk/hbase-server/target/surefire/surefire4171627156382980757tmp> <https://builds.apache.org/job/HBase-TRUNK-on-Hadoop-2.0.0/ws/trunk/hbase-server/target/surefire/surefire_1877224632405514835758tmp>
Forking command line: /bin/sh -c cd <https://builds.apache.org/job/HBase-TRUNK-on-Hadoop-2.0.0/ws/trunk/hbase-server> && /home/jenkins/tools/java/jdk1.6.0_27-32/jre/bin/java -enableassertions -Xmx1900m -Djava.security.egd=file:/dev/./urandom -Djava.net.preferIPv4Stack=true -jar <https://builds.apache.org/job/HBase-TRUNK-on-Hadoop-2.0.0/ws/trunk/hbase-server/target/surefire/surefirebooter3049450851129267470.jar> <https://builds.apache.org/job/HBase-TRUNK-on-Hadoop-2.0.0/ws/trunk/hbase-server/target/surefire/surefire3748025044718801677tmp> <https://builds.apache.org/job/HBase-TRUNK-on-Hadoop-2.0.0/ws/trunk/hbase-server/target/surefire/surefire_1886917980318898748348tmp>
Running org.apache.hadoop.hbase.regionserver.TestServerCustomProtocol
Tests run: 7, Failures: 0, Errors: 0, Skipped: 0, Time elapsed: 90.914 sec
Forking command line: /bin/sh -c cd <https://builds.apache.org/job/HBase-TRUNK-on-Hadoop-2.0.0/ws/trunk/hbase-server> && /home/jenkins/tools/java/jdk1.6.0_27-32/jre/bin/java -enableassertions -Xmx1900m -Djava.security.egd=file:/dev/./urandom -Djava.net.preferIPv4Stack=true -jar <https://builds.apache.org/job/HBase-TRUNK-on-Hadoop-2.0.0/ws/trunk/hbase-server/target/surefire/surefirebooter7869277368544953976.jar> <https://builds.apache.org/job/HBase-TRUNK-on-Hadoop-2.0.0/ws/trunk/hbase-server/target/surefire/surefire143489370803775457tmp> <https://builds.apache.org/job/HBase-TRUNK-on-Hadoop-2.0.0/ws/trunk/hbase-server/target/surefire/surefire_1895643252501405015416tmp>
Running org.apache.hadoop.hbase.regionserver.TestClusterId
Tests run: 1, Failures: 0, Errors: 0, Skipped: 0, Time elapsed: 71.627 sec
Forking command line: /bin/sh -c cd <https://builds.apache.org/job/HBase-TRUNK-on-Hadoop-2.0.0/ws/trunk/hbase-server> && /home/jenkins/tools/java/jdk1.6.0_27-32/jre/bin/java -enableassertions -Xmx1900m -Djava.security.egd=file:/dev/./urandom -Djava.net.preferIPv4Stack=true -jar <https://builds.apache.org/job/HBase-TRUNK-on-Hadoop-2.0.0/ws/trunk/hbase-server/target/surefire/surefirebooter5601243809960708896.jar> <https://builds.apache.org/job/HBase-TRUNK-on-Hadoop-2.0.0/ws/trunk/hbase-server/target/surefire/surefire4240367574431240797tmp> <https://builds.apache.org/job/HBase-TRUNK-on-Hadoop-2.0.0/ws/trunk/hbase-server/target/surefire/surefire_1906371079675347122291tmp>
Running org.apache.hadoop.hbase.regionserver.TestBlocksRead
Tests run: 4, Failures: 0, Errors: 0, Skipped: 0, Time elapsed: 15.559 sec
Forking command line: /bin/sh -c cd <https://builds.apache.org/job/HBase-TRUNK-on-Hadoop-2.0.0/ws/trunk/hbase-server> && /home/jenkins/tools/java/jdk1.6.0_27-32/jre/bin/java -enableassertions -Xmx1900m -Djava.security.egd=file:/dev/./urandom -Djava.net.preferIPv4Stack=true -jar <https://builds.apache.org/job/HBase-TRUNK-on-Hadoop-2.0.0/ws/trunk/hbase-server/target/surefire/surefirebooter3471451588124456563.jar> <https://builds.apache.org/job/HBase-TRUNK-on-Hadoop-2.0.0/ws/trunk/hbase-server/target/surefire/surefire1376311565567423376tmp> <https://builds.apache.org/job/HBase-TRUNK-on-Hadoop-2.0.0/ws/trunk/hbase-server/target/surefire/surefire_1911024409708982565886tmp>
Running org.apache.hadoop.hbase.regionserver.TestHRegionBusyWait
Tests run: 63, Failures: 0, Errors: 0, Skipped: 0, Time elapsed: 219.97 sec
Forking command line: /bin/sh -c cd <https://builds.apache.org/job/HBase-TRUNK-on-Hadoop-2.0.0/ws/trunk/hbase-server> && /home/jenkins/tools/java/jdk1.6.0_27-32/jre/bin/java -enableassertions -Xmx1900m -Djava.security.egd=file:/dev/./urandom -Djava.net.preferIPv4Stack=true -jar <https://builds.apache.org/job/HBase-TRUNK-on-Hadoop-2.0.0/ws/trunk/hbase-server/target/surefire/surefirebooter8635530814180866479.jar> <https://builds.apache.org/job/HBase-TRUNK-on-Hadoop-2.0.0/ws/trunk/hbase-server/target/surefire/surefire8663658400697795377tmp> <https://builds.apache.org/job/HBase-TRUNK-on-Hadoop-2.0.0/ws/trunk/hbase-server/target/surefire/surefire_1922259475484817209076tmp>
Running org.apache.hadoop.hbase.regionserver.TestAtomicOperation
Running org.apache.hadoop.hbase.regionserver.TestFSErrorsExposed
Tests run: 3, Failures: 0, Errors: 0, Skipped: 1, Time elapsed: 8.197 sec
Forking command line: /bin/sh -c cd <https://builds.apache.org/job/HBase-TRUNK-on-Hadoop-2.0.0/ws/trunk/hbase-server> && /home/jenkins/tools/java/jdk1.6.0_27-32/jre/bin/java -enableassertions -Xmx1900m -Djava.security.egd=file:/dev/./urandom -Djava.net.preferIPv4Stack=true -jar <https://builds.apache.org/job/HBase-TRUNK-on-Hadoop-2.0.0/ws/trunk/hbase-server/target/surefire/surefirebooter6624201191921292401.jar> <https://builds.apache.org/job/HBase-TRUNK-on-Hadoop-2.0.0/ws/trunk/hbase-server/target/surefire/surefire8755691808827996083tmp> <https://builds.apache.org/job/HBase-TRUNK-on-Hadoop-2.0.0/ws/trunk/hbase-server/target/surefire/surefire_1934422355189788373240tmp>
Tests run: 5, Failures: 0, Errors: 0, Skipped: 0, Time elapsed: 110.956 sec
Forking command line: /bin/sh -c cd <https://builds.apache.org/job/HBase-TRUNK-on-Hadoop-2.0.0/ws/trunk/hbase-server> && /home/jenkins/tools/java/jdk1.6.0_27-32/jre/bin/java -enableassertions -Xmx1900m -Djava.security.egd=file:/dev/./urandom -Djava.net.preferIPv4Stack=true -jar <https://builds.apache.org/job/HBase-TRUNK-on-Hadoop-2.0.0/ws/trunk/hbase-server/target/surefire/surefirebooter3142507671542648733.jar> <https://builds.apache.org/job/HBase-TRUNK-on-Hadoop-2.0.0/ws/trunk/hbase-server/target/surefire/surefire5162349435236089867tmp> <https://builds.apache.org/job/HBase-TRUNK-on-Hadoop-2.0.0/ws/trunk/hbase-server/target/surefire/surefire_1944887775894766111548tmp>
Running org.apache.hadoop.hbase.regionserver.TestRegionMergeTransactionOnCluster
Tests run: 2, Failures: 0, Errors: 0, Skipped: 0, Time elapsed: 78.529 sec
Forking command line: /bin/sh -c cd <https://builds.apache.org/job/HBase-TRUNK-on-Hadoop-2.0.0/ws/trunk/hbase-server> && /home/jenkins/tools/java/jdk1.6.0_27-32/jre/bin/java -enableassertions -Xmx1900m -Djava.security.egd=file:/dev/./urandom -Djava.net.preferIPv4Stack=true -jar <https://builds.apache.org/job/HBase-TRUNK-on-Hadoop-2.0.0/ws/trunk/hbase-server/target/surefire/surefirebooter4394353701308453840.jar> <https://builds.apache.org/job/HBase-TRUNK-on-Hadoop-2.0.0/ws/trunk/hbase-server/target/surefire/surefire5320446349257902904tmp> <https://builds.apache.org/job/HBase-TRUNK-on-Hadoop-2.0.0/ws/trunk/hbase-server/target/surefire/surefire_1958579439077048548533tmp>
Running org.apache.hadoop.hbase.regionserver.handler.TestCloseRegionHandler
Tests run: 3, Failures: 0, Errors: 0, Skipped: 0, Time elapsed: 12.019 sec
Forking command line: /bin/sh -c cd <https://builds.apache.org/job/HBase-TRUNK-on-Hadoop-2.0.0/ws/trunk/hbase-server> && /home/jenkins/tools/java/jdk1.6.0_27-32/jre/bin/java -enableassertions -Xmx1900m -Djava.security.egd=file:/dev/./urandom -Djava.net.preferIPv4Stack=true -jar <https://builds.apache.org/job/HBase-TRUNK-on-Hadoop-2.0.0/ws/trunk/hbase-server/target/surefire/surefirebooter311359476235776689.jar> <https://builds.apache.org/job/HBase-TRUNK-on-Hadoop-2.0.0/ws/trunk/hbase-server/target/surefire/surefire2747339249313799773tmp> <https://builds.apache.org/job/HBase-TRUNK-on-Hadoop-2.0.0/ws/trunk/hbase-server/target/surefire/surefire_1964540460551991906968tmp>
Running org.apache.hadoop.hbase.regionserver.TestSeekOptimizations
Tests run: 6, Failures: 0, Errors: 0, Skipped: 0, Time elapsed: 23.473 sec
Forking command line: /bin/sh -c cd <https://builds.apache.org/job/HBase-TRUNK-on-Hadoop-2.0.0/ws/trunk/hbase-server> && /home/jenkins/tools/java/jdk1.6.0_27-32/jre/bin/java -enableassertions -Xmx1900m -Djava.security.egd=file:/dev/./urandom -Djava.net.preferIPv4Stack=true -jar <https://builds.apache.org/job/HBase-TRUNK-on-Hadoop-2.0.0/ws/trunk/hbase-server/target/surefire/surefirebooter6661708548572507861.jar> <https://builds.apache.org/job/HBase-TRUNK-on-Hadoop-2.0.0/ws/trunk/hbase-server/target/surefire/surefire1445561512435631677tmp> <https://builds.apache.org/job/HBase-TRUNK-on-Hadoop-2.0.0/ws/trunk/hbase-server/target/surefire/surefire_1978492764226479178162tmp>
Running org.apache.hadoop.hbase.regionserver.handler.TestOpenRegionHandler
Tests run: 5, Failures: 0, Errors: 0, Skipped: 0, Time elapsed: 10.149 sec
Forking command line: /bin/sh -c cd <https://builds.apache.org/job/HBase-TRUNK-on-Hadoop-2.0.0/ws/trunk/hbase-server> && /home/jenkins/tools/java/jdk1.6.0_27-32/jre/bin/java -enableassertions -Xmx1900m -Djava.security.egd=file:/dev/./urandom -Djava.net.preferIPv4Stack=true -jar <https://builds.apache.org/job/HBase-TRUNK-on-Hadoop-2.0.0/ws/trunk/hbase-server/target/surefire/surefirebooter2197377849386786206.jar> <https://builds.apache.org/job/HBase-TRUNK-on-Hadoop-2.0.0/ws/trunk/hbase-server/target/surefire/surefire1657593692196985375tmp> <https://builds.apache.org/job/HBase-TRUNK-on-Hadoop-2.0.0/ws/trunk/hbase-server/target/surefire/surefire_1985178001050190377491tmp>
Running org.apache.hadoop.hbase.regionserver.TestCompactionState
Tests run: 5, Failures: 0, Errors: 0, Skipped: 0, Time elapsed: 165.812 sec
Forking command line: /bin/sh -c cd <https://builds.apache.org/job/HBase-TRUNK-on-Hadoop-2.0.0/ws/trunk/hbase-server> && /home/jenkins/tools/java/jdk1.6.0_27-32/jre/bin/java -enableassertions -Xmx1900m -Djava.security.egd=file:/dev/./urandom -Djava.net.preferIPv4Stack=true -jar <https://builds.apache.org/job/HBase-TRUNK-on-Hadoop-2.0.0/ws/trunk/hbase-server/target/surefire/surefirebooter7335418873589620993.jar> <https://builds.apache.org/job/HBase-TRUNK-on-Hadoop-2.0.0/ws/trunk/hbase-server/target/surefire/surefire6184213475714095969tmp> <https://builds.apache.org/job/HBase-TRUNK-on-Hadoop-2.0.0/ws/trunk/hbase-server/target/surefire/surefire_1991851865884579375175tmp>
Running org.apache.hadoop.hbase.regionserver.TestRSKilledWhenMasterInitializing
Tests run: 1, Failures: 0, Errors: 0, Skipped: 0, Time elapsed: 73.144 sec
Forking command line: /bin/sh -c cd <https://builds.apache.org/job/HBase-TRUNK-on-Hadoop-2.0.0/ws/trunk/hbase-server> && /home/jenkins/tools/java/jdk1.6.0_27-32/jre/bin/java -enableassertions -Xmx1900m -Djava.security.egd=file:/dev/./urandom -Djava.net.preferIPv4Stack=true -jar <https://builds.apache.org/job/HBase-TRUNK-on-Hadoop-2.0.0/ws/trunk/hbase-server/target/surefire/surefirebooter705673059293573829.jar> <https://builds.apache.org/job/HBase-TRUNK-on-Hadoop-2.0.0/ws/trunk/hbase-server/target/surefire/surefire4561509441019744407tmp> <https://builds.apache.org/job/HBase-TRUNK-on-Hadoop-2.0.0/ws/trunk/hbase-server/target/surefire/surefire_2006753811666010807728tmp>
Running org.apache.hadoop.hbase.regionserver.TestGetClosestAtOrBefore
Tests run: 3, Failures: 0, Errors: 0, Skipped: 0, Time elapsed: 11.269 sec
Forking command line: /bin/sh -c cd <https://builds.apache.org/job/HBase-TRUNK-on-Hadoop-2.0.0/ws/trunk/hbase-server> && /home/jenkins/tools/java/jdk1.6.0_27-32/jre/bin/java -enableassertions -Xmx1900m -Djava.security.egd=file:/dev/./urandom -Djava.net.preferIPv4Stack=true -jar <https://builds.apache.org/job/HBase-TRUNK-on-Hadoop-2.0.0/ws/trunk/hbase-server/target/surefire/surefirebooter39967238819323011.jar> <https://builds.apache.org/job/HBase-TRUNK-on-Hadoop-2.0.0/ws/trunk/hbase-server/target/surefire/surefire6302005689031844473tmp> <https://builds.apache.org/job/HBase-TRUNK-on-Hadoop-2.0.0/ws/trunk/hbase-server/target/surefire/surefire_2015652909808010944352tmp>
Running org.apache.hadoop.hbase.regionserver.TestParallelPut
Tests run: 2, Failures: 0, Errors: 0, Skipped: 0, Time elapsed: 39.025 sec
Forking command line: /bin/sh -c cd <https://builds.apache.org/job/HBase-TRUNK-on-Hadoop-2.0.0/ws/trunk/hbase-server> && /home/jenkins/tools/java/jdk1.6.0_27-32/jre/bin/java -enableassertions -Xmx1900m -Djava.security.egd=file:/dev/./urandom -Djava.net.preferIPv4Stack=true -jar <https://builds.apache.org/job/HBase-TRUNK-on-Hadoop-2.0.0/ws/trunk/hbase-server/target/surefire/surefirebooter9060365250569180041.jar> <https://builds.apache.org/job/HBase-TRUNK-on-Hadoop-2.0.0/ws/trunk/hbase-server/target/surefire/surefire7628480021422562393tmp> <https://builds.apache.org/job/HBase-TRUNK-on-Hadoop-2.0.0/ws/trunk/hbase-server/target/surefire/surefire_2027483369266130632523tmp>
Running org.apache.hadoop.hbase.regionserver.TestCacheOnWriteInSchema
Tests run: 3, Failures: 0, Errors: 0, Skipped: 0, Time elapsed: 30.185 sec
Forking command line: /bin/sh -c cd <https://builds.apache.org/job/HBase-TRUNK-on-Hadoop-2.0.0/ws/trunk/hbase-server> && /home/jenkins/tools/java/jdk1.6.0_27-32/jre/bin/java -enableassertions -Xmx1900m -Djava.security.egd=file:/dev/./urandom -Djava.net.preferIPv4Stack=true -jar <https://builds.apache.org/job/HBase-TRUNK-on-Hadoop-2.0.0/ws/trunk/hbase-server/target/surefire/surefirebooter2225500896468843124.jar> <https://builds.apache.org/job/HBase-TRUNK-on-Hadoop-2.0.0/ws/trunk/hbase-server/target/surefire/surefire7928033319837473176tmp> <https://builds.apache.org/job/HBase-TRUNK-on-Hadoop-2.0.0/ws/trunk/hbase-server/target/surefire/surefire_2035107119340003142019tmp>
Running org.apache.hadoop.hbase.regionserver.TestPriorityRpc
Tests run: 3, Failures: 0, Errors: 0, Skipped: 0, Time elapsed: 18.234 sec
Forking command line: /bin/sh -c cd <https://builds.apache.org/job/HBase-TRUNK-on-Hadoop-2.0.0/ws/trunk/hbase-server> && /home/jenkins/tools/java/jdk1.6.0_27-32/jre/bin/java -enableassertions -Xmx1900m -Djava.security.egd=file:/dev/./urandom -Djava.net.preferIPv4Stack=true -jar <https://builds.apache.org/job/HBase-TRUNK-on-Hadoop-2.0.0/ws/trunk/hbase-server/target/surefire/surefirebooter2327396165789759221.jar> <https://builds.apache.org/job/HBase-TRUNK-on-Hadoop-2.0.0/ws/trunk/hbase-server/target/surefire/surefire5968558847275769334tmp> <https://builds.apache.org/job/HBase-TRUNK-on-Hadoop-2.0.0/ws/trunk/hbase-server/target/surefire/surefire_2043052369680958269265tmp>
Running org.apache.hadoop.hbase.regionserver.TestHRegionServerBulkLoad
Tests run: 1, Failures: 0, Errors: 0, Skipped: 0, Time elapsed: 113.257 sec
Forking command line: /bin/sh -c cd <https://builds.apache.org/job/HBase-TRUNK-on-Hadoop-2.0.0/ws/trunk/hbase-server> && /home/jenkins/tools/java/jdk1.6.0_27-32/jre/bin/java -enableassertions -Xmx1900m -Djava.security.egd=file:/dev/./urandom -Djava.net.preferIPv4Stack=true -jar <https://builds.apache.org/job/HBase-TRUNK-on-Hadoop-2.0.0/ws/trunk/hbase-server/target/surefire/surefirebooter199123568444263377.jar> <https://builds.apache.org/job/HBase-TRUNK-on-Hadoop-2.0.0/ws/trunk/hbase-server/target/surefire/surefire2462785374514087064tmp> <https://builds.apache.org/job/HBase-TRUNK-on-Hadoop-2.0.0/ws/trunk/hbase-server/target/surefire/surefire_2053958940042975263870tmp>
Running org.apache.hadoop.hbase.regionserver.wal.TestLogRollAbort
Tests run: 1, Failures: 0, Errors: 0, Skipped: 0, Time elapsed: 69.882 sec
Forking command line: /bin/sh -c cd <https://builds.apache.org/job/HBase-TRUNK-on-Hadoop-2.0.0/ws/trunk/hbase-server> && /home/jenkins/tools/java/jdk1.6.0_27-32/jre/bin/java -enableassertions -Xmx1900m -Djava.security.egd=file:/dev/./urandom -Djava.net.preferIPv4Stack=true -jar <https://builds.apache.org/job/HBase-TRUNK-on-Hadoop-2.0.0/ws/trunk/hbase-server/target/surefire/surefirebooter2071165090786193162.jar> <https://builds.apache.org/job/HBase-TRUNK-on-Hadoop-2.0.0/ws/trunk/hbase-server/target/surefire/surefire7757435874366156993tmp> <https://builds.apache.org/job/HBase-TRUNK-on-Hadoop-2.0.0/ws/trunk/hbase-server/target/surefire/surefire_2063507163383995696267tmp>
Running org.apache.hadoop.hbase.regionserver.TestSplitTransactionOnCluster
Tests run: 8, Failures: 0, Errors: 0, Skipped: 0, Time elapsed: 190.88 sec
Forking command line: /bin/sh -c cd <https://builds.apache.org/job/HBase-TRUNK-on-Hadoop-2.0.0/ws/trunk/hbase-server> && /home/jenkins/tools/java/jdk1.6.0_27-32/jre/bin/java -enableassertions -Xmx1900m -Djava.security.egd=file:/dev/./urandom -Djava.net.preferIPv4Stack=true -jar <https://builds.apache.org/job/HBase-TRUNK-on-Hadoop-2.0.0/ws/trunk/hbase-server/target/surefire/surefirebooter8896276375636608377.jar> <https://builds.apache.org/job/HBase-TRUNK-on-Hadoop-2.0.0/ws/trunk/hbase-server/target/surefire/surefire5936100910791962926tmp> <https://builds.apache.org/job/HBase-TRUNK-on-Hadoop-2.0.0/ws/trunk/hbase-server/target/surefire/surefire_2078029013198245427120tmp>
Running org.apache.hadoop.hbase.regionserver.wal.TestHLog
Tests run: 11, Failures: 0, Errors: 0, Skipped: 0, Time elapsed: 117.638 sec
Forking command line: /bin/sh -c cd <https://builds.apache.org/job/HBase-TRUNK-on-Hadoop-2.0.0/ws/trunk/hbase-server> && /home/jenkins/tools/java/jdk1.6.0_27-32/jre/bin/java -enableassertions -Xmx1900m -Djava.security.egd=file:/dev/./urandom -Djava.net.preferIPv4Stack=true -jar <https://builds.apache.org/job/HBase-TRUNK-on-Hadoop-2.0.0/ws/trunk/hbase-server/target/surefire/surefirebooter5177708586140184101.jar> <https://builds.apache.org/job/HBase-TRUNK-on-Hadoop-2.0.0/ws/trunk/hbase-server/target/surefire/surefire4166468537403075215tmp> <https://builds.apache.org/job/HBase-TRUNK-on-Hadoop-2.0.0/ws/trunk/hbase-server/target/surefire/surefire_2084112909492027668050tmp>
Running org.apache.hadoop.hbase.regionserver.wal.TestLogRolling
Tests run: 2, Failures: 0, Errors: 0, Skipped: 0, Time elapsed: 270.658 sec
Forking command line: /bin/sh -c cd <https://builds.apache.org/job/HBase-TRUNK-on-Hadoop-2.0.0/ws/trunk/hbase-server> && /home/jenkins/tools/java/jdk1.6.0_27-32/jre/bin/java -enableassertions -Xmx1900m -Djava.security.egd=file:/dev/./urandom -Djava.net.preferIPv4Stack=true -jar <https://builds.apache.org/job/HBase-TRUNK-on-Hadoop-2.0.0/ws/trunk/hbase-server/target/surefire/surefirebooter8346281193409577068.jar> <https://builds.apache.org/job/HBase-TRUNK-on-Hadoop-2.0.0/ws/trunk/hbase-server/target/surefire/surefire6166776016406202762tmp> <https://builds.apache.org/job/HBase-TRUNK-on-Hadoop-2.0.0/ws/trunk/hbase-server/target/surefire/surefire_2092524409206733928800tmp>
Running org.apache.hadoop.hbase.regionserver.wal.TestWALReplay
Tests run: 8, Failures: 0, Errors: 0, Skipped: 0, Time elapsed: 198.419 sec
Forking command line: /bin/sh -c cd <https://builds.apache.org/job/HBase-TRUNK-on-Hadoop-2.0.0/ws/trunk/hbase-server> && /home/jenkins/tools/java/jdk1.6.0_27-32/jre/bin/java -enableassertions -Xmx1900m -Djava.security.egd=file:/dev/./urandom -Djava.net.preferIPv4Stack=true -jar <https://builds.apache.org/job/HBase-TRUNK-on-Hadoop-2.0.0/ws/trunk/hbase-server/target/surefire/surefirebooter3688500107128185274.jar> <https://builds.apache.org/job/HBase-TRUNK-on-Hadoop-2.0.0/ws/trunk/hbase-server/target/surefire/surefire7658831794635853207tmp> <https://builds.apache.org/job/HBase-TRUNK-on-Hadoop-2.0.0/ws/trunk/hbase-server/target/surefire/surefire_2107478744455394503475tmp>
Running org.apache.hadoop.hbase.regionserver.wal.TestHLogSplit
Tests run: 32, Failures: 0, Errors: 0, Skipped: 1, Time elapsed: 297.554 sec
Forking command line: /bin/sh -c cd <https://builds.apache.org/job/HBase-TRUNK-on-Hadoop-2.0.0/ws/trunk/hbase-server> && /home/jenkins/tools/java/jdk1.6.0_27-32/jre/bin/java -enableassertions -Xmx1900m -Djava.security.egd=file:/dev/./urandom -Djava.net.preferIPv4Stack=true -jar <https://builds.apache.org/job/HBase-TRUNK-on-Hadoop-2.0.0/ws/trunk/hbase-server/target/surefire/surefirebooter7889975490896450572.jar> <https://builds.apache.org/job/HBase-TRUNK-on-Hadoop-2.0.0/ws/trunk/hbase-server/target/surefire/surefire8482013957145556182tmp> <https://builds.apache.org/job/HBase-TRUNK-on-Hadoop-2.0.0/ws/trunk/hbase-server/target/surefire/surefire_2119143958050284382183tmp>
Running org.apache.hadoop.hbase.regionserver.TestStoreScanner
Tests run: 16, Failures: 0, Errors: 0, Skipped: 0, Time elapsed: 1.033 sec
Forking command line: /bin/sh -c cd <https://builds.apache.org/job/HBase-TRUNK-on-Hadoop-2.0.0/ws/trunk/hbase-server> && /home/jenkins/tools/java/jdk1.6.0_27-32/jre/bin/java -enableassertions -Xmx1900m -Djava.security.egd=file:/dev/./urandom -Djava.net.preferIPv4Stack=true -jar <https://builds.apache.org/job/HBase-TRUNK-on-Hadoop-2.0.0/ws/trunk/hbase-server/target/surefire/surefirebooter3472361949735772048.jar> <https://builds.apache.org/job/HBase-TRUNK-on-Hadoop-2.0.0/ws/trunk/hbase-server/target/surefire/surefire2027557295864614265tmp> <https://builds.apache.org/job/HBase-TRUNK-on-Hadoop-2.0.0/ws/trunk/hbase-server/target/surefire/surefire_2121225095851203221470tmp>
Running org.apache.hadoop.hbase.regionserver.wal.TestHLogFiltering
Tests run: 1, Failures: 0, Errors: 0, Skipped: 0, Time elapsed: 135.743 sec
Forking command line: /bin/sh -c cd <https://builds.apache.org/job/HBase-TRUNK-on-Hadoop-2.0.0/ws/trunk/hbase-server> && /home/jenkins/tools/java/jdk1.6.0_27-32/jre/bin/java -enableassertions -Xmx1900m -Djava.security.egd=file:/dev/./urandom -Djava.net.preferIPv4Stack=true -jar <https://builds.apache.org/job/HBase-TRUNK-on-Hadoop-2.0.0/ws/trunk/hbase-server/target/surefire/surefirebooter9163619828567814447.jar> <https://builds.apache.org/job/HBase-TRUNK-on-Hadoop-2.0.0/ws/trunk/hbase-server/target/surefire/surefire1908880502173269474tmp> <https://builds.apache.org/job/HBase-TRUNK-on-Hadoop-2.0.0/ws/trunk/hbase-server/target/surefire/surefire_2138226689634774830865tmp>
Running org.apache.hadoop.hbase.regionserver.wal.TestHLogSplitCompressed
Tests run: 32, Failures: 0, Errors: 0, Skipped: 1, Time elapsed: 402.002 sec
Forking command line: /bin/sh -c cd <https://builds.apache.org/job/HBase-TRUNK-on-Hadoop-2.0.0/ws/trunk/hbase-server> && /home/jenkins/tools/java/jdk1.6.0_27-32/jre/bin/java -enableassertions -Xmx1900m -Djava.security.egd=file:/dev/./urandom -Djava.net.preferIPv4Stack=true -jar <https://builds.apache.org/job/HBase-TRUNK-on-Hadoop-2.0.0/ws/trunk/hbase-server/target/surefire/surefirebooter4765624660105457777.jar> <https://builds.apache.org/job/HBase-TRUNK-on-Hadoop-2.0.0/ws/trunk/hbase-server/target/surefire/surefire6572798816661310390tmp> <https://builds.apache.org/job/HBase-TRUNK-on-Hadoop-2.0.0/ws/trunk/hbase-server/target/surefire/surefire_2141216180564342579606tmp>
Running org.apache.hadoop.hbase.regionserver.TestEndToEndSplitTransaction
Running org.apache.hadoop.hbase.regionserver.wal.TestWALReplayCompressed
Tests run: 8, Failures: 0, Errors: 0, Skipped: 0, Time elapsed: 255.607 sec
Forking command line: /bin/sh -c cd <https://builds.apache.org/job/HBase-TRUNK-on-Hadoop-2.0.0/ws/trunk/hbase-server> && /home/jenkins/tools/java/jdk1.6.0_27-32/jre/bin/java -enableassertions -Xmx1900m -Djava.security.egd=file:/dev/./urandom -Djava.net.preferIPv4Stack=true -jar <https://builds.apache.org/job/HBase-TRUNK-on-Hadoop-2.0.0/ws/trunk/hbase-server/target/surefire/surefirebooter6476446884037444834.jar> <https://builds.apache.org/job/HBase-TRUNK-on-Hadoop-2.0.0/ws/trunk/hbase-server/target/surefire/surefire9143250061451101579tmp> <https://builds.apache.org/job/HBase-TRUNK-on-Hadoop-2.0.0/ws/trunk/hbase-server/target/surefire/surefire_2157679447235125545377tmp>
Tests run: 2, Failures: 0, Errors: 0, Skipped: 0, Time elapsed: 174.493 sec
Forking command line: /bin/sh -c cd <https://builds.apache.org/job/HBase-TRUNK-on-Hadoop-2.0.0/ws/trunk/hbase-server> && /home/jenkins/tools/java/jdk1.6.0_27-32/jre/bin/java -enableassertions -Xmx1900m -Djava.security.egd=file:/dev/./urandom -Djava.net.preferIPv4Stack=true -jar <https://builds.apache.org/job/HBase-TRUNK-on-Hadoop-2.0.0/ws/trunk/hbase-server/target/surefire/surefirebooter7017779687532174832.jar> <https://builds.apache.org/job/HBase-TRUNK-on-Hadoop-2.0.0/ws/trunk/hbase-server/target/surefire/surefire1629607927564696144tmp> <https://builds.apache.org/job/HBase-TRUNK-on-Hadoop-2.0.0/ws/trunk/hbase-server/target/surefire/surefire_2164437939377460665394tmp>
Running org.apache.hadoop.hbase.mapred.TestTableInputFormat
Tests run: 10, Failures: 0, Errors: 0, Skipped: 0, Time elapsed: 68.097 sec
Forking command line: /bin/sh -c cd <https://builds.apache.org/job/HBase-TRUNK-on-Hadoop-2.0.0/ws/trunk/hbase-server> && /home/jenkins/tools/java/jdk1.6.0_27-32/jre/bin/java -enableassertions -Xmx1900m -Djava.security.egd=file:/dev/./urandom -Djava.net.preferIPv4Stack=true -jar <https://builds.apache.org/job/HBase-TRUNK-on-Hadoop-2.0.0/ws/trunk/hbase-server/target/surefire/surefirebooter7327007706992504191.jar> <https://builds.apache.org/job/HBase-TRUNK-on-Hadoop-2.0.0/ws/trunk/hbase-server/target/surefire/surefire6918676367902322642tmp> <https://builds.apache.org/job/HBase-TRUNK-on-Hadoop-2.0.0/ws/trunk/hbase-server/target/surefire/surefire_2174871984019418863536tmp>
Running org.apache.hadoop.hbase.regionserver.TestCompaction
Tests run: 17, Failures: 0, Errors: 0, Skipped: 0, Time elapsed: 165.81 sec
Forking command line: /bin/sh -c cd <https://builds.apache.org/job/HBase-TRUNK-on-Hadoop-2.0.0/ws/trunk/hbase-server> && /home/jenkins/tools/java/jdk1.6.0_27-32/jre/bin/java -enableassertions -Xmx1900m -Djava.security.egd=file:/dev/./urandom -Djava.net.preferIPv4Stack=true -jar <https://builds.apache.org/job/HBase-TRUNK-on-Hadoop-2.0.0/ws/trunk/hbase-server/target/surefire/surefirebooter6819185383215745952.jar> <https://builds.apache.org/job/HBase-TRUNK-on-Hadoop-2.0.0/ws/trunk/hbase-server/target/surefire/surefire5745330578094793532tmp> <https://builds.apache.org/job/HBase-TRUNK-on-Hadoop-2.0.0/ws/trunk/hbase-server/target/surefire/surefire_2187084976116513038051tmp>
Running org.apache.hadoop.hbase.fs.TestBlockReorder
Tests run: 3, Failures: 0, Errors: 0, Skipped: 0, Time elapsed: 76.738 sec
Forking command line: /bin/sh -c cd <https://builds.apache.org/job/HBase-TRUNK-on-Hadoop-2.0.0/ws/trunk/hbase-server> && /home/jenkins/tools/java/jdk1.6.0_27-32/jre/bin/java -enableassertions -Xmx1900m -Djava.security.egd=file:/dev/./urandom -Djava.net.preferIPv4Stack=true -jar <https://builds.apache.org/job/HBase-TRUNK-on-Hadoop-2.0.0/ws/trunk/hbase-server/target/surefire/surefirebooter9069232046426519847.jar> <https://builds.apache.org/job/HBase-TRUNK-on-Hadoop-2.0.0/ws/trunk/hbase-server/target/surefire/surefire5428204574627089313tmp> <https://builds.apache.org/job/HBase-TRUNK-on-Hadoop-2.0.0/ws/trunk/hbase-server/target/surefire/surefire_2198857302391261179667tmp>
Running org.apache.hadoop.hbase.backup.example.TestZooKeeperTableArchiveClient
Tests run: 3, Failures: 0, Errors: 0, Skipped: 0, Time elapsed: 18.109 sec
Forking command line: /bin/sh -c cd <https://builds.apache.org/job/HBase-TRUNK-on-Hadoop-2.0.0/ws/trunk/hbase-server> && /home/jenkins/tools/java/jdk1.6.0_27-32/jre/bin/java -enableassertions -Xmx1900m -Djava.security.egd=file:/dev/./urandom -Djava.net.preferIPv4Stack=true -jar <https://builds.apache.org/job/HBase-TRUNK-on-Hadoop-2.0.0/ws/trunk/hbase-server/target/surefire/surefirebooter2237022294476138165.jar> <https://builds.apache.org/job/HBase-TRUNK-on-Hadoop-2.0.0/ws/trunk/hbase-server/target/surefire/surefire7640453572331268376tmp> <https://builds.apache.org/job/HBase-TRUNK-on-Hadoop-2.0.0/ws/trunk/hbase-server/target/surefire/surefire_2201763612995411071599tmp>
Running org.apache.hadoop.hbase.regionserver.TestJoinedScanners
Running org.apache.hadoop.hbase.mapred.TestTableMapReduce
Tests run: 1, Failures: 0, Errors: 0, Skipped: 0, Time elapsed: 193.043 sec
Forking command line: /bin/sh -c cd <https://builds.apache.org/job/HBase-TRUNK-on-Hadoop-2.0.0/ws/trunk/hbase-server> && /home/jenkins/tools/java/jdk1.6.0_27-32/jre/bin/java -enableassertions -Xmx1900m -Djava.security.egd=file:/dev/./urandom -Djava.net.preferIPv4Stack=true -jar <https://builds.apache.org/job/HBase-TRUNK-on-Hadoop-2.0.0/ws/trunk/hbase-server/target/surefire/surefirebooter9129372295424835238.jar> <https://builds.apache.org/job/HBase-TRUNK-on-Hadoop-2.0.0/ws/trunk/hbase-server/target/surefire/surefire3324204417383571949tmp> <https://builds.apache.org/job/HBase-TRUNK-on-Hadoop-2.0.0/ws/trunk/hbase-server/target/surefire/surefire_22134399470033442528tmp>
Tests run: 1, Failures: 0, Errors: 0, Skipped: 0, Time elapsed: 871.863 sec
Forking command line: /bin/sh -c cd <https://builds.apache.org/job/HBase-TRUNK-on-Hadoop-2.0.0/ws/trunk/hbase-server> && /home/jenkins/tools/java/jdk1.6.0_27-32/jre/bin/java -enableassertions -Xmx1900m -Djava.security.egd=file:/dev/./urandom -Djava.net.preferIPv4Stack=true -jar <https://builds.apache.org/job/HBase-TRUNK-on-Hadoop-2.0.0/ws/trunk/hbase-server/target/surefire/surefirebooter4933844066029811465.jar> <https://builds.apache.org/job/HBase-TRUNK-on-Hadoop-2.0.0/ws/trunk/hbase-server/target/surefire/surefire6010512711866655701tmp> <https://builds.apache.org/job/HBase-TRUNK-on-Hadoop-2.0.0/ws/trunk/hbase-server/target/surefire/surefire_2222690263592789273287tmp>
Running org.apache.hadoop.hbase.TestClusterBootOrder
Tests run: 2, Failures: 0, Errors: 0, Skipped: 0, Time elapsed: 51.431 sec
Forking command line: /bin/sh -c cd <https://builds.apache.org/job/HBase-TRUNK-on-Hadoop-2.0.0/ws/trunk/hbase-server> && /home/jenkins/tools/java/jdk1.6.0_27-32/jre/bin/java -enableassertions -Xmx1900m -Djava.security.egd=file:/dev/./urandom -Djava.net.preferIPv4Stack=true -jar <https://builds.apache.org/job/HBase-TRUNK-on-Hadoop-2.0.0/ws/trunk/hbase-server/target/surefire/surefirebooter7700972922766418411.jar> <https://builds.apache.org/job/HBase-TRUNK-on-Hadoop-2.0.0/ws/trunk/hbase-server/target/surefire/surefire4702968906610628598tmp> <https://builds.apache.org/job/HBase-TRUNK-on-Hadoop-2.0.0/ws/trunk/hbase-server/target/surefire/surefire_2232368500901280875359tmp>
Running org.apache.hadoop.hbase.regionserver.TestMultiColumnScanner
Tests run: 12, Failures: 0, Errors: 0, Skipped: 0, Time elapsed: 282.151 sec
Running org.apache.hadoop.hbase.TestDrainingServer
Forking command line: /bin/sh -c cd <https://builds.apache.org/job/HBase-TRUNK-on-Hadoop-2.0.0/ws/trunk/hbase-server> && /home/jenkins/tools/java/jdk1.6.0_27-32/jre/bin/java -enableassertions -Xmx1900m -Djava.security.egd=file:/dev/./urandom -Djava.net.preferIPv4Stack=true -jar <https://builds.apache.org/job/HBase-TRUNK-on-Hadoop-2.0.0/ws/trunk/hbase-server/target/surefire/surefirebooter7895522708308706956.jar> <https://builds.apache.org/job/HBase-TRUNK-on-Hadoop-2.0.0/ws/trunk/hbase-server/target/surefire/surefire5258601885851603031tmp> <https://builds.apache.org/job/HBase-TRUNK-on-Hadoop-2.0.0/ws/trunk/hbase-server/target/surefire/surefire_2244610990083678673106tmp>
Tests run: 2, Failures: 0, Errors: 0, Skipped: 0, Time elapsed: 53.934 sec
Forking command line: /bin/sh -c cd <https://builds.apache.org/job/HBase-TRUNK-on-Hadoop-2.0.0/ws/trunk/hbase-server> && /home/jenkins/tools/java/jdk1.6.0_27-32/jre/bin/java -enableassertions -Xmx1900m -Djava.security.egd=file:/dev/./urandom -Djava.net.preferIPv4Stack=true -jar <https://builds.apache.org/job/HBase-TRUNK-on-Hadoop-2.0.0/ws/trunk/hbase-server/target/surefire/surefirebooter6473848537753573801.jar> <https://builds.apache.org/job/HBase-TRUNK-on-Hadoop-2.0.0/ws/trunk/hbase-server/target/surefire/surefire8579630404693099453tmp> <https://builds.apache.org/job/HBase-TRUNK-on-Hadoop-2.0.0/ws/trunk/hbase-server/target/surefire/surefire_2257439399908125519713tmp>
Running org.apache.hadoop.hbase.backup.TestHFileArchiving
Tests run: 5, Failures: 0, Errors: 0, Skipped: 0, Time elapsed: 192.897 sec
Forking command line: /bin/sh -c cd <https://builds.apache.org/job/HBase-TRUNK-on-Hadoop-2.0.0/ws/trunk/hbase-server> && /home/jenkins/tools/java/jdk1.6.0_27-32/jre/bin/java -enableassertions -Xmx1900m -Djava.security.egd=file:/dev/./urandom -Djava.net.preferIPv4Stack=true -jar <https://builds.apache.org/job/HBase-TRUNK-on-Hadoop-2.0.0/ws/trunk/hbase-server/target/surefire/surefirebooter3225965778415980649.jar> <https://builds.apache.org/job/HBase-TRUNK-on-Hadoop-2.0.0/ws/trunk/hbase-server/target/surefire/surefire7277357069323642235tmp> <https://builds.apache.org/job/HBase-TRUNK-on-Hadoop-2.0.0/ws/trunk/hbase-server/target/surefire/surefire_2267952886394798445293tmp>
Running org.apache.hadoop.hbase.mapreduce.TestTimeRangeMapRed
Tests run: 1, Failures: 0, Errors: 0, Skipped: 0, Time elapsed: 117.156 sec
Forking command line: /bin/sh -c cd <https://builds.apache.org/job/HBase-TRUNK-on-Hadoop-2.0.0/ws/trunk/hbase-server> && /home/jenkins/tools/java/jdk1.6.0_27-32/jre/bin/java -enableassertions -Xmx1900m -Djava.security.egd=file:/dev/./urandom -Djava.net.preferIPv4Stack=true -jar <https://builds.apache.org/job/HBase-TRUNK-on-Hadoop-2.0.0/ws/trunk/hbase-server/target/surefire/surefirebooter9027288889539526179.jar> <https://builds.apache.org/job/HBase-TRUNK-on-Hadoop-2.0.0/ws/trunk/hbase-server/target/surefire/surefire6856946703758263538tmp> <https://builds.apache.org/job/HBase-TRUNK-on-Hadoop-2.0.0/ws/trunk/hbase-server/target/surefire/surefire_2272204596954395316806tmp>
Running org.apache.hadoop.hbase.mapreduce.TestSecureLoadIncrementalHFiles
Tests run: 6, Failures: 0, Errors: 0, Skipped: 0, Time elapsed: 68.871 sec
Forking command line: /bin/sh -c cd <https://builds.apache.org/job/HBase-TRUNK-on-Hadoop-2.0.0/ws/trunk/hbase-server> && /home/jenkins/tools/java/jdk1.6.0_27-32/jre/bin/java -enableassertions -Xmx1900m -Djava.security.egd=file:/dev/./urandom -Djava.net.preferIPv4Stack=true -jar <https://builds.apache.org/job/HBase-TRUNK-on-Hadoop-2.0.0/ws/trunk/hbase-server/target/surefire/surefirebooter6158042277450879926.jar> <https://builds.apache.org/job/HBase-TRUNK-on-Hadoop-2.0.0/ws/trunk/hbase-server/target/surefire/surefire768564338382616308tmp> <https://builds.apache.org/job/HBase-TRUNK-on-Hadoop-2.0.0/ws/trunk/hbase-server/target/surefire/surefire_2285937607796649766664tmp>
Running org.apache.hadoop.hbase.mapreduce.TestRowCounter
Tests run: 3, Failures: 0, Errors: 0, Skipped: 0, Time elapsed: 203.937 sec
Forking command line: /bin/sh -c cd <https://builds.apache.org/job/HBase-TRUNK-on-Hadoop-2.0.0/ws/trunk/hbase-server> && /home/jenkins/tools/java/jdk1.6.0_27-32/jre/bin/java -enableassertions -Xmx1900m -Djava.security.egd=file:/dev/./urandom -Djava.net.preferIPv4Stack=true -jar <https://builds.apache.org/job/HBase-TRUNK-on-Hadoop-2.0.0/ws/trunk/hbase-server/target/surefire/surefirebooter1806816496937425664.jar> <https://builds.apache.org/job/HBase-TRUNK-on-Hadoop-2.0.0/ws/trunk/hbase-server/target/surefire/surefire205999182303553152tmp> <https://builds.apache.org/job/HBase-TRUNK-on-Hadoop-2.0.0/ws/trunk/hbase-server/target/surefire/surefire_2297088309664042537592tmp>
Running org.apache.hadoop.hbase.mapreduce.TestImportTsv
Tests run: 5, Failures: 0, Errors: 0, Skipped: 0, Time elapsed: 524.811 sec
Forking command line: /bin/sh -c cd <https://builds.apache.org/job/HBase-TRUNK-on-Hadoop-2.0.0/ws/trunk/hbase-server> && /home/jenkins/tools/java/jdk1.6.0_27-32/jre/bin/java -enableassertions -Xmx1900m -Djava.security.egd=file:/dev/./urandom -Djava.net.preferIPv4Stack=true -jar <https://builds.apache.org/job/HBase-TRUNK-on-Hadoop-2.0.0/ws/trunk/hbase-server/target/surefire/surefirebooter2724072911377130195.jar> <https://builds.apache.org/job/HBase-TRUNK-on-Hadoop-2.0.0/ws/trunk/hbase-server/target/surefire/surefire5076741167593184223tmp> <https://builds.apache.org/job/HBase-TRUNK-on-Hadoop-2.0.0/ws/trunk/hbase-server/target/surefire/surefire_2306175471523364776330tmp>
Running org.apache.hadoop.hbase.mapreduce.TestMultiTableInputFormat
Tests run: 5, Failures: 0, Errors: 0, Skipped: 0, Time elapsed: 693.61 sec
Forking command line: /bin/sh -c cd <https://builds.apache.org/job/HBase-TRUNK-on-Hadoop-2.0.0/ws/trunk/hbase-server> && /home/jenkins/tools/java/jdk1.6.0_27-32/jre/bin/java -enableassertions -Xmx1900m -Djava.security.egd=file:/dev/./urandom -Djava.net.preferIPv4Stack=true -jar <https://builds.apache.org/job/HBase-TRUNK-on-Hadoop-2.0.0/ws/trunk/hbase-server/target/surefire/surefirebooter2706532944743143981.jar> <https://builds.apache.org/job/HBase-TRUNK-on-Hadoop-2.0.0/ws/trunk/hbase-server/target/surefire/surefire6630546978602359382tmp> <https://builds.apache.org/job/HBase-TRUNK-on-Hadoop-2.0.0/ws/trunk/hbase-server/target/surefire/surefire_2319155339593830527989tmp>
Running org.apache.hadoop.hbase.mapreduce.TestHFileOutputFormat
Tests run: 10, Failures: 0, Errors: 0, Skipped: 0, Time elapsed: 740 sec
Forking command line: /bin/sh -c cd <https://builds.apache.org/job/HBase-TRUNK-on-Hadoop-2.0.0/ws/trunk/hbase-server> && /home/jenkins/tools/java/jdk1.6.0_27-32/jre/bin/java -enableassertions -Xmx1900m -Djava.security.egd=file:/dev/./urandom -Djava.net.preferIPv4Stack=true -jar <https://builds.apache.org/job/HBase-TRUNK-on-Hadoop-2.0.0/ws/trunk/hbase-server/target/surefire/surefirebooter5323428243167965161.jar> <https://builds.apache.org/job/HBase-TRUNK-on-Hadoop-2.0.0/ws/trunk/hbase-server/target/surefire/surefire4935504638377686843tmp> <https://builds.apache.org/job/HBase-TRUNK-on-Hadoop-2.0.0/ws/trunk/hbase-server/target/surefire/surefire_2327644329040582623674tmp>
Running org.apache.hadoop.hbase.mapreduce.TestWALPlayer
Tests run: 1, Failures: 0, Errors: 0, Skipped: 0, Time elapsed: 141.223 sec
Forking command line: /bin/sh -c cd <https://builds.apache.org/job/HBase-TRUNK-on-Hadoop-2.0.0/ws/trunk/hbase-server> && /home/jenkins/tools/java/jdk1.6.0_27-32/jre/bin/java -enableassertions -Xmx1900m -Djava.security.egd=file:/dev/./urandom -Djava.net.preferIPv4Stack=true -jar <https://builds.apache.org/job/HBase-TRUNK-on-Hadoop-2.0.0/ws/trunk/hbase-server/target/surefire/surefirebooter1526205042421016727.jar> <https://builds.apache.org/job/HBase-TRUNK-on-Hadoop-2.0.0/ws/trunk/hbase-server/target/surefire/surefire3657160507881558790tmp> <https://builds.apache.org/job/HBase-TRUNK-on-Hadoop-2.0.0/ws/trunk/hbase-server/target/surefire/surefire_2336737089509918584861tmp>
Running org.apache.hadoop.hbase.mapreduce.TestImportExport
Tests run: 5, Failures: 0, Errors: 0, Skipped: 0, Time elapsed: 652.858 sec
Forking command line: /bin/sh -c cd <https://builds.apache.org/job/HBase-TRUNK-on-Hadoop-2.0.0/ws/trunk/hbase-server> && /home/jenkins/tools/java/jdk1.6.0_27-32/jre/bin/java -enableassertions -Xmx1900m -Djava.security.egd=file:/dev/./urandom -Djava.net.preferIPv4Stack=true -jar <https://builds.apache.org/job/HBase-TRUNK-on-Hadoop-2.0.0/ws/trunk/hbase-server/target/surefire/surefirebooter1703770612574868829.jar> <https://builds.apache.org/job/HBase-TRUNK-on-Hadoop-2.0.0/ws/trunk/hbase-server/target/surefire/surefire2340635428506921133tmp> <https://builds.apache.org/job/HBase-TRUNK-on-Hadoop-2.0.0/ws/trunk/hbase-server/target/surefire/surefire_234619105317847192098tmp>
Running org.apache.hadoop.hbase.mapreduce.TestSecureLoadIncrementalHFilesSplitRecovery
Tests run: 4, Failures: 0, Errors: 0, Skipped: 0, Time elapsed: 125.532 sec
Forking command line: /bin/sh -c cd <https://builds.apache.org/job/HBase-TRUNK-on-Hadoop-2.0.0/ws/trunk/hbase-server> && /home/jenkins/tools/java/jdk1.6.0_27-32/jre/bin/java -enableassertions -Xmx1900m -Djava.security.egd=file:/dev/./urandom -Djava.net.preferIPv4Stack=true -jar <https://builds.apache.org/job/HBase-TRUNK-on-Hadoop-2.0.0/ws/trunk/hbase-server/target/surefire/surefirebooter2338830672372058204.jar> <https://builds.apache.org/job/HBase-TRUNK-on-Hadoop-2.0.0/ws/trunk/hbase-server/target/surefire/surefire6665168029254937019tmp> <https://builds.apache.org/job/HBase-TRUNK-on-Hadoop-2.0.0/ws/trunk/hbase-server/target/surefire/surefire_2351189714654717899398tmp>
Running org.apache.hadoop.hbase.mapreduce.TestLoadIncrementalHFilesSplitRecovery
Tests run: 4, Failures: 0, Errors: 0, Skipped: 0, Time elapsed: 154.266 sec
Forking command line: /bin/sh -c cd <https://builds.apache.org/job/HBase-TRUNK-on-Hadoop-2.0.0/ws/trunk/hbase-server> && /home/jenkins/tools/java/jdk1.6.0_27-32/jre/bin/java -enableassertions -Xmx1900m -Djava.security.egd=file:/dev/./urandom -Djava.net.preferIPv4Stack=true -jar <https://builds.apache.org/job/HBase-TRUNK-on-Hadoop-2.0.0/ws/trunk/hbase-server/target/surefire/surefirebooter2822032809445985865.jar> <https://builds.apache.org/job/HBase-TRUNK-on-Hadoop-2.0.0/ws/trunk/hbase-server/target/surefire/surefire9053017294519409094tmp> <https://builds.apache.org/job/HBase-TRUNK-on-Hadoop-2.0.0/ws/trunk/hbase-server/target/surefire/surefire_2363329128394111279216tmp>
Running org.apache.hadoop.hbase.mapreduce.TestMultithreadedTableMapper
Tests run: 1, Failures: 0, Errors: 0, Skipped: 0, Time elapsed: 280.885 sec
Running org.apache.hadoop.hbase.mapreduce.TestHLogRecordReader
Tests run: 2, Failures: 0, Errors: 0, Skipped: 0, Time elapsed: 27.271 sec
Running org.apache.hadoop.hbase.mapreduce.TestLoadIncrementalHFiles
Tests run: 6, Failures: 0, Errors: 0, Skipped: 0, Time elapsed: 56.842 sec
Running org.apache.hadoop.hbase.mapreduce.TestTableMapReduce
Tests run: 2, Failures: 0, Errors: 0, Skipped: 0, Time elapsed: 359.229 sec
Results :
Failed tests: testLeaderSelection(org.apache.hadoop.hbase.zookeeper.TestZKLeaderManager): New leader should exist
testModifyColumn(org.apache.hadoop.hbase.security.access.TestAccessController): Expected action to pass for user 'tbl_create' but was denied
Tests in error:
testTokenAuthentication(org.apache.hadoop.hbase.security.token.TestTokenAuthentication): Can't get Kerberos realm
loadTest[0](org.apache.hadoop.hbase.util.TestMiniClusterLoadParallel): test timed out after 180000 milliseconds
testCreateTableRPCTimeOut(org.apache.hadoop.hbase.client.TestAdmin): org.apache.hadoop.hbase.exceptions.OutOfOrderScannerNextException: Expected nextCallSeq: 2 But the nextCallSeq got from client: 1; request=scannerId: 1303893192503762736 numberOfRows: 100 closeScanner: false nextCallSeq: 1(..)
testTableReadLock(org.apache.hadoop.hbase.master.TestTableLockManager): test timed out after 600000 milliseconds
Tests run: 1462, Failures: 2, Errors: 4, Skipped: 13
[INFO]
[INFO] ------------------------------------------------------------------------
[INFO] Skipping HBase
[INFO] This project has been banned from the build due to previous failures.
[INFO] ------------------------------------------------------------------------
[INFO] ------------------------------------------------------------------------
[INFO] Reactor Summary:
[INFO]
[INFO] HBase ............................................. SUCCESS [20.175s]
[INFO] HBase - Common .................................... SUCCESS [48.275s]
[INFO] HBase - Protocol .................................. SUCCESS [44.378s]
[INFO] HBase - Client .................................... SUCCESS [19.240s]
[INFO] HBase - Prefix Tree ............................... SUCCESS [11.972s]
[INFO] HBase - Hadoop Compatibility ...................... SUCCESS [2.464s]
[INFO] HBase - Hadoop Two Compatibility .................. SUCCESS [12.804s]
[INFO] HBase - Server .................................... FAILURE [1:46:06.069s]
[INFO] HBase - Integration Tests ......................... SKIPPED
[INFO] HBase - Examples .................................. SKIPPED
[INFO] HBase - Assembly .................................. SKIPPED
[INFO] ------------------------------------------------------------------------
[INFO] BUILD FAILURE
[INFO] ------------------------------------------------------------------------
[INFO] Total time: 1:48:55.868s
[INFO] Finished at: Sat Mar 30 18:01:28 UTC 2013
[INFO] Final Memory: 64M/1367M
[INFO] ------------------------------------------------------------------------
[ERROR] Failed to execute goal org.apache.maven.plugins:maven-surefire-plugin:2.12-TRUNK-HBASE-2:test (secondPartTestsExecution) on project hbase-server: Failure or timeout -> [Help 1]
org.apache.maven.lifecycle.LifecycleExecutionException: Failed to execute goal org.apache.maven.plugins:maven-surefire-plugin:2.12-TRUNK-HBASE-2:test (secondPartTestsExecution) on project hbase-server: Failure or timeout
at org.apache.maven.lifecycle.internal.MojoExecutor.execute(MojoExecutor.java:217)
at org.apache.maven.lifecycle.internal.MojoExecutor.execute(MojoExecutor.java:153)
at org.apache.maven.lifecycle.internal.MojoExecutor.execute(MojoExecutor.java:145)
at org.apache.maven.lifecycle.internal.LifecycleModuleBuilder.buildProject(LifecycleModuleBuilder.java:84)
at org.apache.maven.lifecycle.internal.LifecycleModuleBuilder.buildProject(LifecycleModuleBuilder.java:59)
at org.apache.maven.lifecycle.internal.LifecycleStarter.singleThreadedBuild(LifecycleStarter.java:183)
at org.apache.maven.lifecycle.internal.LifecycleStarter.execute(LifecycleStarter.java:161)
at org.apache.maven.DefaultMaven.doExecute(DefaultMaven.java:320)
at org.apache.maven.DefaultMaven.execute(DefaultMaven.java:156)
at org.apache.maven.cli.MavenCli.execute(MavenCli.java:537)
at org.apache.maven.cli.MavenCli.doMain(MavenCli.java:196)
at org.apache.maven.cli.MavenCli.main(MavenCli.java:141)
at sun.reflect.NativeMethodAccessorImpl.invoke0(Native Method)
at sun.reflect.NativeMethodAccessorImpl.invoke(NativeMethodAccessorImpl.java:39)
at sun.reflect.DelegatingMethodAccessorImpl.invoke(DelegatingMethodAccessorImpl.java:25)
at java.lang.reflect.Method.invoke(Method.java:597)
at org.codehaus.plexus.classworlds.launcher.Launcher.launchEnhanced(Launcher.java:290)
at org.codehaus.plexus.classworlds.launcher.Launcher.launch(Launcher.java:230)
at org.codehaus.plexus.classworlds.launcher.Launcher.mainWithExitCode(Launcher.java:409)
at org.codehaus.plexus.classworlds.launcher.Launcher.main(Launcher.java:352)
Caused by: org.apache.maven.plugin.MojoExecutionException: Failure or timeout
at org.apache.maven.plugin.surefire.SurefirePlugin.assertNoFailureOrTimeout(SurefirePlugin.java:643)
at org.apache.maven.plugin.surefire.SurefirePlugin.handleSummary(SurefirePlugin.java:624)
at org.apache.maven.plugin.surefire.AbstractSurefireMojo.executeAfterPreconditionsChecked(AbstractSurefireMojo.java:137)
at org.apache.maven.plugin.surefire.AbstractSurefireMojo.execute(AbstractSurefireMojo.java:98)
at org.apache.maven.plugin.DefaultBuildPluginManager.executeMojo(DefaultBuildPluginManager.java:101)
at org.apache.maven.lifecycle.internal.MojoExecutor.execute(MojoExecutor.java:209)
... 19 more
[ERROR]
[ERROR]
[ERROR] For more information about the errors and possible solutions, please read the following articles:
[ERROR] [Help 1] http://cwiki.apache.org/confluence/display/MAVEN/MojoExecutionException
[ERROR]
[ERROR] After correcting the problems, you can resume the build with the command
[ERROR] mvn <goals> -rf :hbase-server
Build step 'Invoke top-level Maven targets' marked build as failure
Archiving artifacts
Recording test results
Updating HBASE-7904
Build failed in Jenkins: HBase-TRUNK-on-Hadoop-2.0.0 #469
Posted by Apache Jenkins Server <je...@builds.apache.org>.
See <https://builds.apache.org/job/HBase-TRUNK-on-Hadoop-2.0.0/469/changes>
Changes:
[tedyu] HBASE-7904 Make mapreduce jobs pass based on 2.0.4-alpha
[tedyu] HBASE-8222 User class should implement equals() and hashCode()
[tedyu] HBASE-8164 TestTableLockManager fails intermittently in trunk builds, addendum
------------------------------------------
[...truncated 30075 lines...]
Running org.apache.hadoop.hbase.regionserver.TestCompoundBloomFilter
Tests run: 3, Failures: 0, Errors: 0, Skipped: 0, Time elapsed: 130.127 sec
Forking command line: /bin/sh -c cd <https://builds.apache.org/job/HBase-TRUNK-on-Hadoop-2.0.0/ws/trunk/hbase-server> && /home/jenkins/tools/java/jdk1.6.0_27-32/jre/bin/java -enableassertions -Xmx1900m -Djava.security.egd=file:/dev/./urandom -Djava.net.preferIPv4Stack=true -jar <https://builds.apache.org/job/HBase-TRUNK-on-Hadoop-2.0.0/ws/trunk/hbase-server/target/surefire/surefirebooter8579788029006397353.jar> <https://builds.apache.org/job/HBase-TRUNK-on-Hadoop-2.0.0/ws/trunk/hbase-server/target/surefire/surefire6983242497118176324tmp> <https://builds.apache.org/job/HBase-TRUNK-on-Hadoop-2.0.0/ws/trunk/hbase-server/target/surefire/surefire_1827544885948403837210tmp>
Running org.apache.hadoop.hbase.regionserver.TestCompactionWithCoprocessor
Tests run: 17, Failures: 0, Errors: 0, Skipped: 0, Time elapsed: 207.205 sec
Running org.apache.hadoop.hbase.regionserver.TestSplitLogWorker
Tests run: 5, Failures: 0, Errors: 0, Skipped: 0, Time elapsed: 10.583 sec
Forking command line: /bin/sh -c cd <https://builds.apache.org/job/HBase-TRUNK-on-Hadoop-2.0.0/ws/trunk/hbase-server> && /home/jenkins/tools/java/jdk1.6.0_27-32/jre/bin/java -enableassertions -Xmx1900m -Djava.security.egd=file:/dev/./urandom -Djava.net.preferIPv4Stack=true -jar <https://builds.apache.org/job/HBase-TRUNK-on-Hadoop-2.0.0/ws/trunk/hbase-server/target/surefire/surefirebooter8996889292606545510.jar> <https://builds.apache.org/job/HBase-TRUNK-on-Hadoop-2.0.0/ws/trunk/hbase-server/target/surefire/surefire8629567977544438362tmp> <https://builds.apache.org/job/HBase-TRUNK-on-Hadoop-2.0.0/ws/trunk/hbase-server/target/surefire/surefire_1836525300256576807377tmp>
Forking command line: /bin/sh -c cd <https://builds.apache.org/job/HBase-TRUNK-on-Hadoop-2.0.0/ws/trunk/hbase-server> && /home/jenkins/tools/java/jdk1.6.0_27-32/jre/bin/java -enableassertions -Xmx1900m -Djava.security.egd=file:/dev/./urandom -Djava.net.preferIPv4Stack=true -jar <https://builds.apache.org/job/HBase-TRUNK-on-Hadoop-2.0.0/ws/trunk/hbase-server/target/surefire/surefirebooter612627104463222593.jar> <https://builds.apache.org/job/HBase-TRUNK-on-Hadoop-2.0.0/ws/trunk/hbase-server/target/surefire/surefire6314636726347827133tmp> <https://builds.apache.org/job/HBase-TRUNK-on-Hadoop-2.0.0/ws/trunk/hbase-server/target/surefire/surefire_1842740446841617618191tmp>
Running org.apache.hadoop.hbase.regionserver.TestMemStore
Tests run: 22, Failures: 0, Errors: 0, Skipped: 0, Time elapsed: 256.247 sec
Forking command line: /bin/sh -c cd <https://builds.apache.org/job/HBase-TRUNK-on-Hadoop-2.0.0/ws/trunk/hbase-server> && /home/jenkins/tools/java/jdk1.6.0_27-32/jre/bin/java -enableassertions -Xmx1900m -Djava.security.egd=file:/dev/./urandom -Djava.net.preferIPv4Stack=true -jar <https://builds.apache.org/job/HBase-TRUNK-on-Hadoop-2.0.0/ws/trunk/hbase-server/target/surefire/surefirebooter2368643421076016931.jar> <https://builds.apache.org/job/HBase-TRUNK-on-Hadoop-2.0.0/ws/trunk/hbase-server/target/surefire/surefire2944645975163668644tmp> <https://builds.apache.org/job/HBase-TRUNK-on-Hadoop-2.0.0/ws/trunk/hbase-server/target/surefire/surefire_1855500336467070237121tmp>
Running org.apache.hadoop.hbase.regionserver.TestHRegion
Tests run: 62, Failures: 0, Errors: 0, Skipped: 0, Time elapsed: 251.563 sec
Forking command line: /bin/sh -c cd <https://builds.apache.org/job/HBase-TRUNK-on-Hadoop-2.0.0/ws/trunk/hbase-server> && /home/jenkins/tools/java/jdk1.6.0_27-32/jre/bin/java -enableassertions -Xmx1900m -Djava.security.egd=file:/dev/./urandom -Djava.net.preferIPv4Stack=true -jar <https://builds.apache.org/job/HBase-TRUNK-on-Hadoop-2.0.0/ws/trunk/hbase-server/target/surefire/surefirebooter6308364935429158816.jar> <https://builds.apache.org/job/HBase-TRUNK-on-Hadoop-2.0.0/ws/trunk/hbase-server/target/surefire/surefire7550721903343702163tmp> <https://builds.apache.org/job/HBase-TRUNK-on-Hadoop-2.0.0/ws/trunk/hbase-server/target/surefire/surefire_1861181905460064981524tmp>
Running org.apache.hadoop.hbase.regionserver.TestStore
Tests run: 15, Failures: 0, Errors: 0, Skipped: 0, Time elapsed: 25.64 sec
Forking command line: /bin/sh -c cd <https://builds.apache.org/job/HBase-TRUNK-on-Hadoop-2.0.0/ws/trunk/hbase-server> && /home/jenkins/tools/java/jdk1.6.0_27-32/jre/bin/java -enableassertions -Xmx1900m -Djava.security.egd=file:/dev/./urandom -Djava.net.preferIPv4Stack=true -jar <https://builds.apache.org/job/HBase-TRUNK-on-Hadoop-2.0.0/ws/trunk/hbase-server/target/surefire/surefirebooter6481075902398644336.jar> <https://builds.apache.org/job/HBase-TRUNK-on-Hadoop-2.0.0/ws/trunk/hbase-server/target/surefire/surefire5198198536551506725tmp> <https://builds.apache.org/job/HBase-TRUNK-on-Hadoop-2.0.0/ws/trunk/hbase-server/target/surefire/surefire_1878302895990799903830tmp>
Running org.apache.hadoop.hbase.regionserver.TestStoreFileBlockCacheSummary
Tests run: 1, Failures: 0, Errors: 0, Skipped: 0, Time elapsed: 42.25 sec
Forking command line: /bin/sh -c cd <https://builds.apache.org/job/HBase-TRUNK-on-Hadoop-2.0.0/ws/trunk/hbase-server> && /home/jenkins/tools/java/jdk1.6.0_27-32/jre/bin/java -enableassertions -Xmx1900m -Djava.security.egd=file:/dev/./urandom -Djava.net.preferIPv4Stack=true -jar <https://builds.apache.org/job/HBase-TRUNK-on-Hadoop-2.0.0/ws/trunk/hbase-server/target/surefire/surefirebooter6093439871546985715.jar> <https://builds.apache.org/job/HBase-TRUNK-on-Hadoop-2.0.0/ws/trunk/hbase-server/target/surefire/surefire872902669169685951tmp> <https://builds.apache.org/job/HBase-TRUNK-on-Hadoop-2.0.0/ws/trunk/hbase-server/target/surefire/surefire_1883984746844077377802tmp>
Running org.apache.hadoop.hbase.regionserver.TestServerCustomProtocol
Tests run: 7, Failures: 0, Errors: 0, Skipped: 0, Time elapsed: 98.274 sec
Forking command line: /bin/sh -c cd <https://builds.apache.org/job/HBase-TRUNK-on-Hadoop-2.0.0/ws/trunk/hbase-server> && /home/jenkins/tools/java/jdk1.6.0_27-32/jre/bin/java -enableassertions -Xmx1900m -Djava.security.egd=file:/dev/./urandom -Djava.net.preferIPv4Stack=true -jar <https://builds.apache.org/job/HBase-TRUNK-on-Hadoop-2.0.0/ws/trunk/hbase-server/target/surefire/surefirebooter3793784150541753333.jar> <https://builds.apache.org/job/HBase-TRUNK-on-Hadoop-2.0.0/ws/trunk/hbase-server/target/surefire/surefire5499523677765413375tmp> <https://builds.apache.org/job/HBase-TRUNK-on-Hadoop-2.0.0/ws/trunk/hbase-server/target/surefire/surefire_1895124972936196673382tmp>
Running org.apache.hadoop.hbase.regionserver.TestClusterId
Tests run: 1, Failures: 0, Errors: 0, Skipped: 0, Time elapsed: 72.005 sec
Forking command line: /bin/sh -c cd <https://builds.apache.org/job/HBase-TRUNK-on-Hadoop-2.0.0/ws/trunk/hbase-server> && /home/jenkins/tools/java/jdk1.6.0_27-32/jre/bin/java -enableassertions -Xmx1900m -Djava.security.egd=file:/dev/./urandom -Djava.net.preferIPv4Stack=true -jar <https://builds.apache.org/job/HBase-TRUNK-on-Hadoop-2.0.0/ws/trunk/hbase-server/target/surefire/surefirebooter7101467760615446155.jar> <https://builds.apache.org/job/HBase-TRUNK-on-Hadoop-2.0.0/ws/trunk/hbase-server/target/surefire/surefire8888545891469710819tmp> <https://builds.apache.org/job/HBase-TRUNK-on-Hadoop-2.0.0/ws/trunk/hbase-server/target/surefire/surefire_1903085868740090273624tmp>
Running org.apache.hadoop.hbase.regionserver.TestHRegionBusyWait
Tests run: 63, Failures: 0, Errors: 0, Skipped: 0, Time elapsed: 213.333 sec
Forking command line: /bin/sh -c cd <https://builds.apache.org/job/HBase-TRUNK-on-Hadoop-2.0.0/ws/trunk/hbase-server> && /home/jenkins/tools/java/jdk1.6.0_27-32/jre/bin/java -enableassertions -Xmx1900m -Djava.security.egd=file:/dev/./urandom -Djava.net.preferIPv4Stack=true -jar <https://builds.apache.org/job/HBase-TRUNK-on-Hadoop-2.0.0/ws/trunk/hbase-server/target/surefire/surefirebooter3337271815672548463.jar> <https://builds.apache.org/job/HBase-TRUNK-on-Hadoop-2.0.0/ws/trunk/hbase-server/target/surefire/surefire4045215674257781994tmp> <https://builds.apache.org/job/HBase-TRUNK-on-Hadoop-2.0.0/ws/trunk/hbase-server/target/surefire/surefire_1912896488221601383158tmp>
Running org.apache.hadoop.hbase.regionserver.TestBlocksRead
Tests run: 4, Failures: 0, Errors: 0, Skipped: 0, Time elapsed: 16.15 sec
Forking command line: /bin/sh -c cd <https://builds.apache.org/job/HBase-TRUNK-on-Hadoop-2.0.0/ws/trunk/hbase-server> && /home/jenkins/tools/java/jdk1.6.0_27-32/jre/bin/java -enableassertions -Xmx1900m -Djava.security.egd=file:/dev/./urandom -Djava.net.preferIPv4Stack=true -jar <https://builds.apache.org/job/HBase-TRUNK-on-Hadoop-2.0.0/ws/trunk/hbase-server/target/surefire/surefirebooter6832411394483640854.jar> <https://builds.apache.org/job/HBase-TRUNK-on-Hadoop-2.0.0/ws/trunk/hbase-server/target/surefire/surefire8189618332174066305tmp> <https://builds.apache.org/job/HBase-TRUNK-on-Hadoop-2.0.0/ws/trunk/hbase-server/target/surefire/surefire_1929162708089628866884tmp>
Running org.apache.hadoop.hbase.regionserver.TestAtomicOperation
Running org.apache.hadoop.hbase.regionserver.TestFSErrorsExposed
Tests run: 3, Failures: 0, Errors: 0, Skipped: 1, Time elapsed: 6.752 sec
Forking command line: /bin/sh -c cd <https://builds.apache.org/job/HBase-TRUNK-on-Hadoop-2.0.0/ws/trunk/hbase-server> && /home/jenkins/tools/java/jdk1.6.0_27-32/jre/bin/java -enableassertions -Xmx1900m -Djava.security.egd=file:/dev/./urandom -Djava.net.preferIPv4Stack=true -jar <https://builds.apache.org/job/HBase-TRUNK-on-Hadoop-2.0.0/ws/trunk/hbase-server/target/surefire/surefirebooter5210186569006204031.jar> <https://builds.apache.org/job/HBase-TRUNK-on-Hadoop-2.0.0/ws/trunk/hbase-server/target/surefire/surefire1825771023618295298tmp> <https://builds.apache.org/job/HBase-TRUNK-on-Hadoop-2.0.0/ws/trunk/hbase-server/target/surefire/surefire_1936724448507549385193tmp>
Tests run: 5, Failures: 0, Errors: 0, Skipped: 0, Time elapsed: 118.805 sec
Forking command line: /bin/sh -c cd <https://builds.apache.org/job/HBase-TRUNK-on-Hadoop-2.0.0/ws/trunk/hbase-server> && /home/jenkins/tools/java/jdk1.6.0_27-32/jre/bin/java -enableassertions -Xmx1900m -Djava.security.egd=file:/dev/./urandom -Djava.net.preferIPv4Stack=true -jar <https://builds.apache.org/job/HBase-TRUNK-on-Hadoop-2.0.0/ws/trunk/hbase-server/target/surefire/surefirebooter8983354060087116525.jar> <https://builds.apache.org/job/HBase-TRUNK-on-Hadoop-2.0.0/ws/trunk/hbase-server/target/surefire/surefire4854259359852292496tmp> <https://builds.apache.org/job/HBase-TRUNK-on-Hadoop-2.0.0/ws/trunk/hbase-server/target/surefire/surefire_1943178052094147290319tmp>
Running org.apache.hadoop.hbase.regionserver.TestSeekOptimizations
Tests run: 6, Failures: 0, Errors: 0, Skipped: 0, Time elapsed: 21.379 sec
Forking command line: /bin/sh -c cd <https://builds.apache.org/job/HBase-TRUNK-on-Hadoop-2.0.0/ws/trunk/hbase-server> && /home/jenkins/tools/java/jdk1.6.0_27-32/jre/bin/java -enableassertions -Xmx1900m -Djava.security.egd=file:/dev/./urandom -Djava.net.preferIPv4Stack=true -jar <https://builds.apache.org/job/HBase-TRUNK-on-Hadoop-2.0.0/ws/trunk/hbase-server/target/surefire/surefirebooter2266877235133593544.jar> <https://builds.apache.org/job/HBase-TRUNK-on-Hadoop-2.0.0/ws/trunk/hbase-server/target/surefire/surefire2702194294647753699tmp> <https://builds.apache.org/job/HBase-TRUNK-on-Hadoop-2.0.0/ws/trunk/hbase-server/target/surefire/surefire_1955747328145692915023tmp>
Running org.apache.hadoop.hbase.regionserver.TestRegionMergeTransactionOnCluster
Tests run: 2, Failures: 0, Errors: 0, Skipped: 0, Time elapsed: 81.882 sec
Forking command line: /bin/sh -c cd <https://builds.apache.org/job/HBase-TRUNK-on-Hadoop-2.0.0/ws/trunk/hbase-server> && /home/jenkins/tools/java/jdk1.6.0_27-32/jre/bin/java -enableassertions -Xmx1900m -Djava.security.egd=file:/dev/./urandom -Djava.net.preferIPv4Stack=true -jar <https://builds.apache.org/job/HBase-TRUNK-on-Hadoop-2.0.0/ws/trunk/hbase-server/target/surefire/surefirebooter8308126714375625905.jar> <https://builds.apache.org/job/HBase-TRUNK-on-Hadoop-2.0.0/ws/trunk/hbase-server/target/surefire/surefire4570826872133990410tmp> <https://builds.apache.org/job/HBase-TRUNK-on-Hadoop-2.0.0/ws/trunk/hbase-server/target/surefire/surefire_1968478846588730905851tmp>
Running org.apache.hadoop.hbase.regionserver.handler.TestCloseRegionHandler
Tests run: 3, Failures: 0, Errors: 0, Skipped: 0, Time elapsed: 10.25 sec
Forking command line: /bin/sh -c cd <https://builds.apache.org/job/HBase-TRUNK-on-Hadoop-2.0.0/ws/trunk/hbase-server> && /home/jenkins/tools/java/jdk1.6.0_27-32/jre/bin/java -enableassertions -Xmx1900m -Djava.security.egd=file:/dev/./urandom -Djava.net.preferIPv4Stack=true -jar <https://builds.apache.org/job/HBase-TRUNK-on-Hadoop-2.0.0/ws/trunk/hbase-server/target/surefire/surefirebooter7566831287397892633.jar> <https://builds.apache.org/job/HBase-TRUNK-on-Hadoop-2.0.0/ws/trunk/hbase-server/target/surefire/surefire5561100716640960602tmp> <https://builds.apache.org/job/HBase-TRUNK-on-Hadoop-2.0.0/ws/trunk/hbase-server/target/surefire/surefire_1971062975306493896824tmp>
Running org.apache.hadoop.hbase.regionserver.TestRSKilledWhenMasterInitializing
Tests run: 1, Failures: 0, Errors: 0, Skipped: 0, Time elapsed: 70.367 sec
Forking command line: /bin/sh -c cd <https://builds.apache.org/job/HBase-TRUNK-on-Hadoop-2.0.0/ws/trunk/hbase-server> && /home/jenkins/tools/java/jdk1.6.0_27-32/jre/bin/java -enableassertions -Xmx1900m -Djava.security.egd=file:/dev/./urandom -Djava.net.preferIPv4Stack=true -jar <https://builds.apache.org/job/HBase-TRUNK-on-Hadoop-2.0.0/ws/trunk/hbase-server/target/surefire/surefirebooter8118852005611473187.jar> <https://builds.apache.org/job/HBase-TRUNK-on-Hadoop-2.0.0/ws/trunk/hbase-server/target/surefire/surefire63166595398024198tmp> <https://builds.apache.org/job/HBase-TRUNK-on-Hadoop-2.0.0/ws/trunk/hbase-server/target/surefire/surefire_1982986458384160911942tmp>
Running org.apache.hadoop.hbase.regionserver.handler.TestOpenRegionHandler
Tests run: 5, Failures: 0, Errors: 0, Skipped: 0, Time elapsed: 10.129 sec
Forking command line: /bin/sh -c cd <https://builds.apache.org/job/HBase-TRUNK-on-Hadoop-2.0.0/ws/trunk/hbase-server> && /home/jenkins/tools/java/jdk1.6.0_27-32/jre/bin/java -enableassertions -Xmx1900m -Djava.security.egd=file:/dev/./urandom -Djava.net.preferIPv4Stack=true -jar <https://builds.apache.org/job/HBase-TRUNK-on-Hadoop-2.0.0/ws/trunk/hbase-server/target/surefire/surefirebooter2452075392107903600.jar> <https://builds.apache.org/job/HBase-TRUNK-on-Hadoop-2.0.0/ws/trunk/hbase-server/target/surefire/surefire1355839508384172109tmp> <https://builds.apache.org/job/HBase-TRUNK-on-Hadoop-2.0.0/ws/trunk/hbase-server/target/surefire/surefire_1993300838308710366789tmp>
Running org.apache.hadoop.hbase.regionserver.TestGetClosestAtOrBefore
Tests run: 3, Failures: 0, Errors: 0, Skipped: 0, Time elapsed: 9.249 sec
Forking command line: /bin/sh -c cd <https://builds.apache.org/job/HBase-TRUNK-on-Hadoop-2.0.0/ws/trunk/hbase-server> && /home/jenkins/tools/java/jdk1.6.0_27-32/jre/bin/java -enableassertions -Xmx1900m -Djava.security.egd=file:/dev/./urandom -Djava.net.preferIPv4Stack=true -jar <https://builds.apache.org/job/HBase-TRUNK-on-Hadoop-2.0.0/ws/trunk/hbase-server/target/surefire/surefirebooter2359745496537931629.jar> <https://builds.apache.org/job/HBase-TRUNK-on-Hadoop-2.0.0/ws/trunk/hbase-server/target/surefire/surefire2665729562195128tmp> <https://builds.apache.org/job/HBase-TRUNK-on-Hadoop-2.0.0/ws/trunk/hbase-server/target/surefire/surefire_2009205136476341753875tmp>
Running org.apache.hadoop.hbase.regionserver.TestCompactionState
Tests run: 5, Failures: 0, Errors: 0, Skipped: 0, Time elapsed: 179.857 sec
Forking command line: /bin/sh -c cd <https://builds.apache.org/job/HBase-TRUNK-on-Hadoop-2.0.0/ws/trunk/hbase-server> && /home/jenkins/tools/java/jdk1.6.0_27-32/jre/bin/java -enableassertions -Xmx1900m -Djava.security.egd=file:/dev/./urandom -Djava.net.preferIPv4Stack=true -jar <https://builds.apache.org/job/HBase-TRUNK-on-Hadoop-2.0.0/ws/trunk/hbase-server/target/surefire/surefirebooter2543876532268607239.jar> <https://builds.apache.org/job/HBase-TRUNK-on-Hadoop-2.0.0/ws/trunk/hbase-server/target/surefire/surefire4859450094411739931tmp> <https://builds.apache.org/job/HBase-TRUNK-on-Hadoop-2.0.0/ws/trunk/hbase-server/target/surefire/surefire_201376905762114223810tmp>
Running org.apache.hadoop.hbase.regionserver.TestParallelPut
Tests run: 2, Failures: 0, Errors: 0, Skipped: 0, Time elapsed: 40.334 sec
Forking command line: /bin/sh -c cd <https://builds.apache.org/job/HBase-TRUNK-on-Hadoop-2.0.0/ws/trunk/hbase-server> && /home/jenkins/tools/java/jdk1.6.0_27-32/jre/bin/java -enableassertions -Xmx1900m -Djava.security.egd=file:/dev/./urandom -Djava.net.preferIPv4Stack=true -jar <https://builds.apache.org/job/HBase-TRUNK-on-Hadoop-2.0.0/ws/trunk/hbase-server/target/surefire/surefirebooter1151287053173840755.jar> <https://builds.apache.org/job/HBase-TRUNK-on-Hadoop-2.0.0/ws/trunk/hbase-server/target/surefire/surefire2295998446410125913tmp> <https://builds.apache.org/job/HBase-TRUNK-on-Hadoop-2.0.0/ws/trunk/hbase-server/target/surefire/surefire_2027360129052149608025tmp>
Running org.apache.hadoop.hbase.regionserver.TestCacheOnWriteInSchema
Tests run: 3, Failures: 0, Errors: 0, Skipped: 0, Time elapsed: 25.274 sec
Forking command line: /bin/sh -c cd <https://builds.apache.org/job/HBase-TRUNK-on-Hadoop-2.0.0/ws/trunk/hbase-server> && /home/jenkins/tools/java/jdk1.6.0_27-32/jre/bin/java -enableassertions -Xmx1900m -Djava.security.egd=file:/dev/./urandom -Djava.net.preferIPv4Stack=true -jar <https://builds.apache.org/job/HBase-TRUNK-on-Hadoop-2.0.0/ws/trunk/hbase-server/target/surefire/surefirebooter576595578115236425.jar> <https://builds.apache.org/job/HBase-TRUNK-on-Hadoop-2.0.0/ws/trunk/hbase-server/target/surefire/surefire1420644029245542606tmp> <https://builds.apache.org/job/HBase-TRUNK-on-Hadoop-2.0.0/ws/trunk/hbase-server/target/surefire/surefire_2035055131543526651338tmp>
Running org.apache.hadoop.hbase.regionserver.TestPriorityRpc
Tests run: 3, Failures: 0, Errors: 0, Skipped: 0, Time elapsed: 17.299 sec
Forking command line: /bin/sh -c cd <https://builds.apache.org/job/HBase-TRUNK-on-Hadoop-2.0.0/ws/trunk/hbase-server> && /home/jenkins/tools/java/jdk1.6.0_27-32/jre/bin/java -enableassertions -Xmx1900m -Djava.security.egd=file:/dev/./urandom -Djava.net.preferIPv4Stack=true -jar <https://builds.apache.org/job/HBase-TRUNK-on-Hadoop-2.0.0/ws/trunk/hbase-server/target/surefire/surefirebooter7456512541674572000.jar> <https://builds.apache.org/job/HBase-TRUNK-on-Hadoop-2.0.0/ws/trunk/hbase-server/target/surefire/surefire2337161603144354082tmp> <https://builds.apache.org/job/HBase-TRUNK-on-Hadoop-2.0.0/ws/trunk/hbase-server/target/surefire/surefire_2044573425200945435688tmp>
Running org.apache.hadoop.hbase.regionserver.TestHRegionServerBulkLoad
Tests run: 1, Failures: 0, Errors: 0, Skipped: 0, Time elapsed: 104.24 sec
Forking command line: /bin/sh -c cd <https://builds.apache.org/job/HBase-TRUNK-on-Hadoop-2.0.0/ws/trunk/hbase-server> && /home/jenkins/tools/java/jdk1.6.0_27-32/jre/bin/java -enableassertions -Xmx1900m -Djava.security.egd=file:/dev/./urandom -Djava.net.preferIPv4Stack=true -jar <https://builds.apache.org/job/HBase-TRUNK-on-Hadoop-2.0.0/ws/trunk/hbase-server/target/surefire/surefirebooter2450420744753404988.jar> <https://builds.apache.org/job/HBase-TRUNK-on-Hadoop-2.0.0/ws/trunk/hbase-server/target/surefire/surefire7399904944007544351tmp> <https://builds.apache.org/job/HBase-TRUNK-on-Hadoop-2.0.0/ws/trunk/hbase-server/target/surefire/surefire_2056511560145563055648tmp>
Running org.apache.hadoop.hbase.regionserver.wal.TestLogRollAbort
Tests run: 1, Failures: 0, Errors: 0, Skipped: 0, Time elapsed: 78.195 sec
Forking command line: /bin/sh -c cd <https://builds.apache.org/job/HBase-TRUNK-on-Hadoop-2.0.0/ws/trunk/hbase-server> && /home/jenkins/tools/java/jdk1.6.0_27-32/jre/bin/java -enableassertions -Xmx1900m -Djava.security.egd=file:/dev/./urandom -Djava.net.preferIPv4Stack=true -jar <https://builds.apache.org/job/HBase-TRUNK-on-Hadoop-2.0.0/ws/trunk/hbase-server/target/surefire/surefirebooter9111315117767444702.jar> <https://builds.apache.org/job/HBase-TRUNK-on-Hadoop-2.0.0/ws/trunk/hbase-server/target/surefire/surefire4493757518117532283tmp> <https://builds.apache.org/job/HBase-TRUNK-on-Hadoop-2.0.0/ws/trunk/hbase-server/target/surefire/surefire_2064179402850935670268tmp>
Running org.apache.hadoop.hbase.regionserver.TestSplitTransactionOnCluster
Tests run: 8, Failures: 0, Errors: 0, Skipped: 0, Time elapsed: 191.682 sec
Forking command line: /bin/sh -c cd <https://builds.apache.org/job/HBase-TRUNK-on-Hadoop-2.0.0/ws/trunk/hbase-server> && /home/jenkins/tools/java/jdk1.6.0_27-32/jre/bin/java -enableassertions -Xmx1900m -Djava.security.egd=file:/dev/./urandom -Djava.net.preferIPv4Stack=true -jar <https://builds.apache.org/job/HBase-TRUNK-on-Hadoop-2.0.0/ws/trunk/hbase-server/target/surefire/surefirebooter4132820748415186614.jar> <https://builds.apache.org/job/HBase-TRUNK-on-Hadoop-2.0.0/ws/trunk/hbase-server/target/surefire/surefire140326650377694442tmp> <https://builds.apache.org/job/HBase-TRUNK-on-Hadoop-2.0.0/ws/trunk/hbase-server/target/surefire/surefire_207735857280208195195tmp>
Running org.apache.hadoop.hbase.regionserver.wal.TestHLog
Tests run: 11, Failures: 0, Errors: 0, Skipped: 0, Time elapsed: 132.446 sec
Forking command line: /bin/sh -c cd <https://builds.apache.org/job/HBase-TRUNK-on-Hadoop-2.0.0/ws/trunk/hbase-server> && /home/jenkins/tools/java/jdk1.6.0_27-32/jre/bin/java -enableassertions -Xmx1900m -Djava.security.egd=file:/dev/./urandom -Djava.net.preferIPv4Stack=true -jar <https://builds.apache.org/job/HBase-TRUNK-on-Hadoop-2.0.0/ws/trunk/hbase-server/target/surefire/surefirebooter4876128200780352394.jar> <https://builds.apache.org/job/HBase-TRUNK-on-Hadoop-2.0.0/ws/trunk/hbase-server/target/surefire/surefire5998628063909194945tmp> <https://builds.apache.org/job/HBase-TRUNK-on-Hadoop-2.0.0/ws/trunk/hbase-server/target/surefire/surefire_2084864275700318622250tmp>
Running org.apache.hadoop.hbase.regionserver.wal.TestLogRolling
Tests run: 2, Failures: 0, Errors: 0, Skipped: 0, Time elapsed: 332.021 sec
Forking command line: /bin/sh -c cd <https://builds.apache.org/job/HBase-TRUNK-on-Hadoop-2.0.0/ws/trunk/hbase-server> && /home/jenkins/tools/java/jdk1.6.0_27-32/jre/bin/java -enableassertions -Xmx1900m -Djava.security.egd=file:/dev/./urandom -Djava.net.preferIPv4Stack=true -jar <https://builds.apache.org/job/HBase-TRUNK-on-Hadoop-2.0.0/ws/trunk/hbase-server/target/surefire/surefirebooter3559432080425854826.jar> <https://builds.apache.org/job/HBase-TRUNK-on-Hadoop-2.0.0/ws/trunk/hbase-server/target/surefire/surefire5129462402390298385tmp> <https://builds.apache.org/job/HBase-TRUNK-on-Hadoop-2.0.0/ws/trunk/hbase-server/target/surefire/surefire_2092214846530484620883tmp>
Running org.apache.hadoop.hbase.regionserver.wal.TestWALReplay
Tests run: 8, Failures: 0, Errors: 0, Skipped: 0, Time elapsed: 279.016 sec
Forking command line: /bin/sh -c cd <https://builds.apache.org/job/HBase-TRUNK-on-Hadoop-2.0.0/ws/trunk/hbase-server> && /home/jenkins/tools/java/jdk1.6.0_27-32/jre/bin/java -enableassertions -Xmx1900m -Djava.security.egd=file:/dev/./urandom -Djava.net.preferIPv4Stack=true -jar <https://builds.apache.org/job/HBase-TRUNK-on-Hadoop-2.0.0/ws/trunk/hbase-server/target/surefire/surefirebooter4657137287405840337.jar> <https://builds.apache.org/job/HBase-TRUNK-on-Hadoop-2.0.0/ws/trunk/hbase-server/target/surefire/surefire9215654348257532233tmp> <https://builds.apache.org/job/HBase-TRUNK-on-Hadoop-2.0.0/ws/trunk/hbase-server/target/surefire/surefire_210715041329498181524tmp>
Running org.apache.hadoop.hbase.regionserver.wal.TestHLogSplit
Tests run: 32, Failures: 0, Errors: 0, Skipped: 1, Time elapsed: 429.88 sec
Forking command line: /bin/sh -c cd <https://builds.apache.org/job/HBase-TRUNK-on-Hadoop-2.0.0/ws/trunk/hbase-server> && /home/jenkins/tools/java/jdk1.6.0_27-32/jre/bin/java -enableassertions -Xmx1900m -Djava.security.egd=file:/dev/./urandom -Djava.net.preferIPv4Stack=true -jar <https://builds.apache.org/job/HBase-TRUNK-on-Hadoop-2.0.0/ws/trunk/hbase-server/target/surefire/surefirebooter5453641287812500073.jar> <https://builds.apache.org/job/HBase-TRUNK-on-Hadoop-2.0.0/ws/trunk/hbase-server/target/surefire/surefire4746939834091053368tmp> <https://builds.apache.org/job/HBase-TRUNK-on-Hadoop-2.0.0/ws/trunk/hbase-server/target/surefire/surefire_2118592499719711556683tmp>
Running org.apache.hadoop.hbase.regionserver.TestStoreScanner
Tests run: 16, Failures: 0, Errors: 0, Skipped: 0, Time elapsed: 1.149 sec
Forking command line: /bin/sh -c cd <https://builds.apache.org/job/HBase-TRUNK-on-Hadoop-2.0.0/ws/trunk/hbase-server> && /home/jenkins/tools/java/jdk1.6.0_27-32/jre/bin/java -enableassertions -Xmx1900m -Djava.security.egd=file:/dev/./urandom -Djava.net.preferIPv4Stack=true -jar <https://builds.apache.org/job/HBase-TRUNK-on-Hadoop-2.0.0/ws/trunk/hbase-server/target/surefire/surefirebooter4041013748305090084.jar> <https://builds.apache.org/job/HBase-TRUNK-on-Hadoop-2.0.0/ws/trunk/hbase-server/target/surefire/surefire2674649162808428673tmp> <https://builds.apache.org/job/HBase-TRUNK-on-Hadoop-2.0.0/ws/trunk/hbase-server/target/surefire/surefire_2122834464337804772128tmp>
Running org.apache.hadoop.hbase.regionserver.wal.TestHLogFiltering
Tests run: 1, Failures: 0, Errors: 0, Skipped: 0, Time elapsed: 131.636 sec
Forking command line: /bin/sh -c cd <https://builds.apache.org/job/HBase-TRUNK-on-Hadoop-2.0.0/ws/trunk/hbase-server> && /home/jenkins/tools/java/jdk1.6.0_27-32/jre/bin/java -enableassertions -Xmx1900m -Djava.security.egd=file:/dev/./urandom -Djava.net.preferIPv4Stack=true -jar <https://builds.apache.org/job/HBase-TRUNK-on-Hadoop-2.0.0/ws/trunk/hbase-server/target/surefire/surefirebooter8211619962904422417.jar> <https://builds.apache.org/job/HBase-TRUNK-on-Hadoop-2.0.0/ws/trunk/hbase-server/target/surefire/surefire4128989165586970196tmp> <https://builds.apache.org/job/HBase-TRUNK-on-Hadoop-2.0.0/ws/trunk/hbase-server/target/surefire/surefire_2136186261495490626694tmp>
Running org.apache.hadoop.hbase.regionserver.wal.TestHLogSplitCompressed
Tests run: 32, Failures: 0, Errors: 0, Skipped: 1, Time elapsed: 507.275 sec
Forking command line: /bin/sh -c cd <https://builds.apache.org/job/HBase-TRUNK-on-Hadoop-2.0.0/ws/trunk/hbase-server> && /home/jenkins/tools/java/jdk1.6.0_27-32/jre/bin/java -enableassertions -Xmx1900m -Djava.security.egd=file:/dev/./urandom -Djava.net.preferIPv4Stack=true -jar <https://builds.apache.org/job/HBase-TRUNK-on-Hadoop-2.0.0/ws/trunk/hbase-server/target/surefire/surefirebooter3467694637738150231.jar> <https://builds.apache.org/job/HBase-TRUNK-on-Hadoop-2.0.0/ws/trunk/hbase-server/target/surefire/surefire7419217147629416174tmp> <https://builds.apache.org/job/HBase-TRUNK-on-Hadoop-2.0.0/ws/trunk/hbase-server/target/surefire/surefire_2142492815223136532407tmp>
Running org.apache.hadoop.hbase.regionserver.wal.TestWALReplayCompressed
Tests run: 8, Failures: 0, Errors: 0, Skipped: 0, Time elapsed: 314.8 sec
Forking command line: /bin/sh -c cd <https://builds.apache.org/job/HBase-TRUNK-on-Hadoop-2.0.0/ws/trunk/hbase-server> && /home/jenkins/tools/java/jdk1.6.0_27-32/jre/bin/java -enableassertions -Xmx1900m -Djava.security.egd=file:/dev/./urandom -Djava.net.preferIPv4Stack=true -jar <https://builds.apache.org/job/HBase-TRUNK-on-Hadoop-2.0.0/ws/trunk/hbase-server/target/surefire/surefirebooter7385493763707030799.jar> <https://builds.apache.org/job/HBase-TRUNK-on-Hadoop-2.0.0/ws/trunk/hbase-server/target/surefire/surefire7862302587875021750tmp> <https://builds.apache.org/job/HBase-TRUNK-on-Hadoop-2.0.0/ws/trunk/hbase-server/target/surefire/surefire_2153982849480665522383tmp>
Running org.apache.hadoop.hbase.regionserver.TestEndToEndSplitTransaction
Tests run: 2, Failures: 0, Errors: 0, Skipped: 0, Time elapsed: 220.433 sec
Forking command line: /bin/sh -c cd <https://builds.apache.org/job/HBase-TRUNK-on-Hadoop-2.0.0/ws/trunk/hbase-server> && /home/jenkins/tools/java/jdk1.6.0_27-32/jre/bin/java -enableassertions -Xmx1900m -Djava.security.egd=file:/dev/./urandom -Djava.net.preferIPv4Stack=true -jar <https://builds.apache.org/job/HBase-TRUNK-on-Hadoop-2.0.0/ws/trunk/hbase-server/target/surefire/surefirebooter5387377751082899294.jar> <https://builds.apache.org/job/HBase-TRUNK-on-Hadoop-2.0.0/ws/trunk/hbase-server/target/surefire/surefire1524655413601680555tmp> <https://builds.apache.org/job/HBase-TRUNK-on-Hadoop-2.0.0/ws/trunk/hbase-server/target/surefire/surefire_2166068093980739242302tmp>
Forking command line: /bin/sh -c cd <https://builds.apache.org/job/HBase-TRUNK-on-Hadoop-2.0.0/ws/trunk/hbase-server> && /home/jenkins/tools/java/jdk1.6.0_27-32/jre/bin/java -enableassertions -Xmx1900m -Djava.security.egd=file:/dev/./urandom -Djava.net.preferIPv4Stack=true -jar <https://builds.apache.org/job/HBase-TRUNK-on-Hadoop-2.0.0/ws/trunk/hbase-server/target/surefire/surefirebooter7521731857039981775.jar> <https://builds.apache.org/job/HBase-TRUNK-on-Hadoop-2.0.0/ws/trunk/hbase-server/target/surefire/surefire7714951550216641356tmp> <https://builds.apache.org/job/HBase-TRUNK-on-Hadoop-2.0.0/ws/trunk/hbase-server/target/surefire/surefire_2171439751576004980465tmp>
Running org.apache.hadoop.hbase.regionserver.TestCompaction
Tests run: 17, Failures: 0, Errors: 0, Skipped: 0, Time elapsed: 190.942 sec
Forking command line: /bin/sh -c cd <https://builds.apache.org/job/HBase-TRUNK-on-Hadoop-2.0.0/ws/trunk/hbase-server> && /home/jenkins/tools/java/jdk1.6.0_27-32/jre/bin/java -enableassertions -Xmx1900m -Djava.security.egd=file:/dev/./urandom -Djava.net.preferIPv4Stack=true -jar <https://builds.apache.org/job/HBase-TRUNK-on-Hadoop-2.0.0/ws/trunk/hbase-server/target/surefire/surefirebooter498977808293117632.jar> <https://builds.apache.org/job/HBase-TRUNK-on-Hadoop-2.0.0/ws/trunk/hbase-server/target/surefire/surefire4359776541062008600tmp> <https://builds.apache.org/job/HBase-TRUNK-on-Hadoop-2.0.0/ws/trunk/hbase-server/target/surefire/surefire_2186956955199841691129tmp>
Running org.apache.hadoop.hbase.regionserver.TestMultiColumnScanner
Tests run: 12, Failures: 0, Errors: 0, Skipped: 0, Time elapsed: 230.187 sec
Forking command line: /bin/sh -c cd <https://builds.apache.org/job/HBase-TRUNK-on-Hadoop-2.0.0/ws/trunk/hbase-server> && /home/jenkins/tools/java/jdk1.6.0_27-32/jre/bin/java -enableassertions -Xmx1900m -Djava.security.egd=file:/dev/./urandom -Djava.net.preferIPv4Stack=true -jar <https://builds.apache.org/job/HBase-TRUNK-on-Hadoop-2.0.0/ws/trunk/hbase-server/target/surefire/surefirebooter9145261311530132063.jar> <https://builds.apache.org/job/HBase-TRUNK-on-Hadoop-2.0.0/ws/trunk/hbase-server/target/surefire/surefire2812058154616247004tmp> <https://builds.apache.org/job/HBase-TRUNK-on-Hadoop-2.0.0/ws/trunk/hbase-server/target/surefire/surefire_2195061160388398245340tmp>
Running org.apache.hadoop.hbase.mapred.TestTableInputFormat
Tests run: 10, Failures: 0, Errors: 0, Skipped: 0, Time elapsed: 123.191 sec
Forking command line: /bin/sh -c cd <https://builds.apache.org/job/HBase-TRUNK-on-Hadoop-2.0.0/ws/trunk/hbase-server> && /home/jenkins/tools/java/jdk1.6.0_27-32/jre/bin/java -enableassertions -Xmx1900m -Djava.security.egd=file:/dev/./urandom -Djava.net.preferIPv4Stack=true -jar <https://builds.apache.org/job/HBase-TRUNK-on-Hadoop-2.0.0/ws/trunk/hbase-server/target/surefire/surefirebooter5439085043404687344.jar> <https://builds.apache.org/job/HBase-TRUNK-on-Hadoop-2.0.0/ws/trunk/hbase-server/target/surefire/surefire3521510823675144134tmp> <https://builds.apache.org/job/HBase-TRUNK-on-Hadoop-2.0.0/ws/trunk/hbase-server/target/surefire/surefire_2206743231799293769797tmp>
Running org.apache.hadoop.hbase.backup.example.TestZooKeeperTableArchiveClient
Tests run: 3, Failures: 0, Errors: 0, Skipped: 0, Time elapsed: 34.231 sec
Running org.apache.hadoop.hbase.fs.TestBlockReorder
Tests run: 3, Failures: 0, Errors: 0, Skipped: 0, Time elapsed: 127.782 sec
Forking command line: /bin/sh -c cd <https://builds.apache.org/job/HBase-TRUNK-on-Hadoop-2.0.0/ws/trunk/hbase-server> && /home/jenkins/tools/java/jdk1.6.0_27-32/jre/bin/java -enableassertions -Xmx1900m -Djava.security.egd=file:/dev/./urandom -Djava.net.preferIPv4Stack=true -jar <https://builds.apache.org/job/HBase-TRUNK-on-Hadoop-2.0.0/ws/trunk/hbase-server/target/surefire/surefirebooter2284783940574219300.jar> <https://builds.apache.org/job/HBase-TRUNK-on-Hadoop-2.0.0/ws/trunk/hbase-server/target/surefire/surefire2412092772571290535tmp> <https://builds.apache.org/job/HBase-TRUNK-on-Hadoop-2.0.0/ws/trunk/hbase-server/target/surefire/surefire_2213430392471183841630tmp>
Forking command line: /bin/sh -c cd <https://builds.apache.org/job/HBase-TRUNK-on-Hadoop-2.0.0/ws/trunk/hbase-server> && /home/jenkins/tools/java/jdk1.6.0_27-32/jre/bin/java -enableassertions -Xmx1900m -Djava.security.egd=file:/dev/./urandom -Djava.net.preferIPv4Stack=true -jar <https://builds.apache.org/job/HBase-TRUNK-on-Hadoop-2.0.0/ws/trunk/hbase-server/target/surefire/surefirebooter3240257163781063231.jar> <https://builds.apache.org/job/HBase-TRUNK-on-Hadoop-2.0.0/ws/trunk/hbase-server/target/surefire/surefire1500786030537765103tmp> <https://builds.apache.org/job/HBase-TRUNK-on-Hadoop-2.0.0/ws/trunk/hbase-server/target/surefire/surefire_2227468734922054071801tmp>
Running org.apache.hadoop.hbase.mapred.TestTableMapReduce
Running org.apache.hadoop.hbase.TestClusterBootOrder
Tests run: 1, Failures: 0, Errors: 0, Skipped: 0, Time elapsed: 347.636 sec
Tests run: 2, Failures: 0, Errors: 0, Skipped: 0, Time elapsed: 112.283 sec
Forking command line: /bin/sh -c cd <https://builds.apache.org/job/HBase-TRUNK-on-Hadoop-2.0.0/ws/trunk/hbase-server> && /home/jenkins/tools/java/jdk1.6.0_27-32/jre/bin/java -enableassertions -Xmx1900m -Djava.security.egd=file:/dev/./urandom -Djava.net.preferIPv4Stack=true -jar <https://builds.apache.org/job/HBase-TRUNK-on-Hadoop-2.0.0/ws/trunk/hbase-server/target/surefire/surefirebooter5987469310324246820.jar> <https://builds.apache.org/job/HBase-TRUNK-on-Hadoop-2.0.0/ws/trunk/hbase-server/target/surefire/surefire7603356607665636023tmp> <https://builds.apache.org/job/HBase-TRUNK-on-Hadoop-2.0.0/ws/trunk/hbase-server/target/surefire/surefire_2242741204874837843010tmp>
Forking command line: /bin/sh -c cd <https://builds.apache.org/job/HBase-TRUNK-on-Hadoop-2.0.0/ws/trunk/hbase-server> && /home/jenkins/tools/java/jdk1.6.0_27-32/jre/bin/java -enableassertions -Xmx1900m -Djava.security.egd=file:/dev/./urandom -Djava.net.preferIPv4Stack=true -jar <https://builds.apache.org/job/HBase-TRUNK-on-Hadoop-2.0.0/ws/trunk/hbase-server/target/surefire/surefirebooter23425424984155274.jar> <https://builds.apache.org/job/HBase-TRUNK-on-Hadoop-2.0.0/ws/trunk/hbase-server/target/surefire/surefire7735871249340280129tmp> <https://builds.apache.org/job/HBase-TRUNK-on-Hadoop-2.0.0/ws/trunk/hbase-server/target/surefire/surefire_2238198039577029603435tmp>
Running org.apache.hadoop.hbase.TestDrainingServer
Tests run: 2, Failures: 0, Errors: 0, Skipped: 0, Time elapsed: 116.12 sec
Forking command line: /bin/sh -c cd <https://builds.apache.org/job/HBase-TRUNK-on-Hadoop-2.0.0/ws/trunk/hbase-server> && /home/jenkins/tools/java/jdk1.6.0_27-32/jre/bin/java -enableassertions -Xmx1900m -Djava.security.egd=file:/dev/./urandom -Djava.net.preferIPv4Stack=true -jar <https://builds.apache.org/job/HBase-TRUNK-on-Hadoop-2.0.0/ws/trunk/hbase-server/target/surefire/surefirebooter3340697507795918214.jar> <https://builds.apache.org/job/HBase-TRUNK-on-Hadoop-2.0.0/ws/trunk/hbase-server/target/surefire/surefire6225826884287388439tmp> <https://builds.apache.org/job/HBase-TRUNK-on-Hadoop-2.0.0/ws/trunk/hbase-server/target/surefire/surefire_2253300221470335393351tmp>
Running org.apache.hadoop.hbase.mapreduce.TestTimeRangeMapRed
Tests run: 1, Failures: 0, Errors: 0, Skipped: 0, Time elapsed: 237.248 sec
Forking command line: /bin/sh -c cd <https://builds.apache.org/job/HBase-TRUNK-on-Hadoop-2.0.0/ws/trunk/hbase-server> && /home/jenkins/tools/java/jdk1.6.0_27-32/jre/bin/java -enableassertions -Xmx1900m -Djava.security.egd=file:/dev/./urandom -Djava.net.preferIPv4Stack=true -jar <https://builds.apache.org/job/HBase-TRUNK-on-Hadoop-2.0.0/ws/trunk/hbase-server/target/surefire/surefirebooter5025924854259575789.jar> <https://builds.apache.org/job/HBase-TRUNK-on-Hadoop-2.0.0/ws/trunk/hbase-server/target/surefire/surefire1187218656124877940tmp> <https://builds.apache.org/job/HBase-TRUNK-on-Hadoop-2.0.0/ws/trunk/hbase-server/target/surefire/surefire_2268802771866556136215tmp>
Running org.apache.hadoop.hbase.backup.TestHFileArchiving
Tests run: 5, Failures: 0, Errors: 0, Skipped: 0, Time elapsed: 483.491 sec
Forking command line: /bin/sh -c cd <https://builds.apache.org/job/HBase-TRUNK-on-Hadoop-2.0.0/ws/trunk/hbase-server> && /home/jenkins/tools/java/jdk1.6.0_27-32/jre/bin/java -enableassertions -Xmx1900m -Djava.security.egd=file:/dev/./urandom -Djava.net.preferIPv4Stack=true -jar <https://builds.apache.org/job/HBase-TRUNK-on-Hadoop-2.0.0/ws/trunk/hbase-server/target/surefire/surefirebooter8571174586834246650.jar> <https://builds.apache.org/job/HBase-TRUNK-on-Hadoop-2.0.0/ws/trunk/hbase-server/target/surefire/surefire7912235604357879502tmp> <https://builds.apache.org/job/HBase-TRUNK-on-Hadoop-2.0.0/ws/trunk/hbase-server/target/surefire/surefire_2278462838757345035322tmp>
Running org.apache.hadoop.hbase.mapreduce.TestRowCounter
Tests run: 3, Failures: 0, Errors: 0, Skipped: 0, Time elapsed: 367.3 sec
Forking command line: /bin/sh -c cd <https://builds.apache.org/job/HBase-TRUNK-on-Hadoop-2.0.0/ws/trunk/hbase-server> && /home/jenkins/tools/java/jdk1.6.0_27-32/jre/bin/java -enableassertions -Xmx1900m -Djava.security.egd=file:/dev/./urandom -Djava.net.preferIPv4Stack=true -jar <https://builds.apache.org/job/HBase-TRUNK-on-Hadoop-2.0.0/ws/trunk/hbase-server/target/surefire/surefirebooter43408471475906435.jar> <https://builds.apache.org/job/HBase-TRUNK-on-Hadoop-2.0.0/ws/trunk/hbase-server/target/surefire/surefire5346869319005903082tmp> <https://builds.apache.org/job/HBase-TRUNK-on-Hadoop-2.0.0/ws/trunk/hbase-server/target/surefire/surefire_2282177877155261238500tmp>
Running org.apache.hadoop.hbase.mapreduce.TestSecureLoadIncrementalHFiles
Tests run: 6, Failures: 0, Errors: 0, Skipped: 0, Time elapsed: 137.626 sec
Forking command line: /bin/sh -c cd <https://builds.apache.org/job/HBase-TRUNK-on-Hadoop-2.0.0/ws/trunk/hbase-server> && /home/jenkins/tools/java/jdk1.6.0_27-32/jre/bin/java -enableassertions -Xmx1900m -Djava.security.egd=file:/dev/./urandom -Djava.net.preferIPv4Stack=true -jar <https://builds.apache.org/job/HBase-TRUNK-on-Hadoop-2.0.0/ws/trunk/hbase-server/target/surefire/surefirebooter2918816086332039201.jar> <https://builds.apache.org/job/HBase-TRUNK-on-Hadoop-2.0.0/ws/trunk/hbase-server/target/surefire/surefire96518170320114970tmp> <https://builds.apache.org/job/HBase-TRUNK-on-Hadoop-2.0.0/ws/trunk/hbase-server/target/surefire/surefire_2298112274545860586287tmp>
Running org.apache.hadoop.hbase.mapreduce.TestImportExport
Tests run: 1, Failures: 0, Errors: 1, Skipped: 0, Time elapsed: 276.978 sec <<< FAILURE!
Forking command line: /bin/sh -c cd <https://builds.apache.org/job/HBase-TRUNK-on-Hadoop-2.0.0/ws/trunk/hbase-server> && /home/jenkins/tools/java/jdk1.6.0_27-32/jre/bin/java -enableassertions -Xmx1900m -Djava.security.egd=file:/dev/./urandom -Djava.net.preferIPv4Stack=true -jar <https://builds.apache.org/job/HBase-TRUNK-on-Hadoop-2.0.0/ws/trunk/hbase-server/target/surefire/surefirebooter3500243553834759857.jar> <https://builds.apache.org/job/HBase-TRUNK-on-Hadoop-2.0.0/ws/trunk/hbase-server/target/surefire/surefire5676820177884081314tmp> <https://builds.apache.org/job/HBase-TRUNK-on-Hadoop-2.0.0/ws/trunk/hbase-server/target/surefire/surefire_2306110500718659986811tmp>
Running org.apache.hadoop.hbase.mapreduce.TestTableInputFormatScan
Tests run: 1, Failures: 0, Errors: 1, Skipped: 0, Time elapsed: 297.987 sec <<< FAILURE!
Forking command line: /bin/sh -c cd <https://builds.apache.org/job/HBase-TRUNK-on-Hadoop-2.0.0/ws/trunk/hbase-server> && /home/jenkins/tools/java/jdk1.6.0_27-32/jre/bin/java -enableassertions -Xmx1900m -Djava.security.egd=file:/dev/./urandom -Djava.net.preferIPv4Stack=true -jar <https://builds.apache.org/job/HBase-TRUNK-on-Hadoop-2.0.0/ws/trunk/hbase-server/target/surefire/surefirebooter1241602260847568339.jar> <https://builds.apache.org/job/HBase-TRUNK-on-Hadoop-2.0.0/ws/trunk/hbase-server/target/surefire/surefire7492142994236654588tmp> <https://builds.apache.org/job/HBase-TRUNK-on-Hadoop-2.0.0/ws/trunk/hbase-server/target/surefire/surefire_2316096375213881191255tmp>
Forking command line: /bin/sh -c cd <https://builds.apache.org/job/HBase-TRUNK-on-Hadoop-2.0.0/ws/trunk/hbase-server> && /home/jenkins/tools/java/jdk1.6.0_27-32/jre/bin/java -enableassertions -Xmx1900m -Djava.security.egd=file:/dev/./urandom -Djava.net.preferIPv4Stack=true -jar <https://builds.apache.org/job/HBase-TRUNK-on-Hadoop-2.0.0/ws/trunk/hbase-server/target/surefire/surefirebooter757704001807290014.jar> <https://builds.apache.org/job/HBase-TRUNK-on-Hadoop-2.0.0/ws/trunk/hbase-server/target/surefire/surefire3862894748084596395tmp> <https://builds.apache.org/job/HBase-TRUNK-on-Hadoop-2.0.0/ws/trunk/hbase-server/target/surefire/surefire_232882853402283102090tmp>
Running org.apache.hadoop.hbase.mapreduce.TestWALPlayer
Tests run: 1, Failures: 0, Errors: 0, Skipped: 0, Time elapsed: 156.319 sec
Forking command line: /bin/sh -c cd <https://builds.apache.org/job/HBase-TRUNK-on-Hadoop-2.0.0/ws/trunk/hbase-server> && /home/jenkins/tools/java/jdk1.6.0_27-32/jre/bin/java -enableassertions -Xmx1900m -Djava.security.egd=file:/dev/./urandom -Djava.net.preferIPv4Stack=true -jar <https://builds.apache.org/job/HBase-TRUNK-on-Hadoop-2.0.0/ws/trunk/hbase-server/target/surefire/surefirebooter455464354261743332.jar> <https://builds.apache.org/job/HBase-TRUNK-on-Hadoop-2.0.0/ws/trunk/hbase-server/target/surefire/surefire1821431010692896575tmp> <https://builds.apache.org/job/HBase-TRUNK-on-Hadoop-2.0.0/ws/trunk/hbase-server/target/surefire/surefire_2333889991962349702033tmp>
Forking command line: /bin/sh -c cd <https://builds.apache.org/job/HBase-TRUNK-on-Hadoop-2.0.0/ws/trunk/hbase-server> && /home/jenkins/tools/java/jdk1.6.0_27-32/jre/bin/java -enableassertions -Xmx1900m -Djava.security.egd=file:/dev/./urandom -Djava.net.preferIPv4Stack=true -jar <https://builds.apache.org/job/HBase-TRUNK-on-Hadoop-2.0.0/ws/trunk/hbase-server/target/surefire/surefirebooter7840689326264915546.jar> <https://builds.apache.org/job/HBase-TRUNK-on-Hadoop-2.0.0/ws/trunk/hbase-server/target/surefire/surefire5982652970331613607tmp> <https://builds.apache.org/job/HBase-TRUNK-on-Hadoop-2.0.0/ws/trunk/hbase-server/target/surefire/surefire_2343640065446799644968tmp>
Running org.apache.hadoop.hbase.mapreduce.TestMultithreadedTableMapper
Running org.apache.hadoop.hbase.mapreduce.TestLoadIncrementalHFilesSplitRecovery
Tests run: 1, Failures: 0, Errors: 0, Skipped: 0, Time elapsed: 378.824 sec
Tests run: 4, Failures: 0, Errors: 0, Skipped: 0, Time elapsed: 275.091 sec
Forking command line: /bin/sh -c cd <https://builds.apache.org/job/HBase-TRUNK-on-Hadoop-2.0.0/ws/trunk/hbase-server> && /home/jenkins/tools/java/jdk1.6.0_27-32/jre/bin/java -enableassertions -Xmx1900m -Djava.security.egd=file:/dev/./urandom -Djava.net.preferIPv4Stack=true -jar <https://builds.apache.org/job/HBase-TRUNK-on-Hadoop-2.0.0/ws/trunk/hbase-server/target/surefire/surefirebooter7018111697150378107.jar> <https://builds.apache.org/job/HBase-TRUNK-on-Hadoop-2.0.0/ws/trunk/hbase-server/target/surefire/surefire3390697116480525177tmp> <https://builds.apache.org/job/HBase-TRUNK-on-Hadoop-2.0.0/ws/trunk/hbase-server/target/surefire/surefire_2351189078036824910467tmp>
Forking command line: /bin/sh -c cd <https://builds.apache.org/job/HBase-TRUNK-on-Hadoop-2.0.0/ws/trunk/hbase-server> && /home/jenkins/tools/java/jdk1.6.0_27-32/jre/bin/java -enableassertions -Xmx1900m -Djava.security.egd=file:/dev/./urandom -Djava.net.preferIPv4Stack=true -jar <https://builds.apache.org/job/HBase-TRUNK-on-Hadoop-2.0.0/ws/trunk/hbase-server/target/surefire/surefirebooter4230204967968413453.jar> <https://builds.apache.org/job/HBase-TRUNK-on-Hadoop-2.0.0/ws/trunk/hbase-server/target/surefire/surefire6571512301917395534tmp> <https://builds.apache.org/job/HBase-TRUNK-on-Hadoop-2.0.0/ws/trunk/hbase-server/target/surefire/surefire_2365120698075551096926tmp>
Running org.apache.hadoop.hbase.mapreduce.TestSecureLoadIncrementalHFilesSplitRecovery
Tests run: 4, Failures: 0, Errors: 0, Skipped: 0, Time elapsed: 256.617 sec
Running org.apache.hadoop.hbase.mapreduce.TestHLogRecordReader
Tests run: 2, Failures: 0, Errors: 0, Skipped: 0, Time elapsed: 30.794 sec
Running org.apache.hadoop.hbase.mapreduce.TestLoadIncrementalHFiles
Tests run: 6, Failures: 0, Errors: 0, Skipped: 0, Time elapsed: 59.986 sec
Running org.apache.hadoop.hbase.mapreduce.TestTableMapReduce
Tests run: 2, Failures: 0, Errors: 0, Skipped: 0, Time elapsed: 457.127 sec
Results :
Failed tests: testOfflineRegion(org.apache.hadoop.hbase.master.TestAssignmentManagerOnCluster): Could not find an online region
Tests in error:
testTokenAuthentication(org.apache.hadoop.hbase.security.token.TestTokenAuthentication): Can't get Kerberos realm
testTableReadLock(org.apache.hadoop.hbase.master.TestTableLockManager): test timed out after 600000 milliseconds
org.apache.hadoop.hbase.mapreduce.TestImportExport: Shutting down
org.apache.hadoop.hbase.mapreduce.TestTableInputFormatScan: Shutting down
Tests run: 1438, Failures: 1, Errors: 4, Skipped: 13
[INFO]
[INFO] ------------------------------------------------------------------------
[INFO] Skipping HBase
[INFO] This project has been banned from the build due to previous failures.
[INFO] ------------------------------------------------------------------------
[INFO] ------------------------------------------------------------------------
[INFO] Reactor Summary:
[INFO]
[INFO] HBase ............................................. SUCCESS [16.203s]
[INFO] HBase - Common .................................... SUCCESS [1:04.604s]
[INFO] HBase - Protocol .................................. SUCCESS [40.776s]
[INFO] HBase - Client .................................... SUCCESS [19.253s]
[INFO] HBase - Prefix Tree ............................... SUCCESS [12.265s]
[INFO] HBase - Hadoop Compatibility ...................... SUCCESS [2.410s]
[INFO] HBase - Hadoop Two Compatibility .................. SUCCESS [14.435s]
[INFO] HBase - Server .................................... FAILURE [1:51:17.533s]
[INFO] HBase - Integration Tests ......................... SKIPPED
[INFO] HBase - Examples .................................. SKIPPED
[INFO] HBase - Assembly .................................. SKIPPED
[INFO] ------------------------------------------------------------------------
[INFO] BUILD FAILURE
[INFO] ------------------------------------------------------------------------
[INFO] Total time: 1:54:16.636s
[INFO] Finished at: Sat Mar 30 05:42:39 UTC 2013
[INFO] Final Memory: 116M/1203M
[INFO] ------------------------------------------------------------------------
[ERROR] Failed to execute goal org.apache.maven.plugins:maven-surefire-plugin:2.12-TRUNK-HBASE-2:test (secondPartTestsExecution) on project hbase-server: Failure or timeout -> [Help 1]
org.apache.maven.lifecycle.LifecycleExecutionException: Failed to execute goal org.apache.maven.plugins:maven-surefire-plugin:2.12-TRUNK-HBASE-2:test (secondPartTestsExecution) on project hbase-server: Failure or timeout
at org.apache.maven.lifecycle.internal.MojoExecutor.execute(MojoExecutor.java:217)
at org.apache.maven.lifecycle.internal.MojoExecutor.execute(MojoExecutor.java:153)
at org.apache.maven.lifecycle.internal.MojoExecutor.execute(MojoExecutor.java:145)
at org.apache.maven.lifecycle.internal.LifecycleModuleBuilder.buildProject(LifecycleModuleBuilder.java:84)
at org.apache.maven.lifecycle.internal.LifecycleModuleBuilder.buildProject(LifecycleModuleBuilder.java:59)
at org.apache.maven.lifecycle.internal.LifecycleStarter.singleThreadedBuild(LifecycleStarter.java:183)
at org.apache.maven.lifecycle.internal.LifecycleStarter.execute(LifecycleStarter.java:161)
at org.apache.maven.DefaultMaven.doExecute(DefaultMaven.java:320)
at org.apache.maven.DefaultMaven.execute(DefaultMaven.java:156)
at org.apache.maven.cli.MavenCli.execute(MavenCli.java:537)
at org.apache.maven.cli.MavenCli.doMain(MavenCli.java:196)
at org.apache.maven.cli.MavenCli.main(MavenCli.java:141)
at sun.reflect.NativeMethodAccessorImpl.invoke0(Native Method)
at sun.reflect.NativeMethodAccessorImpl.invoke(NativeMethodAccessorImpl.java:39)
at sun.reflect.DelegatingMethodAccessorImpl.invoke(DelegatingMethodAccessorImpl.java:25)
at java.lang.reflect.Method.invoke(Method.java:597)
at org.codehaus.plexus.classworlds.launcher.Launcher.launchEnhanced(Launcher.java:290)
at org.codehaus.plexus.classworlds.launcher.Launcher.launch(Launcher.java:230)
at org.codehaus.plexus.classworlds.launcher.Launcher.mainWithExitCode(Launcher.java:409)
at org.codehaus.plexus.classworlds.launcher.Launcher.main(Launcher.java:352)
Caused by: org.apache.maven.plugin.MojoExecutionException: Failure or timeout
at org.apache.maven.plugin.surefire.SurefirePlugin.assertNoFailureOrTimeout(SurefirePlugin.java:643)
at org.apache.maven.plugin.surefire.SurefirePlugin.handleSummary(SurefirePlugin.java:624)
at org.apache.maven.plugin.surefire.AbstractSurefireMojo.executeAfterPreconditionsChecked(AbstractSurefireMojo.java:137)
at org.apache.maven.plugin.surefire.AbstractSurefireMojo.execute(AbstractSurefireMojo.java:98)
at org.apache.maven.plugin.DefaultBuildPluginManager.executeMojo(DefaultBuildPluginManager.java:101)
at org.apache.maven.lifecycle.internal.MojoExecutor.execute(MojoExecutor.java:209)
... 19 more
[ERROR]
[ERROR]
[ERROR] For more information about the errors and possible solutions, please read the following articles:
[ERROR] [Help 1] http://cwiki.apache.org/confluence/display/MAVEN/MojoExecutionException
[ERROR]
[ERROR] After correcting the problems, you can resume the build with the command
[ERROR] mvn <goals> -rf :hbase-server
Build step 'Invoke top-level Maven targets' marked build as failure
Archiving artifacts
Recording test results
Updating HBASE-8164
Updating HBASE-7904
Updating HBASE-8222
Build failed in Jenkins: HBase-TRUNK-on-Hadoop-2.0.0 #468
Posted by Apache Jenkins Server <je...@builds.apache.org>.
See <https://builds.apache.org/job/HBase-TRUNK-on-Hadoop-2.0.0/468/changes>
Changes:
[apurtell] Amend HBASE-8209. Revert changes to HBaseTestingUtility#waitUntilAllRegionsAssigned
[apurtell] HBASE-8209. Improve LoadTest extensibility
[stack] HBASE-8187 trunk/0.95 tarball packaging
[tedyu] HBASE-8207 Addendum fixes the typo in extractDeadServersFromZNodeString()
[tedyu] HBASE-8207 Replication could have data loss when machine name contains hyphen "-" (Jeffrey)
[enis] HBASE-7977 Online merge should acquire table lock
------------------------------------------
[...truncated 24163 lines...]
Forking command line: /bin/sh -c cd /x1/jenkins/jenkins-slave/workspace/HBase-TRUNK-on-Hadoop-2.0.0/trunk/hbase-server && /x1/jenkins/tools/java/jdk1.6.0_32-32/jre/bin/java -enableassertions -Xmx1900m -Djava.security.egd=file:/dev/./urandom -Djava.net.preferIPv4Stack=true -jar /x1/jenkins/jenkins-slave/workspace/HBase-TRUNK-on-Hadoop-2.0.0/trunk/hbase-server/target/surefire/surefirebooter7861053443480395255.jar /x1/jenkins/jenkins-slave/workspace/HBase-TRUNK-on-Hadoop-2.0.0/trunk/hbase-server/target/surefire/surefire722955397251725317tmp /x1/jenkins/jenkins-slave/workspace/HBase-TRUNK-on-Hadoop-2.0.0/trunk/hbase-server/target/surefire/surefire_1876138630216175792175tmp
Running org.apache.hadoop.hbase.rest.TestRowResource
Tests run: 12, Failures: 0, Errors: 0, Skipped: 0, Time elapsed: 15.363 sec
Forking command line: /bin/sh -c cd /x1/jenkins/jenkins-slave/workspace/HBase-TRUNK-on-Hadoop-2.0.0/trunk/hbase-server && /x1/jenkins/tools/java/jdk1.6.0_32-32/jre/bin/java -enableassertions -Xmx1900m -Djava.security.egd=file:/dev/./urandom -Djava.net.preferIPv4Stack=true -jar /x1/jenkins/jenkins-slave/workspace/HBase-TRUNK-on-Hadoop-2.0.0/trunk/hbase-server/target/surefire/surefirebooter6588819811131642576.jar /x1/jenkins/jenkins-slave/workspace/HBase-TRUNK-on-Hadoop-2.0.0/trunk/hbase-server/target/surefire/surefire3002637096689143520tmp /x1/jenkins/jenkins-slave/workspace/HBase-TRUNK-on-Hadoop-2.0.0/trunk/hbase-server/target/surefire/surefire_1881024364504630215904tmp
Running org.apache.hadoop.hbase.rest.TestVersionResource
Tests run: 7, Failures: 0, Errors: 0, Skipped: 0, Time elapsed: 11.486 sec
Forking command line: /bin/sh -c cd /x1/jenkins/jenkins-slave/workspace/HBase-TRUNK-on-Hadoop-2.0.0/trunk/hbase-server && /x1/jenkins/tools/java/jdk1.6.0_32-32/jre/bin/java -enableassertions -Xmx1900m -Djava.security.egd=file:/dev/./urandom -Djava.net.preferIPv4Stack=true -jar /x1/jenkins/jenkins-slave/workspace/HBase-TRUNK-on-Hadoop-2.0.0/trunk/hbase-server/target/surefire/surefirebooter968971191098142478.jar /x1/jenkins/jenkins-slave/workspace/HBase-TRUNK-on-Hadoop-2.0.0/trunk/hbase-server/target/surefire/surefire5177034721700167133tmp /x1/jenkins/jenkins-slave/workspace/HBase-TRUNK-on-Hadoop-2.0.0/trunk/hbase-server/target/surefire/surefire_1892817686344486134153tmp
Running org.apache.hadoop.hbase.rest.TestStatusResource
Tests run: 2, Failures: 0, Errors: 0, Skipped: 0, Time elapsed: 9.685 sec
Forking command line: /bin/sh -c cd /x1/jenkins/jenkins-slave/workspace/HBase-TRUNK-on-Hadoop-2.0.0/trunk/hbase-server && /x1/jenkins/tools/java/jdk1.6.0_32-32/jre/bin/java -enableassertions -Xmx1900m -Djava.security.egd=file:/dev/./urandom -Djava.net.preferIPv4Stack=true -jar /x1/jenkins/jenkins-slave/workspace/HBase-TRUNK-on-Hadoop-2.0.0/trunk/hbase-server/target/surefire/surefirebooter6659118808431671202.jar /x1/jenkins/jenkins-slave/workspace/HBase-TRUNK-on-Hadoop-2.0.0/trunk/hbase-server/target/surefire/surefire6357332578117862675tmp /x1/jenkins/jenkins-slave/workspace/HBase-TRUNK-on-Hadoop-2.0.0/trunk/hbase-server/target/surefire/surefire_1907803723215705251572tmp
Running org.apache.hadoop.hbase.rest.TestScannerResource
Tests run: 5, Failures: 0, Errors: 0, Skipped: 0, Time elapsed: 24.045 sec
Forking command line: /bin/sh -c cd /x1/jenkins/jenkins-slave/workspace/HBase-TRUNK-on-Hadoop-2.0.0/trunk/hbase-server && /x1/jenkins/tools/java/jdk1.6.0_32-32/jre/bin/java -enableassertions -Xmx1900m -Djava.security.egd=file:/dev/./urandom -Djava.net.preferIPv4Stack=true -jar /x1/jenkins/jenkins-slave/workspace/HBase-TRUNK-on-Hadoop-2.0.0/trunk/hbase-server/target/surefire/surefirebooter6675611927111221763.jar /x1/jenkins/jenkins-slave/workspace/HBase-TRUNK-on-Hadoop-2.0.0/trunk/hbase-server/target/surefire/surefire8232823756759507354tmp /x1/jenkins/jenkins-slave/workspace/HBase-TRUNK-on-Hadoop-2.0.0/trunk/hbase-server/target/surefire/surefire_1914816349714269964430tmp
Running org.apache.hadoop.hbase.rest.TestScannersWithFilters
Tests run: 10, Failures: 0, Errors: 0, Skipped: 0, Time elapsed: 13.135 sec
Forking command line: /bin/sh -c cd /x1/jenkins/jenkins-slave/workspace/HBase-TRUNK-on-Hadoop-2.0.0/trunk/hbase-server && /x1/jenkins/tools/java/jdk1.6.0_32-32/jre/bin/java -enableassertions -Xmx1900m -Djava.security.egd=file:/dev/./urandom -Djava.net.preferIPv4Stack=true -jar /x1/jenkins/jenkins-slave/workspace/HBase-TRUNK-on-Hadoop-2.0.0/trunk/hbase-server/target/surefire/surefirebooter4024702105151911782.jar /x1/jenkins/jenkins-slave/workspace/HBase-TRUNK-on-Hadoop-2.0.0/trunk/hbase-server/target/surefire/surefire362320023218889891tmp /x1/jenkins/jenkins-slave/workspace/HBase-TRUNK-on-Hadoop-2.0.0/trunk/hbase-server/target/surefire/surefire_1925139840699057963795tmp
Running org.apache.hadoop.hbase.trace.TestHTraceHooks
Tests run: 1, Failures: 0, Errors: 0, Skipped: 0, Time elapsed: 7.822 sec
Forking command line: /bin/sh -c cd /x1/jenkins/jenkins-slave/workspace/HBase-TRUNK-on-Hadoop-2.0.0/trunk/hbase-server && /x1/jenkins/tools/java/jdk1.6.0_32-32/jre/bin/java -enableassertions -Xmx1900m -Djava.security.egd=file:/dev/./urandom -Djava.net.preferIPv4Stack=true -jar /x1/jenkins/jenkins-slave/workspace/HBase-TRUNK-on-Hadoop-2.0.0/trunk/hbase-server/target/surefire/surefirebooter1147666123946010821.jar /x1/jenkins/jenkins-slave/workspace/HBase-TRUNK-on-Hadoop-2.0.0/trunk/hbase-server/target/surefire/surefire8443306863486605169tmp /x1/jenkins/jenkins-slave/workspace/HBase-TRUNK-on-Hadoop-2.0.0/trunk/hbase-server/target/surefire/surefire_1933382195520132796871tmp
Running org.apache.hadoop.hbase.io.hfile.TestHFileBlockIndex
Tests run: 10, Failures: 0, Errors: 0, Skipped: 0, Time elapsed: 8.406 sec
Forking command line: /bin/sh -c cd /x1/jenkins/jenkins-slave/workspace/HBase-TRUNK-on-Hadoop-2.0.0/trunk/hbase-server && /x1/jenkins/tools/java/jdk1.6.0_32-32/jre/bin/java -enableassertions -Xmx1900m -Djava.security.egd=file:/dev/./urandom -Djava.net.preferIPv4Stack=true -jar /x1/jenkins/jenkins-slave/workspace/HBase-TRUNK-on-Hadoop-2.0.0/trunk/hbase-server/target/surefire/surefirebooter5669876663114052179.jar /x1/jenkins/jenkins-slave/workspace/HBase-TRUNK-on-Hadoop-2.0.0/trunk/hbase-server/target/surefire/surefire8515226874873793718tmp /x1/jenkins/jenkins-slave/workspace/HBase-TRUNK-on-Hadoop-2.0.0/trunk/hbase-server/target/surefire/surefire_1945731394908804471066tmp
Running org.apache.hadoop.hbase.io.hfile.TestHFileSeek
Tests run: 1, Failures: 0, Errors: 0, Skipped: 0, Time elapsed: 7.089 sec
Forking command line: /bin/sh -c cd /x1/jenkins/jenkins-slave/workspace/HBase-TRUNK-on-Hadoop-2.0.0/trunk/hbase-server && /x1/jenkins/tools/java/jdk1.6.0_32-32/jre/bin/java -enableassertions -Xmx1900m -Djava.security.egd=file:/dev/./urandom -Djava.net.preferIPv4Stack=true -jar /x1/jenkins/jenkins-slave/workspace/HBase-TRUNK-on-Hadoop-2.0.0/trunk/hbase-server/target/surefire/surefirebooter3889972616267721809.jar /x1/jenkins/jenkins-slave/workspace/HBase-TRUNK-on-Hadoop-2.0.0/trunk/hbase-server/target/surefire/surefire5225478687912178515tmp /x1/jenkins/jenkins-slave/workspace/HBase-TRUNK-on-Hadoop-2.0.0/trunk/hbase-server/target/surefire/surefire_1953548882466214452420tmp
Running org.apache.hadoop.hbase.io.hfile.TestHFilePerformance
Tests run: 1, Failures: 0, Errors: 0, Skipped: 0, Time elapsed: 10.754 sec
Forking command line: /bin/sh -c cd /x1/jenkins/jenkins-slave/workspace/HBase-TRUNK-on-Hadoop-2.0.0/trunk/hbase-server && /x1/jenkins/tools/java/jdk1.6.0_32-32/jre/bin/java -enableassertions -Xmx1900m -Djava.security.egd=file:/dev/./urandom -Djava.net.preferIPv4Stack=true -jar /x1/jenkins/jenkins-slave/workspace/HBase-TRUNK-on-Hadoop-2.0.0/trunk/hbase-server/target/surefire/surefirebooter6589967308968353189.jar /x1/jenkins/jenkins-slave/workspace/HBase-TRUNK-on-Hadoop-2.0.0/trunk/hbase-server/target/surefire/surefire921445693595621206tmp /x1/jenkins/jenkins-slave/workspace/HBase-TRUNK-on-Hadoop-2.0.0/trunk/hbase-server/target/surefire/surefire_1964203353645635971628tmp
Running org.apache.hadoop.hbase.io.hfile.TestForceCacheImportantBlocks
Tests run: 2, Failures: 0, Errors: 0, Skipped: 0, Time elapsed: 29.958 sec
Forking command line: /bin/sh -c cd /x1/jenkins/jenkins-slave/workspace/HBase-TRUNK-on-Hadoop-2.0.0/trunk/hbase-server && /x1/jenkins/tools/java/jdk1.6.0_32-32/jre/bin/java -enableassertions -Xmx1900m -Djava.security.egd=file:/dev/./urandom -Djava.net.preferIPv4Stack=true -jar /x1/jenkins/jenkins-slave/workspace/HBase-TRUNK-on-Hadoop-2.0.0/trunk/hbase-server/target/surefire/surefirebooter6594809338131606806.jar /x1/jenkins/jenkins-slave/workspace/HBase-TRUNK-on-Hadoop-2.0.0/trunk/hbase-server/target/surefire/surefire4198870399913386557tmp /x1/jenkins/jenkins-slave/workspace/HBase-TRUNK-on-Hadoop-2.0.0/trunk/hbase-server/target/surefire/surefire_19771416853751754299tmp
Running org.apache.hadoop.hbase.io.hfile.TestCacheOnWrite
Tests run: 36, Failures: 0, Errors: 0, Skipped: 0, Time elapsed: 38.4 sec
Forking command line: /bin/sh -c cd /x1/jenkins/jenkins-slave/workspace/HBase-TRUNK-on-Hadoop-2.0.0/trunk/hbase-server && /x1/jenkins/tools/java/jdk1.6.0_32-32/jre/bin/java -enableassertions -Xmx1900m -Djava.security.egd=file:/dev/./urandom -Djava.net.preferIPv4Stack=true -jar /x1/jenkins/jenkins-slave/workspace/HBase-TRUNK-on-Hadoop-2.0.0/trunk/hbase-server/target/surefire/surefirebooter5354478493604890389.jar /x1/jenkins/jenkins-slave/workspace/HBase-TRUNK-on-Hadoop-2.0.0/trunk/hbase-server/target/surefire/surefire5206089601518473878tmp /x1/jenkins/jenkins-slave/workspace/HBase-TRUNK-on-Hadoop-2.0.0/trunk/hbase-server/target/surefire/surefire_1982465205212291568314tmp
Running org.apache.hadoop.hbase.security.access.TestAccessController
Tests run: 36, Failures: 0, Errors: 0, Skipped: 0, Time elapsed: 163.027 sec
Forking command line: /bin/sh -c cd /x1/jenkins/jenkins-slave/workspace/HBase-TRUNK-on-Hadoop-2.0.0/trunk/hbase-server && /x1/jenkins/tools/java/jdk1.6.0_32-32/jre/bin/java -enableassertions -Xmx1900m -Djava.security.egd=file:/dev/./urandom -Djava.net.preferIPv4Stack=true -jar /x1/jenkins/jenkins-slave/workspace/HBase-TRUNK-on-Hadoop-2.0.0/trunk/hbase-server/target/surefire/surefirebooter3849230974433257653.jar /x1/jenkins/jenkins-slave/workspace/HBase-TRUNK-on-Hadoop-2.0.0/trunk/hbase-server/target/surefire/surefire2906494841146724194tmp /x1/jenkins/jenkins-slave/workspace/HBase-TRUNK-on-Hadoop-2.0.0/trunk/hbase-server/target/surefire/surefire_1993304154745258699490tmp
Running org.apache.hadoop.hbase.io.hfile.TestScannerSelectionUsingTTL
Tests run: 6, Failures: 0, Errors: 0, Skipped: 0, Time elapsed: 63.169 sec
Forking command line: /bin/sh -c cd /x1/jenkins/jenkins-slave/workspace/HBase-TRUNK-on-Hadoop-2.0.0/trunk/hbase-server && /x1/jenkins/tools/java/jdk1.6.0_32-32/jre/bin/java -enableassertions -Xmx1900m -Djava.security.egd=file:/dev/./urandom -Djava.net.preferIPv4Stack=true -jar /x1/jenkins/jenkins-slave/workspace/HBase-TRUNK-on-Hadoop-2.0.0/trunk/hbase-server/target/surefire/surefirebooter8984545380504746929.jar /x1/jenkins/jenkins-slave/workspace/HBase-TRUNK-on-Hadoop-2.0.0/trunk/hbase-server/target/surefire/surefire6301297833727929162tmp /x1/jenkins/jenkins-slave/workspace/HBase-TRUNK-on-Hadoop-2.0.0/trunk/hbase-server/target/surefire/surefire_2006172262813093638559tmp
Running org.apache.hadoop.hbase.io.hfile.slab.TestSlabCache
Tests run: 7, Failures: 0, Errors: 0, Skipped: 0, Time elapsed: 32.416 sec
Forking command line: /bin/sh -c cd /x1/jenkins/jenkins-slave/workspace/HBase-TRUNK-on-Hadoop-2.0.0/trunk/hbase-server && /x1/jenkins/tools/java/jdk1.6.0_32-32/jre/bin/java -enableassertions -Xmx1900m -Djava.security.egd=file:/dev/./urandom -Djava.net.preferIPv4Stack=true -jar /x1/jenkins/jenkins-slave/workspace/HBase-TRUNK-on-Hadoop-2.0.0/trunk/hbase-server/target/surefire/surefirebooter5849869454653324155.jar /x1/jenkins/jenkins-slave/workspace/HBase-TRUNK-on-Hadoop-2.0.0/trunk/hbase-server/target/surefire/surefire3974046225670362231tmp /x1/jenkins/jenkins-slave/workspace/HBase-TRUNK-on-Hadoop-2.0.0/trunk/hbase-server/target/surefire/surefire_20117971927190434794tmp
Running org.apache.hadoop.hbase.io.hfile.TestHFileBlock
Tests run: 14, Failures: 0, Errors: 0, Skipped: 0, Time elapsed: 51.826 sec
Forking command line: /bin/sh -c cd /x1/jenkins/jenkins-slave/workspace/HBase-TRUNK-on-Hadoop-2.0.0/trunk/hbase-server && /x1/jenkins/tools/java/jdk1.6.0_32-32/jre/bin/java -enableassertions -Xmx1900m -Djava.security.egd=file:/dev/./urandom -Djava.net.preferIPv4Stack=true -jar /x1/jenkins/jenkins-slave/workspace/HBase-TRUNK-on-Hadoop-2.0.0/trunk/hbase-server/target/surefire/surefirebooter1420661169701065264.jar /x1/jenkins/jenkins-slave/workspace/HBase-TRUNK-on-Hadoop-2.0.0/trunk/hbase-server/target/surefire/surefire8973008274191548603tmp /x1/jenkins/jenkins-slave/workspace/HBase-TRUNK-on-Hadoop-2.0.0/trunk/hbase-server/target/surefire/surefire_2027715823720974130278tmp
Running org.apache.hadoop.hbase.io.TestFileLink
Tests run: 3, Failures: 0, Errors: 0, Skipped: 0, Time elapsed: 14.618 sec
Forking command line: /bin/sh -c cd /x1/jenkins/jenkins-slave/workspace/HBase-TRUNK-on-Hadoop-2.0.0/trunk/hbase-server && /x1/jenkins/tools/java/jdk1.6.0_32-32/jre/bin/java -enableassertions -Xmx1900m -Djava.security.egd=file:/dev/./urandom -Djava.net.preferIPv4Stack=true -jar /x1/jenkins/jenkins-slave/workspace/HBase-TRUNK-on-Hadoop-2.0.0/trunk/hbase-server/target/surefire/surefirebooter6331906628071253648.jar /x1/jenkins/jenkins-slave/workspace/HBase-TRUNK-on-Hadoop-2.0.0/trunk/hbase-server/target/surefire/surefire2618120097962348779tmp /x1/jenkins/jenkins-slave/workspace/HBase-TRUNK-on-Hadoop-2.0.0/trunk/hbase-server/target/surefire/surefire_2033319340702746682961tmp
Running org.apache.hadoop.hbase.io.hfile.slab.TestSingleSizeCache
Tests run: 5, Failures: 0, Errors: 0, Skipped: 0, Time elapsed: 39.939 sec
Forking command line: /bin/sh -c cd /x1/jenkins/jenkins-slave/workspace/HBase-TRUNK-on-Hadoop-2.0.0/trunk/hbase-server && /x1/jenkins/tools/java/jdk1.6.0_32-32/jre/bin/java -enableassertions -Xmx1900m -Djava.security.egd=file:/dev/./urandom -Djava.net.preferIPv4Stack=true -jar /x1/jenkins/jenkins-slave/workspace/HBase-TRUNK-on-Hadoop-2.0.0/trunk/hbase-server/target/surefire/surefirebooter889968276783866649.jar /x1/jenkins/jenkins-slave/workspace/HBase-TRUNK-on-Hadoop-2.0.0/trunk/hbase-server/target/surefire/surefire1400046611492382105tmp /x1/jenkins/jenkins-slave/workspace/HBase-TRUNK-on-Hadoop-2.0.0/trunk/hbase-server/target/surefire/surefire_2048072293608136949730tmp
Running org.apache.hadoop.hbase.io.encoding.TestBufferedDataBlockEncoder
Tests run: 1, Failures: 0, Errors: 0, Skipped: 0, Time elapsed: 20.746 sec
Forking command line: /bin/sh -c cd /x1/jenkins/jenkins-slave/workspace/HBase-TRUNK-on-Hadoop-2.0.0/trunk/hbase-server && /x1/jenkins/tools/java/jdk1.6.0_32-32/jre/bin/java -enableassertions -Xmx1900m -Djava.security.egd=file:/dev/./urandom -Djava.net.preferIPv4Stack=true -jar /x1/jenkins/jenkins-slave/workspace/HBase-TRUNK-on-Hadoop-2.0.0/trunk/hbase-server/target/surefire/surefirebooter4900572732604265148.jar /x1/jenkins/jenkins-slave/workspace/HBase-TRUNK-on-Hadoop-2.0.0/trunk/hbase-server/target/surefire/surefire8255418130177781805tmp /x1/jenkins/jenkins-slave/workspace/HBase-TRUNK-on-Hadoop-2.0.0/trunk/hbase-server/target/surefire/surefire_2053099233843699755932tmp
Running org.apache.hadoop.hbase.io.encoding.TestEncodedSeekers
Tests run: 10, Failures: 0, Errors: 0, Skipped: 0, Time elapsed: 36.611 sec
Forking command line: /bin/sh -c cd /x1/jenkins/jenkins-slave/workspace/HBase-TRUNK-on-Hadoop-2.0.0/trunk/hbase-server && /x1/jenkins/tools/java/jdk1.6.0_32-32/jre/bin/java -enableassertions -Xmx1900m -Djava.security.egd=file:/dev/./urandom -Djava.net.preferIPv4Stack=true -jar /x1/jenkins/jenkins-slave/workspace/HBase-TRUNK-on-Hadoop-2.0.0/trunk/hbase-server/target/surefire/surefirebooter4119049425009128355.jar /x1/jenkins/jenkins-slave/workspace/HBase-TRUNK-on-Hadoop-2.0.0/trunk/hbase-server/target/surefire/surefire4775356223537651667tmp /x1/jenkins/jenkins-slave/workspace/HBase-TRUNK-on-Hadoop-2.0.0/trunk/hbase-server/target/surefire/surefire_2063664609190297275422tmp
Running org.apache.hadoop.hbase.TestRegionRebalancing
Tests run: 2, Failures: 0, Errors: 0, Skipped: 0, Time elapsed: 25.672 sec
Forking command line: /bin/sh -c cd /x1/jenkins/jenkins-slave/workspace/HBase-TRUNK-on-Hadoop-2.0.0/trunk/hbase-server && /x1/jenkins/tools/java/jdk1.6.0_32-32/jre/bin/java -enableassertions -Xmx1900m -Djava.security.egd=file:/dev/./urandom -Djava.net.preferIPv4Stack=true -jar /x1/jenkins/jenkins-slave/workspace/HBase-TRUNK-on-Hadoop-2.0.0/trunk/hbase-server/target/surefire/surefirebooter6036483634996653506.jar /x1/jenkins/jenkins-slave/workspace/HBase-TRUNK-on-Hadoop-2.0.0/trunk/hbase-server/target/surefire/surefire6870504205315832742tmp /x1/jenkins/jenkins-slave/workspace/HBase-TRUNK-on-Hadoop-2.0.0/trunk/hbase-server/target/surefire/surefire_2072490377494184589716tmp
Running org.apache.hadoop.hbase.io.encoding.TestLoadAndSwitchEncodeOnDisk
Tests run: 1, Failures: 0, Errors: 0, Skipped: 0, Time elapsed: 32.252 sec
Forking command line: /bin/sh -c cd /x1/jenkins/jenkins-slave/workspace/HBase-TRUNK-on-Hadoop-2.0.0/trunk/hbase-server && /x1/jenkins/tools/java/jdk1.6.0_32-32/jre/bin/java -enableassertions -Xmx1900m -Djava.security.egd=file:/dev/./urandom -Djava.net.preferIPv4Stack=true -jar /x1/jenkins/jenkins-slave/workspace/HBase-TRUNK-on-Hadoop-2.0.0/trunk/hbase-server/target/surefire/surefirebooter9164173898805726989.jar /x1/jenkins/jenkins-slave/workspace/HBase-TRUNK-on-Hadoop-2.0.0/trunk/hbase-server/target/surefire/surefire6257140570879756428tmp /x1/jenkins/jenkins-slave/workspace/HBase-TRUNK-on-Hadoop-2.0.0/trunk/hbase-server/target/surefire/surefire_2086492059455610130571tmp
Running org.apache.hadoop.hbase.mapred.TestTableInputFormat
Tests run: 10, Failures: 0, Errors: 0, Skipped: 0, Time elapsed: 19.048 sec
Forking command line: /bin/sh -c cd /x1/jenkins/jenkins-slave/workspace/HBase-TRUNK-on-Hadoop-2.0.0/trunk/hbase-server && /x1/jenkins/tools/java/jdk1.6.0_32-32/jre/bin/java -enableassertions -Xmx1900m -Djava.security.egd=file:/dev/./urandom -Djava.net.preferIPv4Stack=true -jar /x1/jenkins/jenkins-slave/workspace/HBase-TRUNK-on-Hadoop-2.0.0/trunk/hbase-server/target/surefire/surefirebooter3363455657072492398.jar /x1/jenkins/jenkins-slave/workspace/HBase-TRUNK-on-Hadoop-2.0.0/trunk/hbase-server/target/surefire/surefire517680219933822162tmp /x1/jenkins/jenkins-slave/workspace/HBase-TRUNK-on-Hadoop-2.0.0/trunk/hbase-server/target/surefire/surefire_2094209672840491275204tmp
Forking command line: /bin/sh -c cd /x1/jenkins/jenkins-slave/workspace/HBase-TRUNK-on-Hadoop-2.0.0/trunk/hbase-server && /x1/jenkins/tools/java/jdk1.6.0_32-32/jre/bin/java -enableassertions -Xmx1900m -Djava.security.egd=file:/dev/./urandom -Djava.net.preferIPv4Stack=true -jar /x1/jenkins/jenkins-slave/workspace/HBase-TRUNK-on-Hadoop-2.0.0/trunk/hbase-server/target/surefire/surefirebooter6802201564013373117.jar /x1/jenkins/jenkins-slave/workspace/HBase-TRUNK-on-Hadoop-2.0.0/trunk/hbase-server/target/surefire/surefire6826176904052404306tmp /x1/jenkins/jenkins-slave/workspace/HBase-TRUNK-on-Hadoop-2.0.0/trunk/hbase-server/target/surefire/surefire_2108912851283408784821tmp
Running org.apache.hadoop.hbase.io.encoding.TestDataBlockEncoders
Tests run: 12, Failures: 0, Errors: 0, Skipped: 0, Time elapsed: 100.593 sec
Forking command line: /bin/sh -c cd /x1/jenkins/jenkins-slave/workspace/HBase-TRUNK-on-Hadoop-2.0.0/trunk/hbase-server && /x1/jenkins/tools/java/jdk1.6.0_32-32/jre/bin/java -enableassertions -Xmx1900m -Djava.security.egd=file:/dev/./urandom -Djava.net.preferIPv4Stack=true -jar /x1/jenkins/jenkins-slave/workspace/HBase-TRUNK-on-Hadoop-2.0.0/trunk/hbase-server/target/surefire/surefirebooter3205768631208786657.jar /x1/jenkins/jenkins-slave/workspace/HBase-TRUNK-on-Hadoop-2.0.0/trunk/hbase-server/target/surefire/surefire4879724621936042636tmp /x1/jenkins/jenkins-slave/workspace/HBase-TRUNK-on-Hadoop-2.0.0/trunk/hbase-server/target/surefire/surefire_2113064823287089634214tmp
Running org.apache.hadoop.hbase.mapred.TestTableMapReduce
Tests run: 1, Failures: 0, Errors: 0, Skipped: 0, Time elapsed: 46.138 sec
Forking command line: /bin/sh -c cd /x1/jenkins/jenkins-slave/workspace/HBase-TRUNK-on-Hadoop-2.0.0/trunk/hbase-server && /x1/jenkins/tools/java/jdk1.6.0_32-32/jre/bin/java -enableassertions -Xmx1900m -Djava.security.egd=file:/dev/./urandom -Djava.net.preferIPv4Stack=true -jar /x1/jenkins/jenkins-slave/workspace/HBase-TRUNK-on-Hadoop-2.0.0/trunk/hbase-server/target/surefire/surefirebooter7303957826731823516.jar /x1/jenkins/jenkins-slave/workspace/HBase-TRUNK-on-Hadoop-2.0.0/trunk/hbase-server/target/surefire/surefire2723774299466415631tmp /x1/jenkins/jenkins-slave/workspace/HBase-TRUNK-on-Hadoop-2.0.0/trunk/hbase-server/target/surefire/surefire_2123411636291357036905tmp
Running org.apache.hadoop.hbase.replication.TestReplicationDisableInactivePeer
Tests run: 1, Failures: 0, Errors: 0, Skipped: 0, Time elapsed: 33.485 sec
Forking command line: /bin/sh -c cd /x1/jenkins/jenkins-slave/workspace/HBase-TRUNK-on-Hadoop-2.0.0/trunk/hbase-server && /x1/jenkins/tools/java/jdk1.6.0_32-32/jre/bin/java -enableassertions -Xmx1900m -Djava.security.egd=file:/dev/./urandom -Djava.net.preferIPv4Stack=true -jar /x1/jenkins/jenkins-slave/workspace/HBase-TRUNK-on-Hadoop-2.0.0/trunk/hbase-server/target/surefire/surefirebooter7997150998397608072.jar /x1/jenkins/jenkins-slave/workspace/HBase-TRUNK-on-Hadoop-2.0.0/trunk/hbase-server/target/surefire/surefire5731677479196378659tmp /x1/jenkins/jenkins-slave/workspace/HBase-TRUNK-on-Hadoop-2.0.0/trunk/hbase-server/target/surefire/surefire_2133430657738145803068tmp
Running org.apache.hadoop.hbase.replication.TestReplicationZookeeper
Tests run: 4, Failures: 0, Errors: 0, Skipped: 0, Time elapsed: 0.723 sec
Forking command line: /bin/sh -c cd /x1/jenkins/jenkins-slave/workspace/HBase-TRUNK-on-Hadoop-2.0.0/trunk/hbase-server && /x1/jenkins/tools/java/jdk1.6.0_32-32/jre/bin/java -enableassertions -Xmx1900m -Djava.security.egd=file:/dev/./urandom -Djava.net.preferIPv4Stack=true -jar /x1/jenkins/jenkins-slave/workspace/HBase-TRUNK-on-Hadoop-2.0.0/trunk/hbase-server/target/surefire/surefirebooter9033524113549365574.jar /x1/jenkins/jenkins-slave/workspace/HBase-TRUNK-on-Hadoop-2.0.0/trunk/hbase-server/target/surefire/surefire1412955416539682039tmp /x1/jenkins/jenkins-slave/workspace/HBase-TRUNK-on-Hadoop-2.0.0/trunk/hbase-server/target/surefire/surefire_2144733904097465446485tmp
Running org.apache.hadoop.hbase.replication.regionserver.TestReplicationSourceManager
Tests run: 3, Failures: 0, Errors: 0, Skipped: 0, Time elapsed: 1.571 sec
Forking command line: /bin/sh -c cd /x1/jenkins/jenkins-slave/workspace/HBase-TRUNK-on-Hadoop-2.0.0/trunk/hbase-server && /x1/jenkins/tools/java/jdk1.6.0_32-32/jre/bin/java -enableassertions -Xmx1900m -Djava.security.egd=file:/dev/./urandom -Djava.net.preferIPv4Stack=true -jar /x1/jenkins/jenkins-slave/workspace/HBase-TRUNK-on-Hadoop-2.0.0/trunk/hbase-server/target/surefire/surefirebooter4002306973434299716.jar /x1/jenkins/jenkins-slave/workspace/HBase-TRUNK-on-Hadoop-2.0.0/trunk/hbase-server/target/surefire/surefire9163215105553612722tmp /x1/jenkins/jenkins-slave/workspace/HBase-TRUNK-on-Hadoop-2.0.0/trunk/hbase-server/target/surefire/surefire_2155732569520473282658tmp
Running org.apache.hadoop.hbase.replication.TestReplicationSource
Tests run: 1, Failures: 0, Errors: 0, Skipped: 0, Time elapsed: 3.897 sec
Forking command line: /bin/sh -c cd /x1/jenkins/jenkins-slave/workspace/HBase-TRUNK-on-Hadoop-2.0.0/trunk/hbase-server && /x1/jenkins/tools/java/jdk1.6.0_32-32/jre/bin/java -enableassertions -Xmx1900m -Djava.security.egd=file:/dev/./urandom -Djava.net.preferIPv4Stack=true -jar /x1/jenkins/jenkins-slave/workspace/HBase-TRUNK-on-Hadoop-2.0.0/trunk/hbase-server/target/surefire/surefirebooter6771453623480869304.jar /x1/jenkins/jenkins-slave/workspace/HBase-TRUNK-on-Hadoop-2.0.0/trunk/hbase-server/target/surefire/surefire3982050580720062519tmp /x1/jenkins/jenkins-slave/workspace/HBase-TRUNK-on-Hadoop-2.0.0/trunk/hbase-server/target/surefire/surefire_216297890550380916317tmp
Running org.apache.hadoop.hbase.replication.regionserver.TestReplicationSink
Tests run: 5, Failures: 0, Errors: 0, Skipped: 0, Time elapsed: 10.781 sec
Forking command line: /bin/sh -c cd /x1/jenkins/jenkins-slave/workspace/HBase-TRUNK-on-Hadoop-2.0.0/trunk/hbase-server && /x1/jenkins/tools/java/jdk1.6.0_32-32/jre/bin/java -enableassertions -Xmx1900m -Djava.security.egd=file:/dev/./urandom -Djava.net.preferIPv4Stack=true -jar /x1/jenkins/jenkins-slave/workspace/HBase-TRUNK-on-Hadoop-2.0.0/trunk/hbase-server/target/surefire/surefirebooter6537718340846182399.jar /x1/jenkins/jenkins-slave/workspace/HBase-TRUNK-on-Hadoop-2.0.0/trunk/hbase-server/target/surefire/surefire5640522362402429168tmp /x1/jenkins/jenkins-slave/workspace/HBase-TRUNK-on-Hadoop-2.0.0/trunk/hbase-server/target/surefire/surefire_2175503078913876161084tmp
Running org.apache.hadoop.hbase.replication.TestMultiSlaveReplication
Tests run: 1, Failures: 0, Errors: 0, Skipped: 0, Time elapsed: 25.022 sec
Forking command line: /bin/sh -c cd /x1/jenkins/jenkins-slave/workspace/HBase-TRUNK-on-Hadoop-2.0.0/trunk/hbase-server && /x1/jenkins/tools/java/jdk1.6.0_32-32/jre/bin/java -enableassertions -Xmx1900m -Djava.security.egd=file:/dev/./urandom -Djava.net.preferIPv4Stack=true -jar /x1/jenkins/jenkins-slave/workspace/HBase-TRUNK-on-Hadoop-2.0.0/trunk/hbase-server/target/surefire/surefirebooter6269595251104499771.jar /x1/jenkins/jenkins-slave/workspace/HBase-TRUNK-on-Hadoop-2.0.0/trunk/hbase-server/target/surefire/surefire4731190163903591029tmp /x1/jenkins/jenkins-slave/workspace/HBase-TRUNK-on-Hadoop-2.0.0/trunk/hbase-server/target/surefire/surefire_2181124313416943064606tmp
Running org.apache.hadoop.hbase.io.encoding.TestChangingEncoding
Tests run: 4, Failures: 0, Errors: 0, Skipped: 0, Time elapsed: 154.908 sec
Forking command line: /bin/sh -c cd /x1/jenkins/jenkins-slave/workspace/HBase-TRUNK-on-Hadoop-2.0.0/trunk/hbase-server && /x1/jenkins/tools/java/jdk1.6.0_32-32/jre/bin/java -enableassertions -Xmx1900m -Djava.security.egd=file:/dev/./urandom -Djava.net.preferIPv4Stack=true -jar /x1/jenkins/jenkins-slave/workspace/HBase-TRUNK-on-Hadoop-2.0.0/trunk/hbase-server/target/surefire/surefirebooter8388451445316091513.jar /x1/jenkins/jenkins-slave/workspace/HBase-TRUNK-on-Hadoop-2.0.0/trunk/hbase-server/target/surefire/surefire7571043577267926599tmp /x1/jenkins/jenkins-slave/workspace/HBase-TRUNK-on-Hadoop-2.0.0/trunk/hbase-server/target/surefire/surefire_2196825464237513183372tmp
Running org.apache.hadoop.hbase.util.TestMergeTool
Tests run: 1, Failures: 0, Errors: 0, Skipped: 0, Time elapsed: 11.914 sec
Forking command line: /bin/sh -c cd /x1/jenkins/jenkins-slave/workspace/HBase-TRUNK-on-Hadoop-2.0.0/trunk/hbase-server && /x1/jenkins/tools/java/jdk1.6.0_32-32/jre/bin/java -enableassertions -Xmx1900m -Djava.security.egd=file:/dev/./urandom -Djava.net.preferIPv4Stack=true -jar /x1/jenkins/jenkins-slave/workspace/HBase-TRUNK-on-Hadoop-2.0.0/trunk/hbase-server/target/surefire/surefirebooter6710082783524573396.jar /x1/jenkins/jenkins-slave/workspace/HBase-TRUNK-on-Hadoop-2.0.0/trunk/hbase-server/target/surefire/surefire4939085907926185269tmp /x1/jenkins/jenkins-slave/workspace/HBase-TRUNK-on-Hadoop-2.0.0/trunk/hbase-server/target/surefire/surefire_2208183835638402418626tmp
Running org.apache.hadoop.hbase.util.TestFSTableDescriptors
Tests run: 12, Failures: 0, Errors: 0, Skipped: 0, Time elapsed: 1.009 sec
Forking command line: /bin/sh -c cd /x1/jenkins/jenkins-slave/workspace/HBase-TRUNK-on-Hadoop-2.0.0/trunk/hbase-server && /x1/jenkins/tools/java/jdk1.6.0_32-32/jre/bin/java -enableassertions -Xmx1900m -Djava.security.egd=file:/dev/./urandom -Djava.net.preferIPv4Stack=true -jar /x1/jenkins/jenkins-slave/workspace/HBase-TRUNK-on-Hadoop-2.0.0/trunk/hbase-server/target/surefire/surefirebooter3146802279199206369.jar /x1/jenkins/jenkins-slave/workspace/HBase-TRUNK-on-Hadoop-2.0.0/trunk/hbase-server/target/surefire/surefire6001391588512326103tmp /x1/jenkins/jenkins-slave/workspace/HBase-TRUNK-on-Hadoop-2.0.0/trunk/hbase-server/target/surefire/surefire_2213763782071893630657tmp
Running org.apache.hadoop.hbase.replication.TestMasterReplication
Tests run: 2, Failures: 0, Errors: 0, Skipped: 0, Time elapsed: 36.616 sec
Forking command line: /bin/sh -c cd /x1/jenkins/jenkins-slave/workspace/HBase-TRUNK-on-Hadoop-2.0.0/trunk/hbase-server && /x1/jenkins/tools/java/jdk1.6.0_32-32/jre/bin/java -enableassertions -Xmx1900m -Djava.security.egd=file:/dev/./urandom -Djava.net.preferIPv4Stack=true -jar /x1/jenkins/jenkins-slave/workspace/HBase-TRUNK-on-Hadoop-2.0.0/trunk/hbase-server/target/surefire/surefirebooter6469637684305286926.jar /x1/jenkins/jenkins-slave/workspace/HBase-TRUNK-on-Hadoop-2.0.0/trunk/hbase-server/target/surefire/surefire6604408846031425214tmp /x1/jenkins/jenkins-slave/workspace/HBase-TRUNK-on-Hadoop-2.0.0/trunk/hbase-server/target/surefire/surefire_2225015971110971177172tmp
Running org.apache.hadoop.hbase.util.TestIdLock
Tests run: 1, Failures: 0, Errors: 0, Skipped: 0, Time elapsed: 15.299 sec
Forking command line: /bin/sh -c cd /x1/jenkins/jenkins-slave/workspace/HBase-TRUNK-on-Hadoop-2.0.0/trunk/hbase-server && /x1/jenkins/tools/java/jdk1.6.0_32-32/jre/bin/java -enableassertions -Xmx1900m -Djava.security.egd=file:/dev/./urandom -Djava.net.preferIPv4Stack=true -jar /x1/jenkins/jenkins-slave/workspace/HBase-TRUNK-on-Hadoop-2.0.0/trunk/hbase-server/target/surefire/surefirebooter8986761587858511043.jar /x1/jenkins/jenkins-slave/workspace/HBase-TRUNK-on-Hadoop-2.0.0/trunk/hbase-server/target/surefire/surefire3684533557494702900tmp /x1/jenkins/jenkins-slave/workspace/HBase-TRUNK-on-Hadoop-2.0.0/trunk/hbase-server/target/surefire/surefire_2238350341477495640873tmp
Running org.apache.hadoop.hbase.replication.TestReplicationQueueFailoverCompressed
Tests run: 1, Failures: 0, Errors: 0, Skipped: 0, Time elapsed: 91.625 sec
Forking command line: /bin/sh -c cd /x1/jenkins/jenkins-slave/workspace/HBase-TRUNK-on-Hadoop-2.0.0/trunk/hbase-server && /x1/jenkins/tools/java/jdk1.6.0_32-32/jre/bin/java -enableassertions -Xmx1900m -Djava.security.egd=file:/dev/./urandom -Djava.net.preferIPv4Stack=true -jar /x1/jenkins/jenkins-slave/workspace/HBase-TRUNK-on-Hadoop-2.0.0/trunk/hbase-server/target/surefire/surefirebooter8099079765460677175.jar /x1/jenkins/jenkins-slave/workspace/HBase-TRUNK-on-Hadoop-2.0.0/trunk/hbase-server/target/surefire/surefire3725115587547522306tmp /x1/jenkins/jenkins-slave/workspace/HBase-TRUNK-on-Hadoop-2.0.0/trunk/hbase-server/target/surefire/surefire_2248464762531728641322tmp
Running org.apache.hadoop.hbase.util.TestMergeTable
Tests run: 1, Failures: 0, Errors: 0, Skipped: 0, Time elapsed: 15.574 sec
Forking command line: /bin/sh -c cd /x1/jenkins/jenkins-slave/workspace/HBase-TRUNK-on-Hadoop-2.0.0/trunk/hbase-server && /x1/jenkins/tools/java/jdk1.6.0_32-32/jre/bin/java -enableassertions -Xmx1900m -Djava.security.egd=file:/dev/./urandom -Djava.net.preferIPv4Stack=true -jar /x1/jenkins/jenkins-slave/workspace/HBase-TRUNK-on-Hadoop-2.0.0/trunk/hbase-server/target/surefire/surefirebooter598977817487668828.jar /x1/jenkins/jenkins-slave/workspace/HBase-TRUNK-on-Hadoop-2.0.0/trunk/hbase-server/target/surefire/surefire5471388132127445928tmp /x1/jenkins/jenkins-slave/workspace/HBase-TRUNK-on-Hadoop-2.0.0/trunk/hbase-server/target/surefire/surefire_2256469797442265560622tmp
Running org.apache.hadoop.hbase.replication.TestReplicationSmallTests
Tests run: 8, Failures: 0, Errors: 0, Skipped: 0, Time elapsed: 75.856 sec
Forking command line: /bin/sh -c cd /x1/jenkins/jenkins-slave/workspace/HBase-TRUNK-on-Hadoop-2.0.0/trunk/hbase-server && /x1/jenkins/tools/java/jdk1.6.0_32-32/jre/bin/java -enableassertions -Xmx1900m -Djava.security.egd=file:/dev/./urandom -Djava.net.preferIPv4Stack=true -jar /x1/jenkins/jenkins-slave/workspace/HBase-TRUNK-on-Hadoop-2.0.0/trunk/hbase-server/target/surefire/surefirebooter6542284052362648189.jar /x1/jenkins/jenkins-slave/workspace/HBase-TRUNK-on-Hadoop-2.0.0/trunk/hbase-server/target/surefire/surefire2192413810791968706tmp /x1/jenkins/jenkins-slave/workspace/HBase-TRUNK-on-Hadoop-2.0.0/trunk/hbase-server/target/surefire/surefire_2265151928092326307328tmp
Running org.apache.hadoop.hbase.util.TestFSUtils
Tests run: 6, Failures: 0, Errors: 0, Skipped: 0, Time elapsed: 7.322 sec
Forking command line: /bin/sh -c cd /x1/jenkins/jenkins-slave/workspace/HBase-TRUNK-on-Hadoop-2.0.0/trunk/hbase-server && /x1/jenkins/tools/java/jdk1.6.0_32-32/jre/bin/java -enableassertions -Xmx1900m -Djava.security.egd=file:/dev/./urandom -Djava.net.preferIPv4Stack=true -jar /x1/jenkins/jenkins-slave/workspace/HBase-TRUNK-on-Hadoop-2.0.0/trunk/hbase-server/target/surefire/surefirebooter5793970172041031710.jar /x1/jenkins/jenkins-slave/workspace/HBase-TRUNK-on-Hadoop-2.0.0/trunk/hbase-server/target/surefire/surefire7482569660875757317tmp /x1/jenkins/jenkins-slave/workspace/HBase-TRUNK-on-Hadoop-2.0.0/trunk/hbase-server/target/surefire/surefire_2278475707278423280205tmp
Running org.apache.hadoop.hbase.util.TestRegionSplitter
Tests run: 5, Failures: 0, Errors: 0, Skipped: 0, Time elapsed: 8.187 sec
Forking command line: /bin/sh -c cd /x1/jenkins/jenkins-slave/workspace/HBase-TRUNK-on-Hadoop-2.0.0/trunk/hbase-server && /x1/jenkins/tools/java/jdk1.6.0_32-32/jre/bin/java -enableassertions -Xmx1900m -Djava.security.egd=file:/dev/./urandom -Djava.net.preferIPv4Stack=true -jar /x1/jenkins/jenkins-slave/workspace/HBase-TRUNK-on-Hadoop-2.0.0/trunk/hbase-server/target/surefire/surefirebooter3036622438710916136.jar /x1/jenkins/jenkins-slave/workspace/HBase-TRUNK-on-Hadoop-2.0.0/trunk/hbase-server/target/surefire/surefire8232388419749719507tmp /x1/jenkins/jenkins-slave/workspace/HBase-TRUNK-on-Hadoop-2.0.0/trunk/hbase-server/target/surefire/surefire_2289002895507145322637tmp
Running org.apache.hadoop.hbase.util.TestProcessBasedCluster
Tests run: 1, Failures: 0, Errors: 0, Skipped: 0, Time elapsed: 0.375 sec
Forking command line: /bin/sh -c cd /x1/jenkins/jenkins-slave/workspace/HBase-TRUNK-on-Hadoop-2.0.0/trunk/hbase-server && /x1/jenkins/tools/java/jdk1.6.0_32-32/jre/bin/java -enableassertions -Xmx1900m -Djava.security.egd=file:/dev/./urandom -Djava.net.preferIPv4Stack=true -jar /x1/jenkins/jenkins-slave/workspace/HBase-TRUNK-on-Hadoop-2.0.0/trunk/hbase-server/target/surefire/surefirebooter8632910227704427655.jar /x1/jenkins/jenkins-slave/workspace/HBase-TRUNK-on-Hadoop-2.0.0/trunk/hbase-server/target/surefire/surefire4958852544489019360tmp /x1/jenkins/jenkins-slave/workspace/HBase-TRUNK-on-Hadoop-2.0.0/trunk/hbase-server/target/surefire/surefire_2292716644674123046331tmp
Running org.apache.hadoop.hbase.replication.TestReplicationQueueFailover
Tests run: 1, Failures: 0, Errors: 0, Skipped: 0, Time elapsed: 109.199 sec
Forking command line: /bin/sh -c cd /x1/jenkins/jenkins-slave/workspace/HBase-TRUNK-on-Hadoop-2.0.0/trunk/hbase-server && /x1/jenkins/tools/java/jdk1.6.0_32-32/jre/bin/java -enableassertions -Xmx1900m -Djava.security.egd=file:/dev/./urandom -Djava.net.preferIPv4Stack=true -jar /x1/jenkins/jenkins-slave/workspace/HBase-TRUNK-on-Hadoop-2.0.0/trunk/hbase-server/target/surefire/surefirebooter3352736591704285058.jar /x1/jenkins/jenkins-slave/workspace/HBase-TRUNK-on-Hadoop-2.0.0/trunk/hbase-server/target/surefire/surefire9032019111244918928tmp /x1/jenkins/jenkins-slave/workspace/HBase-TRUNK-on-Hadoop-2.0.0/trunk/hbase-server/target/surefire/surefire_2306734736956363786067tmp
Running org.apache.hadoop.hbase.util.TestCoprocessorScanPolicy
Tests run: 4, Failures: 0, Errors: 0, Skipped: 0, Time elapsed: 16.443 sec
Forking command line: /bin/sh -c cd /x1/jenkins/jenkins-slave/workspace/HBase-TRUNK-on-Hadoop-2.0.0/trunk/hbase-server && /x1/jenkins/tools/java/jdk1.6.0_32-32/jre/bin/java -enableassertions -Xmx1900m -Djava.security.egd=file:/dev/./urandom -Djava.net.preferIPv4Stack=true -jar /x1/jenkins/jenkins-slave/workspace/HBase-TRUNK-on-Hadoop-2.0.0/trunk/hbase-server/target/surefire/surefirebooter6428220248338892730.jar /x1/jenkins/jenkins-slave/workspace/HBase-TRUNK-on-Hadoop-2.0.0/trunk/hbase-server/target/surefire/surefire1014511343861533450tmp /x1/jenkins/jenkins-slave/workspace/HBase-TRUNK-on-Hadoop-2.0.0/trunk/hbase-server/target/surefire/surefire_231301520852396028496tmp
Running org.apache.hadoop.hbase.util.TestFSVisitor
Tests run: 3, Failures: 0, Errors: 0, Skipped: 0, Time elapsed: 3.003 sec
Forking command line: /bin/sh -c cd /x1/jenkins/jenkins-slave/workspace/HBase-TRUNK-on-Hadoop-2.0.0/trunk/hbase-server && /x1/jenkins/tools/java/jdk1.6.0_32-32/jre/bin/java -enableassertions -Xmx1900m -Djava.security.egd=file:/dev/./urandom -Djava.net.preferIPv4Stack=true -jar /x1/jenkins/jenkins-slave/workspace/HBase-TRUNK-on-Hadoop-2.0.0/trunk/hbase-server/target/surefire/surefirebooter8029775686599649732.jar /x1/jenkins/jenkins-slave/workspace/HBase-TRUNK-on-Hadoop-2.0.0/trunk/hbase-server/target/surefire/surefire2237018811764585916tmp /x1/jenkins/jenkins-slave/workspace/HBase-TRUNK-on-Hadoop-2.0.0/trunk/hbase-server/target/surefire/surefire_2324811914142726003145tmp
Running org.apache.hadoop.hbase.util.hbck.TestOfflineMetaRebuildBase
Tests run: 1, Failures: 0, Errors: 0, Skipped: 0, Time elapsed: 16.983 sec
Forking command line: /bin/sh -c cd /x1/jenkins/jenkins-slave/workspace/HBase-TRUNK-on-Hadoop-2.0.0/trunk/hbase-server && /x1/jenkins/tools/java/jdk1.6.0_32-32/jre/bin/java -enableassertions -Xmx1900m -Djava.security.egd=file:/dev/./urandom -Djava.net.preferIPv4Stack=true -jar /x1/jenkins/jenkins-slave/workspace/HBase-TRUNK-on-Hadoop-2.0.0/trunk/hbase-server/target/surefire/surefirebooter728869079823723780.jar /x1/jenkins/jenkins-slave/workspace/HBase-TRUNK-on-Hadoop-2.0.0/trunk/hbase-server/target/surefire/surefire6767388569060240993tmp /x1/jenkins/jenkins-slave/workspace/HBase-TRUNK-on-Hadoop-2.0.0/trunk/hbase-server/target/surefire/surefire_2334358936601412729269tmp
Running org.apache.hadoop.hbase.util.hbck.TestOfflineMetaRebuildOverlap
Tests run: 1, Failures: 0, Errors: 0, Skipped: 0, Time elapsed: 16.532 sec
Forking command line: /bin/sh -c cd /x1/jenkins/jenkins-slave/workspace/HBase-TRUNK-on-Hadoop-2.0.0/trunk/hbase-server && /x1/jenkins/tools/java/jdk1.6.0_32-32/jre/bin/java -enableassertions -Xmx1900m -Djava.security.egd=file:/dev/./urandom -Djava.net.preferIPv4Stack=true -jar /x1/jenkins/jenkins-slave/workspace/HBase-TRUNK-on-Hadoop-2.0.0/trunk/hbase-server/target/surefire/surefirebooter6105543394491726257.jar /x1/jenkins/jenkins-slave/workspace/HBase-TRUNK-on-Hadoop-2.0.0/trunk/hbase-server/target/surefire/surefire5829377891412770710tmp /x1/jenkins/jenkins-slave/workspace/HBase-TRUNK-on-Hadoop-2.0.0/trunk/hbase-server/target/surefire/surefire_2348928319630598105695tmp
Running org.apache.hadoop.hbase.util.hbck.TestOfflineMetaRebuildHole
Tests run: 1, Failures: 0, Errors: 0, Skipped: 0, Time elapsed: 16.631 sec
Forking command line: /bin/sh -c cd /x1/jenkins/jenkins-slave/workspace/HBase-TRUNK-on-Hadoop-2.0.0/trunk/hbase-server && /x1/jenkins/tools/java/jdk1.6.0_32-32/jre/bin/java -enableassertions -Xmx1900m -Djava.security.egd=file:/dev/./urandom -Djava.net.preferIPv4Stack=true -jar /x1/jenkins/jenkins-slave/workspace/HBase-TRUNK-on-Hadoop-2.0.0/trunk/hbase-server/target/surefire/surefirebooter873452146017368698.jar /x1/jenkins/jenkins-slave/workspace/HBase-TRUNK-on-Hadoop-2.0.0/trunk/hbase-server/target/surefire/surefire301973342358978479tmp /x1/jenkins/jenkins-slave/workspace/HBase-TRUNK-on-Hadoop-2.0.0/trunk/hbase-server/target/surefire/surefire_2352770451375588700794tmp
Running org.apache.hadoop.hbase.util.TestDefaultEnvironmentEdge
Tests run: 1, Failures: 0, Errors: 0, Skipped: 0, Time elapsed: 0.194 sec
Forking command line: /bin/sh -c cd /x1/jenkins/jenkins-slave/workspace/HBase-TRUNK-on-Hadoop-2.0.0/trunk/hbase-server && /x1/jenkins/tools/java/jdk1.6.0_32-32/jre/bin/java -enableassertions -Xmx1900m -Djava.security.egd=file:/dev/./urandom -Djava.net.preferIPv4Stack=true -jar /x1/jenkins/jenkins-slave/workspace/HBase-TRUNK-on-Hadoop-2.0.0/trunk/hbase-server/target/surefire/surefirebooter417040716515718519.jar /x1/jenkins/jenkins-slave/workspace/HBase-TRUNK-on-Hadoop-2.0.0/trunk/hbase-server/target/surefire/surefire807476847988497294tmp /x1/jenkins/jenkins-slave/workspace/HBase-TRUNK-on-Hadoop-2.0.0/trunk/hbase-server/target/surefire/surefire_2366112080519951544237tmp
Running org.apache.hadoop.hbase.TestInfoServers
Tests run: 3, Failures: 0, Errors: 0, Skipped: 0, Time elapsed: 9.438 sec
Running org.apache.hadoop.hbase.util.TestMiniClusterLoadEncoded
Tests run: 5, Failures: 0, Errors: 0, Skipped: 0, Time elapsed: 83.915 sec
Running org.apache.hadoop.hbase.util.TestHBaseFsck
Tests run: 35, Failures: 0, Errors: 0, Skipped: 1, Time elapsed: 214.909 sec
Running org.apache.hadoop.hbase.util.TestMiniClusterLoadParallel
Tests run: 4, Failures: 0, Errors: 2, Skipped: 0, Time elapsed: 449.698 sec <<< FAILURE!
Running org.apache.hadoop.hbase.util.TestMiniClusterLoadSequential
Tests run: 4, Failures: 0, Errors: 2, Skipped: 0, Time elapsed: 506.731 sec <<< FAILURE!
Results :
Failed tests: testMultithreadedTableMapper(org.apache.hadoop.hbase.mapreduce.TestMultithreadedTableMapper)
testMultiRegionTable(org.apache.hadoop.hbase.mapreduce.TestTableMapReduce)
testMRIncrementalLoad(org.apache.hadoop.hbase.mapreduce.TestHFileOutputFormat)
testMRIncrementalLoadWithSplit(org.apache.hadoop.hbase.mapreduce.TestHFileOutputFormat)
Tests in error:
testDrainingServerWithAbort(org.apache.hadoop.hbase.TestDrainingServer): test timed out after 30000 milliseconds
testExportScannerBatching(org.apache.hadoop.hbase.mapreduce.TestImportExport)
testWithFilter(org.apache.hadoop.hbase.mapreduce.TestImportExport)
testRecoveredEdits(org.apache.hadoop.hbase.master.TestDistributedLogSplitting): error or interrupted while splitting logs in [hdfs://localhost:50681/user/jenkins/hbase/.logs/hemera.apache.org,39688,1364592413611] Task = installed = 1 done = 0 error = 1
testThreeRSAbort(org.apache.hadoop.hbase.master.TestDistributedLogSplitting): test timed out after 300000 milliseconds
testAppendClose(org.apache.hadoop.hbase.regionserver.wal.TestHLog): Failed to open hdfs://localhost:48911/user/jenkins/hbase/TestHLog/hlogdirtrue/hlog.1364593077703 for append
testJoinedScanners(org.apache.hadoop.hbase.regionserver.TestJoinedScanners): Failed 4 actions: NotServingRegionException: 4 times,
loadTest[0](org.apache.hadoop.hbase.util.TestMiniClusterLoadParallel): test timed out after 180000 milliseconds
loadTest[1](org.apache.hadoop.hbase.util.TestMiniClusterLoadParallel): test timed out after 180000 milliseconds
loadTest[0](org.apache.hadoop.hbase.util.TestMiniClusterLoadSequential): test timed out after 180000 milliseconds
loadTest[1](org.apache.hadoop.hbase.util.TestMiniClusterLoadSequential): test timed out after 180000 milliseconds
Tests run: 1442, Failures: 4, Errors: 11, Skipped: 13
[INFO]
[INFO] ------------------------------------------------------------------------
[INFO] Skipping HBase
[INFO] This project has been banned from the build due to previous failures.
[INFO] ------------------------------------------------------------------------
[INFO] ------------------------------------------------------------------------
[INFO] Reactor Summary:
[INFO]
[INFO] HBase ............................................. SUCCESS [8.700s]
[INFO] HBase - Common .................................... SUCCESS [19.743s]
[INFO] HBase - Protocol .................................. SUCCESS [12.725s]
[INFO] HBase - Client .................................... SUCCESS [7.847s]
[INFO] HBase - Prefix Tree ............................... SUCCESS [2.790s]
[INFO] HBase - Hadoop Compatibility ...................... SUCCESS [0.481s]
[INFO] HBase - Hadoop Two Compatibility .................. SUCCESS [3.072s]
[INFO] HBase - Server .................................... FAILURE [46:28.976s]
[INFO] HBase - Integration Tests ......................... SKIPPED
[INFO] HBase - Examples .................................. SKIPPED
[INFO] HBase - Assembly .................................. SKIPPED
[INFO] ------------------------------------------------------------------------
[INFO] BUILD FAILURE
[INFO] ------------------------------------------------------------------------
[INFO] Total time: 47:28.168s
[INFO] Finished at: Fri Mar 29 22:04:04 UTC 2013
[INFO] Final Memory: 121M/1044M
[INFO] ------------------------------------------------------------------------
[ERROR] Failed to execute goal org.apache.maven.plugins:maven-surefire-plugin:2.12-TRUNK-HBASE-2:test (secondPartTestsExecution) on project hbase-server: Failure or timeout -> [Help 1]
org.apache.maven.lifecycle.LifecycleExecutionException: Failed to execute goal org.apache.maven.plugins:maven-surefire-plugin:2.12-TRUNK-HBASE-2:test (secondPartTestsExecution) on project hbase-server: Failure or timeout
at org.apache.maven.lifecycle.internal.MojoExecutor.execute(MojoExecutor.java:217)
at org.apache.maven.lifecycle.internal.MojoExecutor.execute(MojoExecutor.java:153)
at org.apache.maven.lifecycle.internal.MojoExecutor.execute(MojoExecutor.java:145)
at org.apache.maven.lifecycle.internal.LifecycleModuleBuilder.buildProject(LifecycleModuleBuilder.java:84)
at org.apache.maven.lifecycle.internal.LifecycleModuleBuilder.buildProject(LifecycleModuleBuilder.java:59)
at org.apache.maven.lifecycle.internal.LifecycleStarter.singleThreadedBuild(LifecycleStarter.java:183)
at org.apache.maven.lifecycle.internal.LifecycleStarter.execute(LifecycleStarter.java:161)
at org.apache.maven.DefaultMaven.doExecute(DefaultMaven.java:320)
at org.apache.maven.DefaultMaven.execute(DefaultMaven.java:156)
at org.apache.maven.cli.MavenCli.execute(MavenCli.java:537)
at org.apache.maven.cli.MavenCli.doMain(MavenCli.java:196)
at org.apache.maven.cli.MavenCli.main(MavenCli.java:141)
at sun.reflect.NativeMethodAccessorImpl.invoke0(Native Method)
at sun.reflect.NativeMethodAccessorImpl.invoke(NativeMethodAccessorImpl.java:39)
at sun.reflect.DelegatingMethodAccessorImpl.invoke(DelegatingMethodAccessorImpl.java:25)
at java.lang.reflect.Method.invoke(Method.java:597)
at org.codehaus.plexus.classworlds.launcher.Launcher.launchEnhanced(Launcher.java:290)
at org.codehaus.plexus.classworlds.launcher.Launcher.launch(Launcher.java:230)
at org.codehaus.plexus.classworlds.launcher.Launcher.mainWithExitCode(Launcher.java:409)
at org.codehaus.plexus.classworlds.launcher.Launcher.main(Launcher.java:352)
Caused by: org.apache.maven.plugin.MojoExecutionException: Failure or timeout
at org.apache.maven.plugin.surefire.SurefirePlugin.assertNoFailureOrTimeout(SurefirePlugin.java:643)
at org.apache.maven.plugin.surefire.SurefirePlugin.handleSummary(SurefirePlugin.java:624)
at org.apache.maven.plugin.surefire.AbstractSurefireMojo.executeAfterPreconditionsChecked(AbstractSurefireMojo.java:137)
at org.apache.maven.plugin.surefire.AbstractSurefireMojo.execute(AbstractSurefireMojo.java:98)
at org.apache.maven.plugin.DefaultBuildPluginManager.executeMojo(DefaultBuildPluginManager.java:101)
at org.apache.maven.lifecycle.internal.MojoExecutor.execute(MojoExecutor.java:209)
... 19 more
[ERROR]
[ERROR]
[ERROR] For more information about the errors and possible solutions, please read the following articles:
[ERROR] [Help 1] http://cwiki.apache.org/confluence/display/MAVEN/MojoExecutionException
[ERROR]
[ERROR] After correcting the problems, you can resume the build with the command
[ERROR] mvn <goals> -rf :hbase-server
Build step 'Invoke top-level Maven targets' marked build as failure
Archiving artifacts
Recording test results
Updating HBASE-8209
Updating HBASE-8207
Updating HBASE-8187
Updating HBASE-7977