You are viewing a plain text version of this content. The canonical link for it is here.
Posted to notifications@maven.apache.org by Apache Jenkins Server <je...@builds.apache.org> on 2015/10/22 14:40:30 UTC

Build failed in Jenkins: maven-plugins #4773

See <https://builds.apache.org/job/maven-plugins/4773/changes>

Changes:

[Michael Osipov] [MPH-111] IT 'effective-pom_properties' fails if run with -Dinvoker.mergeUserSettings

------------------------------------------
[...truncated 19492 lines...]
A         maven-acr-plugin/src/main/java/org/apache/maven/plugin/acr
AU        maven-acr-plugin/src/main/java/org/apache/maven/plugin/acr/AcrMojo.java
A         maven-acr-plugin/src/main/resources
A         maven-acr-plugin/src/main/resources/META-INF
A         maven-acr-plugin/src/main/resources/META-INF/plexus
AU        maven-acr-plugin/src/main/resources/META-INF/plexus/components.xml
A         maven-acr-plugin/src/site
AU        maven-acr-plugin/src/site/site.xml
A         maven-acr-plugin/src/site/apt
AU        maven-acr-plugin/src/site/apt/usage.apt.vm
AU        maven-acr-plugin/src/site/apt/index.apt.vm
A         maven-acr-plugin/src/site/apt/examples
AU        maven-acr-plugin/src/site/apt/examples/app-client-dependency.apt.vm
AU        maven-acr-plugin/src/site/apt/examples/filter-deployment-descriptor.apt.vm
A         maven-acr-plugin/src/site/resources
A         maven-acr-plugin/src/site/resources/download.cgi
A         maven-acr-plugin/src/site/xdoc
A         maven-acr-plugin/src/site/xdoc/download.xml.vm
A         maven-acr-plugin/src/site/fml
AU        maven-acr-plugin/src/site/fml/faq.fml
A         maven-acr-plugin/src/it
A         maven-acr-plugin/src/it/it-01
A         maven-acr-plugin/src/it/it-01/src
A         maven-acr-plugin/src/it/it-01/src/main
A         maven-acr-plugin/src/it/it-01/src/main/java
A         maven-acr-plugin/src/it/it-01/src/main/java/org
A         maven-acr-plugin/src/it/it-01/src/main/java/org/apache
A         maven-acr-plugin/src/it/it-01/src/main/java/org/apache/maven
A         maven-acr-plugin/src/it/it-01/src/main/java/org/apache/maven/plugin
A         maven-acr-plugin/src/it/it-01/src/main/java/org/apache/maven/plugin/acr
A         maven-acr-plugin/src/it/it-01/src/main/java/org/apache/maven/plugin/acr/it
A         maven-acr-plugin/src/it/it-01/src/main/java/org/apache/maven/plugin/acr/it/it01
AU        maven-acr-plugin/src/it/it-01/src/main/java/org/apache/maven/plugin/acr/it/it01/SampleApp.java
A         maven-acr-plugin/src/it/it-01/src/main/resources
A         maven-acr-plugin/src/it/it-01/src/main/resources/META-INF
AU        maven-acr-plugin/src/it/it-01/src/main/resources/META-INF/application-client.xml
AU        maven-acr-plugin/src/it/it-01/pom.xml
AU        maven-acr-plugin/src/it/it-01/verify.bsh
A         maven-acr-plugin/src/it/it-02
A         maven-acr-plugin/src/it/it-02/bundle
A         maven-acr-plugin/src/it/it-02/bundle/src
A         maven-acr-plugin/src/it/it-02/bundle/src/main
A         maven-acr-plugin/src/it/it-02/bundle/src/main/java
A         maven-acr-plugin/src/it/it-02/bundle/src/main/java/org
A         maven-acr-plugin/src/it/it-02/bundle/src/main/java/org/apache
A         maven-acr-plugin/src/it/it-02/bundle/src/main/java/org/apache/maven
A         maven-acr-plugin/src/it/it-02/bundle/src/main/java/org/apache/maven/plugin
A         maven-acr-plugin/src/it/it-02/bundle/src/main/java/org/apache/maven/plugin/acr
A         maven-acr-plugin/src/it/it-02/bundle/src/main/java/org/apache/maven/plugin/acr/it
A         maven-acr-plugin/src/it/it-02/bundle/src/main/java/org/apache/maven/plugin/acr/it/it02
AU        maven-acr-plugin/src/it/it-02/bundle/src/main/java/org/apache/maven/plugin/acr/it/it02/DependencyTest.java
AU        maven-acr-plugin/src/it/it-02/bundle/pom.xml
AU        maven-acr-plugin/src/it/it-02/pom.xml
A         maven-acr-plugin/src/it/it-02/app-client
A         maven-acr-plugin/src/it/it-02/app-client/src
A         maven-acr-plugin/src/it/it-02/app-client/src/main
A         maven-acr-plugin/src/it/it-02/app-client/src/main/resources
A         maven-acr-plugin/src/it/it-02/app-client/src/main/resources/META-INF
AU        maven-acr-plugin/src/it/it-02/app-client/src/main/resources/META-INF/application-client.xml
A         maven-acr-plugin/src/it/it-02/app-client/src/main/java
A         maven-acr-plugin/src/it/it-02/app-client/src/main/java/org
A         maven-acr-plugin/src/it/it-02/app-client/src/main/java/org/apache
A         maven-acr-plugin/src/it/it-02/app-client/src/main/java/org/apache/maven
A         maven-acr-plugin/src/it/it-02/app-client/src/main/java/org/apache/maven/plugin
A         maven-acr-plugin/src/it/it-02/app-client/src/main/java/org/apache/maven/plugin/acr
A         maven-acr-plugin/src/it/it-02/app-client/src/main/java/org/apache/maven/plugin/acr/it
A         maven-acr-plugin/src/it/it-02/app-client/src/main/java/org/apache/maven/plugin/acr/it/it02
AU        maven-acr-plugin/src/it/it-02/app-client/src/main/java/org/apache/maven/plugin/acr/it/it02/SampleApp.java
AU        maven-acr-plugin/src/it/it-02/app-client/pom.xml
AU        maven-acr-plugin/src/it/it-02/verify.bsh
A         maven-acr-plugin/src/it/it-03
A         maven-acr-plugin/src/it/it-03/src
A         maven-acr-plugin/src/it/it-03/src/main
A         maven-acr-plugin/src/it/it-03/src/main/resources
A         maven-acr-plugin/src/it/it-03/src/main/resources/META-INF
AU        maven-acr-plugin/src/it/it-03/src/main/resources/META-INF/application-client.xml
AU        maven-acr-plugin/src/it/it-03/pom.xml
AU        maven-acr-plugin/src/it/it-03/verify.bsh
A         maven-acr-plugin/src/it/it-04
A         maven-acr-plugin/src/it/it-04/src
A         maven-acr-plugin/src/it/it-04/src/main
A         maven-acr-plugin/src/it/it-04/src/main/resources
A         maven-acr-plugin/src/it/it-04/src/main/resources/META-INF
AU        maven-acr-plugin/src/it/it-04/src/main/resources/META-INF/application-client.xml
AU        maven-acr-plugin/src/it/it-04/pom.xml
AU        maven-acr-plugin/src/it/it-04/verify.bsh
AU        maven-acr-plugin/src/it/settings.xml
AU        maven-acr-plugin/deploySite.sh
AU        maven-acr-plugin/pom.xml
 U        .
At revision 1710004
Parsing POMs
Downloaded artifact http://repo.maven.apache.org/maven2/org/apache/maven/plugins/maven-plugins/28/maven-plugins-28.pom
Downloaded artifact http://repo.maven.apache.org/maven2/org/apache/maven/maven-parent/27/maven-parent-27.pom
Failed to transfer Could not find metadata org.apache.maven.plugins:maven-plugins:28-SNAPSHOT/maven-metadata.xml in plexus-snapshots (https://oss.sonatype.org/content/repositories/plexus-snapshots)
Failed to transfer Could not find artifact org.apache.maven.plugins:maven-plugins:pom:28-SNAPSHOT in plexus-snapshots (https://oss.sonatype.org/content/repositories/plexus-snapshots)
ERROR: Failed to parse POMs
java.io.IOException: remote file operation failed: <https://builds.apache.org/job/maven-plugins/ws/> at hudson.remoting.Channel@527bfd1c:jenkins-ubuntu-1404-4gb-b69: hudson.remoting.ProxyException: hudson.maven.MavenModuleSetBuild$MavenExecutionException: org.apache.maven.project.ProjectBuildingException: Some problems were encountered while processing the POMs:
[FATAL] Non-resolvable parent POM: Could not find artifact org.apache.maven.plugins:maven-plugins:pom:28-SNAPSHOT and 'parent.relativePath' points at wrong local POM @ line 25, column 11
[FATAL] Non-resolvable parent POM: Could not find artifact org.apache.maven.plugins:maven-plugins:pom:28-SNAPSHOT and 'parent.relativePath' points at wrong local POM @ line 25, column 11
[FATAL] Non-resolvable parent POM: Could not find artifact org.apache.maven.plugins:maven-plugins:pom:28-SNAPSHOT and 'parent.relativePath' points at wrong local POM @ line 25, column 11
[FATAL] Non-resolvable parent POM: Could not find artifact org.apache.maven.plugins:maven-plugins:pom:28-SNAPSHOT and 'parent.relativePath' points at wrong local POM @ line 25, column 11
[FATAL] Non-resolvable parent POM: Could not find artifact org.apache.maven.plugins:maven-plugins:pom:28-SNAPSHOT and 'parent.relativePath' points at wrong local POM @ line 25, column 11
[FATAL] Non-resolvable parent POM: Could not find artifact org.apache.maven.plugins:maven-plugins:pom:28-SNAPSHOT in plexus-snapshots (https://oss.sonatype.org/content/repositories/plexus-snapshots) and 'parent.relativePath' points at wrong local POM @ line 25, column 11
[FATAL] Non-resolvable parent POM: Could not find artifact org.apache.maven.plugins:maven-plugins:pom:28-SNAPSHOT and 'parent.relativePath' points at wrong local POM @ line 25, column 11
[FATAL] Non-resolvable parent POM: Could not find artifact org.apache.maven.plugins:maven-plugins:pom:28-SNAPSHOT and 'parent.relativePath' points at wrong local POM @ line 25, column 11
[FATAL] Non-resolvable parent POM: Could not find artifact org.apache.maven.plugins:maven-plugins:pom:28-SNAPSHOT and 'parent.relativePath' points at wrong local POM @ line 25, column 11
[FATAL] Non-resolvable parent POM: Could not find artifact org.apache.maven.plugins:maven-plugins:pom:28-SNAPSHOT and 'parent.relativePath' points at wrong local POM @ line 25, column 11
[FATAL] Non-resolvable parent POM: Could not find artifact org.apache.maven.plugins:maven-plugins:pom:28-SNAPSHOT and 'parent.relativePath' points at wrong local POM @ line 25, column 11
[FATAL] Non-resolvable parent POM: Could not find artifact org.apache.maven.plugins:maven-plugins:pom:28-SNAPSHOT and 'parent.relativePath' points at wrong local POM @ line 25, column 11
[FATAL] Non-resolvable parent POM: Could not find artifact org.apache.maven.plugins:maven-plugins:pom:28-SNAPSHOT and 'parent.relativePath' points at wrong local POM @ line 25, column 11
[FATAL] Non-resolvable parent POM: Could not find artifact org.apache.maven.plugins:maven-plugins:pom:28-SNAPSHOT and 'parent.relativePath' points at wrong local POM @ line 25, column 11
[FATAL] Non-resolvable parent POM: Could not find artifact org.apache.maven.plugins:maven-plugins:pom:28-SNAPSHOT and 'parent.relativePath' points at wrong local POM @ line 25, column 11
[FATAL] Non-resolvable parent POM: Could not find artifact org.apache.maven.plugins:maven-plugins:pom:28-SNAPSHOT and 'parent.relativePath' points at wrong local POM @ line 25, column 11
[FATAL] Non-resolvable parent POM: Could not find artifact org.apache.maven.plugins:maven-plugins:pom:28-SNAPSHOT and 'parent.relativePath' points at wrong local POM @ line 25, column 11
[FATAL] Non-resolvable parent POM: Could not find artifact org.apache.maven.plugins:maven-plugins:pom:28-SNAPSHOT and 'parent.relativePath' points at wrong local POM @ line 25, column 11
[FATAL] Non-resolvable parent POM: Could not find artifact org.apache.maven.plugins:maven-plugins:pom:28-SNAPSHOT and 'parent.relativePath' points at wrong local POM @ line 25, column 11
[FATAL] Non-resolvable parent POM: Could not find artifact org.apache.maven.plugins:maven-plugins:pom:28-SNAPSHOT and 'parent.relativePath' points at wrong local POM @ line 25, column 11
[FATAL] Non-resolvable parent POM: Could not find artifact org.apache.maven.plugins:maven-plugins:pom:28-SNAPSHOT and 'parent.relativePath' points at wrong local POM @ line 25, column 11
[FATAL] Non-resolvable parent POM: Could not find artifact org.apache.maven.plugins:maven-plugins:pom:28-SNAPSHOT and 'parent.relativePath' points at wrong local POM @ line 25, column 11
[FATAL] Non-resolvable parent POM: Could not find artifact org.apache.maven.plugins:maven-plugins:pom:28-SNAPSHOT and 'parent.relativePath' points at wrong local POM @ line 25, column 11
[FATAL] Non-resolvable parent POM: Could not find artifact org.apache.maven.plugins:maven-plugins:pom:28-SNAPSHOT and 'parent.relativePath' points at wrong local POM @ line 25, column 11
[FATAL] Non-resolvable parent POM: Could not find artifact org.apache.maven.plugins:maven-plugins:pom:28-SNAPSHOT and 'parent.relativePath' points at wrong local POM @ line 25, column 11
[FATAL] Non-resolvable parent POM: Could not find artifact org.apache.maven.plugins:maven-plugins:pom:28-SNAPSHOT and 'parent.relativePath' points at wrong local POM @ line 25, column 11
[FATAL] Non-resolvable parent POM: Could not find artifact org.apache.maven.plugins:maven-plugins:pom:28-SNAPSHOT and 'parent.relativePath' points at wrong local POM @ line 25, column 11
[FATAL] Non-resolvable parent POM: Could not find artifact org.apache.maven.plugins:maven-plugins:pom:28-SNAPSHOT and 'parent.relativePath' points at wrong local POM @ line 25, column 11
[FATAL] Non-resolvable parent POM: Could not find artifact org.apache.maven.plugins:maven-plugins:pom:28-SNAPSHOT and 'parent.relativePath' points at wrong local POM @ line 25, column 11
[FATAL] Non-resolvable parent POM: Could not find artifact org.apache.maven.plugins:maven-plugins:pom:28-SNAPSHOT and 'parent.relativePath' points at wrong local POM @ line 25, column 11
[FATAL] Non-resolvable parent POM: Could not find artifact org.apache.maven.plugins:maven-plugins:pom:28-SNAPSHOT and 'parent.relativePath' points at wrong local POM @ line 28, column 11
[FATAL] Non-resolvable parent POM: Could not find artifact org.apache.maven.plugins:maven-plugins:pom:28-SNAPSHOT and 'parent.relativePath' points at wrong local POM @ line 25, column 11
[FATAL] Non-resolvable parent POM: Could not find artifact org.apache.maven.plugins:maven-plugins:pom:28-SNAPSHOT and 'parent.relativePath' points at wrong local POM @ line 26, column 11
[FATAL] Non-resolvable parent POM: Could not find artifact org.apache.maven.plugins:maven-plugins:pom:28-SNAPSHOT and 'parent.relativePath' points at wrong local POM @ line 25, column 11
[FATAL] Non-resolvable parent POM: Could not find artifact org.apache.maven.plugins:maven-plugins:pom:28-SNAPSHOT and 'parent.relativePath' points at wrong local POM @ line 25, column 11

	at hudson.FilePath.act(FilePath.java:985)
	at hudson.FilePath.act(FilePath.java:967)
	at hudson.maven.MavenModuleSetBuild$MavenModuleSetBuildExecution.parsePoms(MavenModuleSetBuild.java:960)
	at hudson.maven.MavenModuleSetBuild$MavenModuleSetBuildExecution.doRun(MavenModuleSetBuild.java:679)
	at hudson.model.AbstractBuild$AbstractBuildExecution.run(AbstractBuild.java:536)
	at hudson.model.Run.execute(Run.java:1738)
	at hudson.maven.MavenModuleSetBuild.run(MavenModuleSetBuild.java:531)
	at hudson.model.ResourceController.execute(ResourceController.java:98)
	at hudson.model.Executor.run(Executor.java:381)
Caused by: hudson.remoting.ProxyException: hudson.maven.MavenModuleSetBuild$MavenExecutionException: org.apache.maven.project.ProjectBuildingException: Some problems were encountered while processing the POMs:
[FATAL] Non-resolvable parent POM: Could not find artifact org.apache.maven.plugins:maven-plugins:pom:28-SNAPSHOT and 'parent.relativePath' points at wrong local POM @ line 25, column 11
[FATAL] Non-resolvable parent POM: Could not find artifact org.apache.maven.plugins:maven-plugins:pom:28-SNAPSHOT and 'parent.relativePath' points at wrong local POM @ line 25, column 11
[FATAL] Non-resolvable parent POM: Could not find artifact org.apache.maven.plugins:maven-plugins:pom:28-SNAPSHOT and 'parent.relativePath' points at wrong local POM @ line 25, column 11
[FATAL] Non-resolvable parent POM: Could not find artifact org.apache.maven.plugins:maven-plugins:pom:28-SNAPSHOT and 'parent.relativePath' points at wrong local POM @ line 25, column 11
[FATAL] Non-resolvable parent POM: Could not find artifact org.apache.maven.plugins:maven-plugins:pom:28-SNAPSHOT and 'parent.relativePath' points at wrong local POM @ line 25, column 11
[FATAL] Non-resolvable parent POM: Could not find artifact org.apache.maven.plugins:maven-plugins:pom:28-SNAPSHOT in plexus-snapshots (https://oss.sonatype.org/content/repositories/plexus-snapshots) and 'parent.relativePath' points at wrong local POM @ line 25, column 11
[FATAL] Non-resolvable parent POM: Could not find artifact org.apache.maven.plugins:maven-plugins:pom:28-SNAPSHOT and 'parent.relativePath' points at wrong local POM @ line 25, column 11
[FATAL] Non-resolvable parent POM: Could not find artifact org.apache.maven.plugins:maven-plugins:pom:28-SNAPSHOT and 'parent.relativePath' points at wrong local POM @ line 25, column 11
[FATAL] Non-resolvable parent POM: Could not find artifact org.apache.maven.plugins:maven-plugins:pom:28-SNAPSHOT and 'parent.relativePath' points at wrong local POM @ line 25, column 11
[FATAL] Non-resolvable parent POM: Could not find artifact org.apache.maven.plugins:maven-plugins:pom:28-SNAPSHOT and 'parent.relativePath' points at wrong local POM @ line 25, column 11
[FATAL] Non-resolvable parent POM: Could not find artifact org.apache.maven.plugins:maven-plugins:pom:28-SNAPSHOT and 'parent.relativePath' points at wrong local POM @ line 25, column 11
[FATAL] Non-resolvable parent POM: Could not find artifact org.apache.maven.plugins:maven-plugins:pom:28-SNAPSHOT and 'parent.relativePath' points at wrong local POM @ line 25, column 11
[FATAL] Non-resolvable parent POM: Could not find artifact org.apache.maven.plugins:maven-plugins:pom:28-SNAPSHOT and 'parent.relativePath' points at wrong local POM @ line 25, column 11
[FATAL] Non-resolvable parent POM: Could not find artifact org.apache.maven.plugins:maven-plugins:pom:28-SNAPSHOT and 'parent.relativePath' points at wrong local POM @ line 25, column 11
[FATAL] Non-resolvable parent POM: Could not find artifact org.apache.maven.plugins:maven-plugins:pom:28-SNAPSHOT and 'parent.relativePath' points at wrong local POM @ line 25, column 11
[FATAL] Non-resolvable parent POM: Could not find artifact org.apache.maven.plugins:maven-plugins:pom:28-SNAPSHOT and 'parent.relativePath' points at wrong local POM @ line 25, column 11
[FATAL] Non-resolvable parent POM: Could not find artifact org.apache.maven.plugins:maven-plugins:pom:28-SNAPSHOT and 'parent.relativePath' points at wrong local POM @ line 25, column 11
[FATAL] Non-resolvable parent POM: Could not find artifact org.apache.maven.plugins:maven-plugins:pom:28-SNAPSHOT and 'parent.relativePath' points at wrong local POM @ line 25, column 11
[FATAL] Non-resolvable parent POM: Could not find artifact org.apache.maven.plugins:maven-plugins:pom:28-SNAPSHOT and 'parent.relativePath' points at wrong local POM @ line 25, column 11
[FATAL] Non-resolvable parent POM: Could not find artifact org.apache.maven.plugins:maven-plugins:pom:28-SNAPSHOT and 'parent.relativePath' points at wrong local POM @ line 25, column 11
[FATAL] Non-resolvable parent POM: Could not find artifact org.apache.maven.plugins:maven-plugins:pom:28-SNAPSHOT and 'parent.relativePath' points at wrong local POM @ line 25, column 11
[FATAL] Non-resolvable parent POM: Could not find artifact org.apache.maven.plugins:maven-plugins:pom:28-SNAPSHOT and 'parent.relativePath' points at wrong local POM @ line 25, column 11
[FATAL] Non-resolvable parent POM: Could not find artifact org.apache.maven.plugins:maven-plugins:pom:28-SNAPSHOT and 'parent.relativePath' points at wrong local POM @ line 25, column 11
[FATAL] Non-resolvable parent POM: Could not find artifact org.apache.maven.plugins:maven-plugins:pom:28-SNAPSHOT and 'parent.relativePath' points at wrong local POM @ line 25, column 11
[FATAL] Non-resolvable parent POM: Could not find artifact org.apache.maven.plugins:maven-plugins:pom:28-SNAPSHOT and 'parent.relativePath' points at wrong local POM @ line 25, column 11
[FATAL] Non-resolvable parent POM: Could not find artifact org.apache.maven.plugins:maven-plugins:pom:28-SNAPSHOT and 'parent.relativePath' points at wrong local POM @ line 25, column 11
[FATAL] Non-resolvable parent POM: Could not find artifact org.apache.maven.plugins:maven-plugins:pom:28-SNAPSHOT and 'parent.relativePath' points at wrong local POM @ line 25, column 11
[FATAL] Non-resolvable parent POM: Could not find artifact org.apache.maven.plugins:maven-plugins:pom:28-SNAPSHOT and 'parent.relativePath' points at wrong local POM @ line 25, column 11
[FATAL] Non-resolvable parent POM: Could not find artifact org.apache.maven.plugins:maven-plugins:pom:28-SNAPSHOT and 'parent.relativePath' points at wrong local POM @ line 25, column 11
[FATAL] Non-resolvable parent POM: Could not find artifact org.apache.maven.plugins:maven-plugins:pom:28-SNAPSHOT and 'parent.relativePath' points at wrong local POM @ line 25, column 11
[FATAL] Non-resolvable parent POM: Could not find artifact org.apache.maven.plugins:maven-plugins:pom:28-SNAPSHOT and 'parent.relativePath' points at wrong local POM @ line 28, column 11
[FATAL] Non-resolvable parent POM: Could not find artifact org.apache.maven.plugins:maven-plugins:pom:28-SNAPSHOT and 'parent.relativePath' points at wrong local POM @ line 25, column 11
[FATAL] Non-resolvable parent POM: Could not find artifact org.apache.maven.plugins:maven-plugins:pom:28-SNAPSHOT and 'parent.relativePath' points at wrong local POM @ line 26, column 11
[FATAL] Non-resolvable parent POM: Could not find artifact org.apache.maven.plugins:maven-plugins:pom:28-SNAPSHOT and 'parent.relativePath' points at wrong local POM @ line 25, column 11
[FATAL] Non-resolvable parent POM: Could not find artifact org.apache.maven.plugins:maven-plugins:pom:28-SNAPSHOT and 'parent.relativePath' points at wrong local POM @ line 25, column 11

	at hudson.maven.MavenModuleSetBuild$PomParser.invoke(MavenModuleSetBuild.java:1364)
	at hudson.maven.MavenModuleSetBuild$PomParser.invoke(MavenModuleSetBuild.java:1098)
	at hudson.FilePath$FileCallableWrapper.call(FilePath.java:2688)
	at hudson.remoting.UserRequest.perform(UserRequest.java:121)
	at hudson.remoting.UserRequest.perform(UserRequest.java:49)
	at hudson.remoting.Request$2.run(Request.java:326)
	at hudson.remoting.InterceptingExecutorService$1.call(InterceptingExecutorService.java:68)
	at java.util.concurrent.FutureTask.run(FutureTask.java:262)
	at java.util.concurrent.ThreadPoolExecutor.runWorker(ThreadPoolExecutor.java:1145)
	at java.util.concurrent.ThreadPoolExecutor$Worker.run(ThreadPoolExecutor.java:615)
	at java.lang.Thread.run(Thread.java:745)
	at ......remote call to jenkins-ubuntu-1404-4gb-b69(Native Method)
	at hudson.remoting.Channel.attachCallSiteStackTrace(Channel.java:1413)
	at hudson.remoting.UserResponse.retrieve(UserRequest.java:221)
	at hudson.remoting.Channel.call(Channel.java:778)
	at hudson.FilePath.act(FilePath.java:978)
	... 8 more
Caused by: hudson.remoting.ProxyException: org.apache.maven.project.ProjectBuildingException: Some problems were encountered while processing the POMs:
[FATAL] Non-resolvable parent POM: Could not find artifact org.apache.maven.plugins:maven-plugins:pom:28-SNAPSHOT and 'parent.relativePath' points at wrong local POM @ line 25, column 11
[FATAL] Non-resolvable parent POM: Could not find artifact org.apache.maven.plugins:maven-plugins:pom:28-SNAPSHOT and 'parent.relativePath' points at wrong local POM @ line 25, column 11
[FATAL] Non-resolvable parent POM: Could not find artifact org.apache.maven.plugins:maven-plugins:pom:28-SNAPSHOT and 'parent.relativePath' points at wrong local POM @ line 25, column 11
[FATAL] Non-resolvable parent POM: Could not find artifact org.apache.maven.plugins:maven-plugins:pom:28-SNAPSHOT and 'parent.relativePath' points at wrong local POM @ line 25, column 11
[FATAL] Non-resolvable parent POM: Could not find artifact org.apache.maven.plugins:maven-plugins:pom:28-SNAPSHOT and 'parent.relativePath' points at wrong local POM @ line 25, column 11
[FATAL] Non-resolvable parent POM: Could not find artifact org.apache.maven.plugins:maven-plugins:pom:28-SNAPSHOT in plexus-snapshots (https://oss.sonatype.org/content/repositories/plexus-snapshots) and 'parent.relativePath' points at wrong local POM @ line 25, column 11
[FATAL] Non-resolvable parent POM: Could not find artifact org.apache.maven.plugins:maven-plugins:pom:28-SNAPSHOT and 'parent.relativePath' points at wrong local POM @ line 25, column 11
[FATAL] Non-resolvable parent POM: Could not find artifact org.apache.maven.plugins:maven-plugins:pom:28-SNAPSHOT and 'parent.relativePath' points at wrong local POM @ line 25, column 11
[FATAL] Non-resolvable parent POM: Could not find artifact org.apache.maven.plugins:maven-plugins:pom:28-SNAPSHOT and 'parent.relativePath' points at wrong local POM @ line 25, column 11
[FATAL] Non-resolvable parent POM: Could not find artifact org.apache.maven.plugins:maven-plugins:pom:28-SNAPSHOT and 'parent.relativePath' points at wrong local POM @ line 25, column 11
[FATAL] Non-resolvable parent POM: Could not find artifact org.apache.maven.plugins:maven-plugins:pom:28-SNAPSHOT and 'parent.relativePath' points at wrong local POM @ line 25, column 11
[FATAL] Non-resolvable parent POM: Could not find artifact org.apache.maven.plugins:maven-plugins:pom:28-SNAPSHOT and 'parent.relativePath' points at wrong local POM @ line 25, column 11
[FATAL] Non-resolvable parent POM: Could not find artifact org.apache.maven.plugins:maven-plugins:pom:28-SNAPSHOT and 'parent.relativePath' points at wrong local POM @ line 25, column 11
[FATAL] Non-resolvable parent POM: Could not find artifact org.apache.maven.plugins:maven-plugins:pom:28-SNAPSHOT and 'parent.relativePath' points at wrong local POM @ line 25, column 11
[FATAL] Non-resolvable parent POM: Could not find artifact org.apache.maven.plugins:maven-plugins:pom:28-SNAPSHOT and 'parent.relativePath' points at wrong local POM @ line 25, column 11
[FATAL] Non-resolvable parent POM: Could not find artifact org.apache.maven.plugins:maven-plugins:pom:28-SNAPSHOT and 'parent.relativePath' points at wrong local POM @ line 25, column 11
[FATAL] Non-resolvable parent POM: Could not find artifact org.apache.maven.plugins:maven-plugins:pom:28-SNAPSHOT and 'parent.relativePath' points at wrong local POM @ line 25, column 11
[FATAL] Non-resolvable parent POM: Could not find artifact org.apache.maven.plugins:maven-plugins:pom:28-SNAPSHOT and 'parent.relativePath' points at wrong local POM @ line 25, column 11
[FATAL] Non-resolvable parent POM: Could not find artifact org.apache.maven.plugins:maven-plugins:pom:28-SNAPSHOT and 'parent.relativePath' points at wrong local POM @ line 25, column 11
[FATAL] Non-resolvable parent POM: Could not find artifact org.apache.maven.plugins:maven-plugins:pom:28-SNAPSHOT and 'parent.relativePath' points at wrong local POM @ line 25, column 11
[FATAL] Non-resolvable parent POM: Could not find artifact org.apache.maven.plugins:maven-plugins:pom:28-SNAPSHOT and 'parent.relativePath' points at wrong local POM @ line 25, column 11
[FATAL] Non-resolvable parent POM: Could not find artifact org.apache.maven.plugins:maven-plugins:pom:28-SNAPSHOT and 'parent.relativePath' points at wrong local POM @ line 25, column 11
[FATAL] Non-resolvable parent POM: Could not find artifact org.apache.maven.plugins:maven-plugins:pom:28-SNAPSHOT and 'parent.relativePath' points at wrong local POM @ line 25, column 11
[FATAL] Non-resolvable parent POM: Could not find artifact org.apache.maven.plugins:maven-plugins:pom:28-SNAPSHOT and 'parent.relativePath' points at wrong local POM @ line 25, column 11
[FATAL] Non-resolvable parent POM: Could not find artifact org.apache.maven.plugins:maven-plugins:pom:28-SNAPSHOT and 'parent.relativePath' points at wrong local POM @ line 25, column 11
[FATAL] Non-resolvable parent POM: Could not find artifact org.apache.maven.plugins:maven-plugins:pom:28-SNAPSHOT and 'parent.relativePath' points at wrong local POM @ line 25, column 11
[FATAL] Non-resolvable parent POM: Could not find artifact org.apache.maven.plugins:maven-plugins:pom:28-SNAPSHOT and 'parent.relativePath' points at wrong local POM @ line 25, column 11
[FATAL] Non-resolvable parent POM: Could not find artifact org.apache.maven.plugins:maven-plugins:pom:28-SNAPSHOT and 'parent.relativePath' points at wrong local POM @ line 25, column 11
[FATAL] Non-resolvable parent POM: Could not find artifact org.apache.maven.plugins:maven-plugins:pom:28-SNAPSHOT and 'parent.relativePath' points at wrong local POM @ line 25, column 11
[FATAL] Non-resolvable parent POM: Could not find artifact org.apache.maven.plugins:maven-plugins:pom:28-SNAPSHOT and 'parent.relativePath' points at wrong local POM @ line 25, column 11
[FATAL] Non-resolvable parent POM: Could not find artifact org.apache.maven.plugins:maven-plugins:pom:28-SNAPSHOT and 'parent.relativePath' points at wrong local POM @ line 28, column 11
[FATAL] Non-resolvable parent POM: Could not find artifact org.apache.maven.plugins:maven-plugins:pom:28-SNAPSHOT and 'parent.relativePath' points at wrong local POM @ line 25, column 11
[FATAL] Non-resolvable parent POM: Could not find artifact org.apache.maven.plugins:maven-plugins:pom:28-SNAPSHOT and 'parent.relativePath' points at wrong local POM @ line 26, column 11
[FATAL] Non-resolvable parent POM: Could not find artifact org.apache.maven.plugins:maven-plugins:pom:28-SNAPSHOT and 'parent.relativePath' points at wrong local POM @ line 25, column 11
[FATAL] Non-resolvable parent POM: Could not find artifact org.apache.maven.plugins:maven-plugins:pom:28-SNAPSHOT and 'parent.relativePath' points at wrong local POM @ line 25, column 11

	at org.apache.maven.project.DefaultProjectBuilder.build(DefaultProjectBuilder.java:364)
	at hudson.maven.MavenEmbedder.buildProjects(MavenEmbedder.java:361)
	at hudson.maven.MavenEmbedder.readProjects(MavenEmbedder.java:331)
	at hudson.maven.MavenModuleSetBuild$PomParser.invoke(MavenModuleSetBuild.java:1301)
	at hudson.maven.MavenModuleSetBuild$PomParser.invoke(MavenModuleSetBuild.java:1098)
	at hudson.FilePath$FileCallableWrapper.call(FilePath.java:2688)
	at hudson.remoting.UserRequest.perform(UserRequest.java:121)
	at hudson.remoting.UserRequest.perform(UserRequest.java:49)
	at hudson.remoting.Request$2.run(Request.java:326)
	at hudson.remoting.InterceptingExecutorService$1.call(InterceptingExecutorService.java:68)
	at java.util.concurrent.FutureTask.run(FutureTask.java:262)
	at java.util.concurrent.ThreadPoolExecutor.runWorker(ThreadPoolExecutor.java:1145)
	at java.util.concurrent.ThreadPoolExecutor$Worker.run(ThreadPoolExecutor.java:615)
	at java.lang.Thread.run(Thread.java:745)
[WARNINGS] Skipping publisher since build result is FAILURE