You are viewing a plain text version of this content. The canonical link for it is here.
Posted to notifications@maven.apache.org by gm...@apache.org on 2015/08/20 14:53:05 UTC
Build failed in Jenkins: maven-wagon » Apache Maven Wagon :: HTTP Test Compatibility Kit #146
See <https://analysis.apache.org/jenkins/job/maven-wagon/org.apache.maven.wagon$wagon-tck-http/146/>
------------------------------------------
[...truncated 35 lines...]
[INFO] Using 'UTF-8' encoding to copy filtered resources.
[INFO] Copying 3 resources
[INFO] Copying 3 resources
[INFO]
[INFO] --- maven-compiler-plugin:3.1:compile (default-compile) @ wagon-tck-http ---
[INFO] Changes detected - recompiling the module!
[INFO] Compiling 15 source files to <https://analysis.apache.org/jenkins/job/maven-wagon/org.apache.maven.wagon$wagon-tck-http/ws/target/classes>
[INFO] -------------------------------------------------------------
[ERROR] COMPILATION ERROR :
[INFO] -------------------------------------------------------------
[ERROR] <https://analysis.apache.org/jenkins/job/maven-wagon/org.apache.maven.wagon$wagon-tck-http/ws/src/main/java/org/apache/maven/wagon/tck/http/fixture/RedirectionServlet.java>:[22,20] package javax.servlet does not exist
[ERROR] <https://analysis.apache.org/jenkins/job/maven-wagon/org.apache.maven.wagon$wagon-tck-http/ws/src/main/java/org/apache/maven/wagon/tck/http/fixture/RedirectionServlet.java>:[23,25] package javax.servlet.http does not exist
[ERROR] <https://analysis.apache.org/jenkins/job/maven-wagon/org.apache.maven.wagon$wagon-tck-http/ws/src/main/java/org/apache/maven/wagon/tck/http/fixture/RedirectionServlet.java>:[24,25] package javax.servlet.http does not exist
[ERROR] <https://analysis.apache.org/jenkins/job/maven-wagon/org.apache.maven.wagon$wagon-tck-http/ws/src/main/java/org/apache/maven/wagon/tck/http/fixture/RedirectionServlet.java>:[25,25] package javax.servlet.http does not exist
[ERROR] <https://analysis.apache.org/jenkins/job/maven-wagon/org.apache.maven.wagon$wagon-tck-http/ws/src/main/java/org/apache/maven/wagon/tck/http/fixture/RedirectionServlet.java>:[32,12] cannot find symbol
symbol: class HttpServlet
extends HttpServlet
[ERROR] <https://analysis.apache.org/jenkins/job/maven-wagon/org.apache.maven.wagon$wagon-tck-http/ws/src/main/java/org/apache/maven/wagon/tck/http/fixture/RedirectionServlet.java>:[69,34] cannot find symbol
symbol : class HttpServletRequest
location: class org.apache.maven.wagon.tck.http.fixture.RedirectionServlet
[ERROR] <https://analysis.apache.org/jenkins/job/maven-wagon/org.apache.maven.wagon$wagon-tck-http/ws/src/main/java/org/apache/maven/wagon/tck/http/fixture/RedirectionServlet.java>:[69,64] cannot find symbol
symbol : class HttpServletResponse
location: class org.apache.maven.wagon.tck.http.fixture.RedirectionServlet
[ERROR] <https://analysis.apache.org/jenkins/job/maven-wagon/org.apache.maven.wagon$wagon-tck-http/ws/src/main/java/org/apache/maven/wagon/tck/http/fixture/RedirectionServlet.java>:[70,15] cannot find symbol
symbol : class ServletException
location: class org.apache.maven.wagon.tck.http.fixture.RedirectionServlet
[ERROR] <https://analysis.apache.org/jenkins/job/maven-wagon/org.apache.maven.wagon$wagon-tck-http/ws/src/main/java/org/apache/maven/wagon/tck/http/fixture/ErrorCodeServlet.java>:[24,20] package javax.servlet does not exist
[ERROR] <https://analysis.apache.org/jenkins/job/maven-wagon/org.apache.maven.wagon$wagon-tck-http/ws/src/main/java/org/apache/maven/wagon/tck/http/fixture/ErrorCodeServlet.java>:[25,25] package javax.servlet.http does not exist
[ERROR] <https://analysis.apache.org/jenkins/job/maven-wagon/org.apache.maven.wagon$wagon-tck-http/ws/src/main/java/org/apache/maven/wagon/tck/http/fixture/ErrorCodeServlet.java>:[26,25] package javax.servlet.http does not exist
[ERROR] <https://analysis.apache.org/jenkins/job/maven-wagon/org.apache.maven.wagon$wagon-tck-http/ws/src/main/java/org/apache/maven/wagon/tck/http/fixture/ErrorCodeServlet.java>:[27,25] package javax.servlet.http does not exist
[ERROR] <https://analysis.apache.org/jenkins/job/maven-wagon/org.apache.maven.wagon$wagon-tck-http/ws/src/main/java/org/apache/maven/wagon/tck/http/fixture/ErrorCodeServlet.java>:[33,12] cannot find symbol
symbol: class HttpServlet
extends HttpServlet
[ERROR] <https://analysis.apache.org/jenkins/job/maven-wagon/org.apache.maven.wagon$wagon-tck-http/ws/src/main/java/org/apache/maven/wagon/tck/http/fixture/ErrorCodeServlet.java>:[49,34] cannot find symbol
symbol : class HttpServletRequest
location: class org.apache.maven.wagon.tck.http.fixture.ErrorCodeServlet
[ERROR] <https://analysis.apache.org/jenkins/job/maven-wagon/org.apache.maven.wagon$wagon-tck-http/ws/src/main/java/org/apache/maven/wagon/tck/http/fixture/ErrorCodeServlet.java>:[49,64] cannot find symbol
symbol : class HttpServletResponse
location: class org.apache.maven.wagon.tck.http.fixture.ErrorCodeServlet
[ERROR] <https://analysis.apache.org/jenkins/job/maven-wagon/org.apache.maven.wagon$wagon-tck-http/ws/src/main/java/org/apache/maven/wagon/tck/http/fixture/ErrorCodeServlet.java>:[50,15] cannot find symbol
symbol : class ServletException
location: class org.apache.maven.wagon.tck.http.fixture.ErrorCodeServlet
[ERROR] <https://analysis.apache.org/jenkins/job/maven-wagon/org.apache.maven.wagon$wagon-tck-http/ws/src/main/java/org/apache/maven/wagon/tck/http/fixture/ProxyAuthenticationFilter.java>:[26,20] package javax.servlet does not exist
[ERROR] <https://analysis.apache.org/jenkins/job/maven-wagon/org.apache.maven.wagon$wagon-tck-http/ws/src/main/java/org/apache/maven/wagon/tck/http/fixture/ProxyAuthenticationFilter.java>:[27,20] package javax.servlet does not exist
[ERROR] <https://analysis.apache.org/jenkins/job/maven-wagon/org.apache.maven.wagon$wagon-tck-http/ws/src/main/java/org/apache/maven/wagon/tck/http/fixture/ProxyAuthenticationFilter.java>:[28,20] package javax.servlet does not exist
[ERROR] <https://analysis.apache.org/jenkins/job/maven-wagon/org.apache.maven.wagon$wagon-tck-http/ws/src/main/java/org/apache/maven/wagon/tck/http/fixture/ProxyAuthenticationFilter.java>:[29,20] package javax.servlet does not exist
[ERROR] <https://analysis.apache.org/jenkins/job/maven-wagon/org.apache.maven.wagon$wagon-tck-http/ws/src/main/java/org/apache/maven/wagon/tck/http/fixture/ProxyAuthenticationFilter.java>:[30,20] package javax.servlet does not exist
[ERROR] <https://analysis.apache.org/jenkins/job/maven-wagon/org.apache.maven.wagon$wagon-tck-http/ws/src/main/java/org/apache/maven/wagon/tck/http/fixture/ProxyAuthenticationFilter.java>:[31,20] package javax.servlet does not exist
[ERROR] <https://analysis.apache.org/jenkins/job/maven-wagon/org.apache.maven.wagon$wagon-tck-http/ws/src/main/java/org/apache/maven/wagon/tck/http/fixture/ProxyAuthenticationFilter.java>:[32,25] package javax.servlet.http does not exist
[ERROR] <https://analysis.apache.org/jenkins/job/maven-wagon/org.apache.maven.wagon$wagon-tck-http/ws/src/main/java/org/apache/maven/wagon/tck/http/fixture/ProxyAuthenticationFilter.java>:[33,25] package javax.servlet.http does not exist
[ERROR] <https://analysis.apache.org/jenkins/job/maven-wagon/org.apache.maven.wagon$wagon-tck-http/ws/src/main/java/org/apache/maven/wagon/tck/http/fixture/ProxyAuthenticationFilter.java>:[39,15] cannot find symbol
symbol: class Filter
implements Filter
[ERROR] <https://analysis.apache.org/jenkins/job/maven-wagon/org.apache.maven.wagon$wagon-tck-http/ws/src/main/java/org/apache/maven/wagon/tck/http/fixture/ProxyAuthenticationFilter.java>:[56,32] cannot find symbol
symbol : class ServletRequest
location: class org.apache.maven.wagon.tck.http.fixture.ProxyAuthenticationFilter
[ERROR] <https://analysis.apache.org/jenkins/job/maven-wagon/org.apache.maven.wagon$wagon-tck-http/ws/src/main/java/org/apache/maven/wagon/tck/http/fixture/ProxyAuthenticationFilter.java>:[56,58] cannot find symbol
symbol : class ServletResponse
location: class org.apache.maven.wagon.tck.http.fixture.ProxyAuthenticationFilter
[ERROR] <https://analysis.apache.org/jenkins/job/maven-wagon/org.apache.maven.wagon$wagon-tck-http/ws/src/main/java/org/apache/maven/wagon/tck/http/fixture/ProxyAuthenticationFilter.java>:[56,86] cannot find symbol
symbol : class FilterChain
location: class org.apache.maven.wagon.tck.http.fixture.ProxyAuthenticationFilter
[ERROR] <https://analysis.apache.org/jenkins/job/maven-wagon/org.apache.maven.wagon$wagon-tck-http/ws/src/main/java/org/apache/maven/wagon/tck/http/fixture/ProxyAuthenticationFilter.java>:[57,28] cannot find symbol
symbol : class ServletException
location: class org.apache.maven.wagon.tck.http.fixture.ProxyAuthenticationFilter
[ERROR] <https://analysis.apache.org/jenkins/job/maven-wagon/org.apache.maven.wagon$wagon-tck-http/ws/src/main/java/org/apache/maven/wagon/tck/http/fixture/ProxyAuthenticationFilter.java>:[84,28] cannot find symbol
symbol : class FilterConfig
location: class org.apache.maven.wagon.tck.http.fixture.ProxyAuthenticationFilter
[ERROR] <https://analysis.apache.org/jenkins/job/maven-wagon/org.apache.maven.wagon$wagon-tck-http/ws/src/main/java/org/apache/maven/wagon/tck/http/fixture/ProxyAuthenticationFilter.java>:[85,15] cannot find symbol
symbol : class ServletException
location: class org.apache.maven.wagon.tck.http.fixture.ProxyAuthenticationFilter
[ERROR] <https://analysis.apache.org/jenkins/job/maven-wagon/org.apache.maven.wagon$wagon-tck-http/ws/src/main/java/org/apache/maven/wagon/tck/http/fixture/ServerFixture.java>:[41,20] package javax.servlet does not exist
[ERROR] <https://analysis.apache.org/jenkins/job/maven-wagon/org.apache.maven.wagon$wagon-tck-http/ws/src/main/java/org/apache/maven/wagon/tck/http/fixture/ServerFixture.java>:[42,20] package javax.servlet does not exist
[ERROR] <https://analysis.apache.org/jenkins/job/maven-wagon/org.apache.maven.wagon$wagon-tck-http/ws/src/main/java/org/apache/maven/wagon/tck/http/fixture/ServerFixture.java>:[141,56] cannot find symbol
symbol : class Filter
location: class org.apache.maven.wagon.tck.http.fixture.ServerFixture
[ERROR] <https://analysis.apache.org/jenkins/job/maven-wagon/org.apache.maven.wagon$wagon-tck-http/ws/src/main/java/org/apache/maven/wagon/tck/http/fixture/ServerFixture.java>:[155,57] cannot find symbol
symbol : class Servlet
location: class org.apache.maven.wagon.tck.http.fixture.ServerFixture
[ERROR] <https://analysis.apache.org/jenkins/job/maven-wagon/org.apache.maven.wagon$wagon-tck-http/ws/src/main/java/org/apache/maven/wagon/tck/http/GetWagonTests.java>:[42,25] package javax.servlet.http does not exist
[ERROR] <https://analysis.apache.org/jenkins/job/maven-wagon/org.apache.maven.wagon$wagon-tck-http/ws/src/main/java/org/apache/maven/wagon/tck/http/fixture/ProxyConnectionVerifierFilter.java>:[27,20] package javax.servlet does not exist
[ERROR] <https://analysis.apache.org/jenkins/job/maven-wagon/org.apache.maven.wagon$wagon-tck-http/ws/src/main/java/org/apache/maven/wagon/tck/http/fixture/ProxyConnectionVerifierFilter.java>:[28,20] package javax.servlet does not exist
[ERROR] <https://analysis.apache.org/jenkins/job/maven-wagon/org.apache.maven.wagon$wagon-tck-http/ws/src/main/java/org/apache/maven/wagon/tck/http/fixture/ProxyConnectionVerifierFilter.java>:[29,20] package javax.servlet does not exist
[ERROR] <https://analysis.apache.org/jenkins/job/maven-wagon/org.apache.maven.wagon$wagon-tck-http/ws/src/main/java/org/apache/maven/wagon/tck/http/fixture/ProxyConnectionVerifierFilter.java>:[30,20] package javax.servlet does not exist
[ERROR] <https://analysis.apache.org/jenkins/job/maven-wagon/org.apache.maven.wagon$wagon-tck-http/ws/src/main/java/org/apache/maven/wagon/tck/http/fixture/ProxyConnectionVerifierFilter.java>:[31,20] package javax.servlet does not exist
[ERROR] <https://analysis.apache.org/jenkins/job/maven-wagon/org.apache.maven.wagon$wagon-tck-http/ws/src/main/java/org/apache/maven/wagon/tck/http/fixture/ProxyConnectionVerifierFilter.java>:[32,25] package javax.servlet.http does not exist
[ERROR] <https://analysis.apache.org/jenkins/job/maven-wagon/org.apache.maven.wagon$wagon-tck-http/ws/src/main/java/org/apache/maven/wagon/tck/http/fixture/ProxyConnectionVerifierFilter.java>:[40,15] cannot find symbol
symbol: class Filter
implements Filter
[ERROR] <https://analysis.apache.org/jenkins/job/maven-wagon/org.apache.maven.wagon$wagon-tck-http/ws/src/main/java/org/apache/maven/wagon/tck/http/fixture/ProxyConnectionVerifierFilter.java>:[49,32] cannot find symbol
symbol : class ServletRequest
location: class org.apache.maven.wagon.tck.http.fixture.ProxyConnectionVerifierFilter
[ERROR] <https://analysis.apache.org/jenkins/job/maven-wagon/org.apache.maven.wagon$wagon-tck-http/ws/src/main/java/org/apache/maven/wagon/tck/http/fixture/ProxyConnectionVerifierFilter.java>:[49,58] cannot find symbol
symbol : class ServletResponse
location: class org.apache.maven.wagon.tck.http.fixture.ProxyConnectionVerifierFilter
[ERROR] <https://analysis.apache.org/jenkins/job/maven-wagon/org.apache.maven.wagon$wagon-tck-http/ws/src/main/java/org/apache/maven/wagon/tck/http/fixture/ProxyConnectionVerifierFilter.java>:[49,86] cannot find symbol
symbol : class FilterChain
location: class org.apache.maven.wagon.tck.http.fixture.ProxyConnectionVerifierFilter
[ERROR] <https://analysis.apache.org/jenkins/job/maven-wagon/org.apache.maven.wagon$wagon-tck-http/ws/src/main/java/org/apache/maven/wagon/tck/http/fixture/ProxyConnectionVerifierFilter.java>:[50,28] cannot find symbol
symbol : class ServletException
location: class org.apache.maven.wagon.tck.http.fixture.ProxyConnectionVerifierFilter
[ERROR] <https://analysis.apache.org/jenkins/job/maven-wagon/org.apache.maven.wagon$wagon-tck-http/ws/src/main/java/org/apache/maven/wagon/tck/http/fixture/ProxyConnectionVerifierFilter.java>:[76,28] cannot find symbol
symbol : class FilterConfig
location: class org.apache.maven.wagon.tck.http.fixture.ProxyConnectionVerifierFilter
[ERROR] <https://analysis.apache.org/jenkins/job/maven-wagon/org.apache.maven.wagon$wagon-tck-http/ws/src/main/java/org/apache/maven/wagon/tck/http/fixture/ProxyConnectionVerifierFilter.java>:[77,15] cannot find symbol
symbol : class ServletException
location: class org.apache.maven.wagon.tck.http.fixture.ProxyConnectionVerifierFilter
[ERROR] <https://analysis.apache.org/jenkins/job/maven-wagon/org.apache.maven.wagon$wagon-tck-http/ws/src/main/java/org/apache/maven/wagon/tck/http/fixture/LatencyServlet.java>:[28,25] package javax.servlet.http does not exist
[ERROR] <https://analysis.apache.org/jenkins/job/maven-wagon/org.apache.maven.wagon$wagon-tck-http/ws/src/main/java/org/apache/maven/wagon/tck/http/fixture/LatencyServlet.java>:[39,12] cannot find symbol
symbol: class HttpServlet
extends HttpServlet
[ERROR] <https://analysis.apache.org/jenkins/job/maven-wagon/org.apache.maven.wagon$wagon-tck-http/ws/src/main/java/org/apache/maven/wagon/tck/http/fixture/LatencyServlet.java>:[55,32] cannot find symbol
symbol : class HttpServletRequest
location: class org.apache.maven.wagon.tck.http.fixture.LatencyServlet
[ERROR] <https://analysis.apache.org/jenkins/job/maven-wagon/org.apache.maven.wagon$wagon-tck-http/ws/src/main/java/org/apache/maven/wagon/tck/http/fixture/LatencyServlet.java>:[55,62] cannot find symbol
symbol : class HttpServletResponse
location: class org.apache.maven.wagon.tck.http.fixture.LatencyServlet
[ERROR] <https://analysis.apache.org/jenkins/job/maven-wagon/org.apache.maven.wagon$wagon-tck-http/ws/src/main/java/org/apache/maven/wagon/tck/http/fixture/LatencyServlet.java>:[56,15] cannot find symbol
symbol : class ServletException
location: class org.apache.maven.wagon.tck.http.fixture.LatencyServlet
[ERROR] <https://analysis.apache.org/jenkins/job/maven-wagon/org.apache.maven.wagon$wagon-tck-http/ws/src/main/java/org/apache/maven/wagon/tck/http/fixture/AuthSnoopFilter.java>:[25,20] package javax.servlet does not exist
[ERROR] <https://analysis.apache.org/jenkins/job/maven-wagon/org.apache.maven.wagon$wagon-tck-http/ws/src/main/java/org/apache/maven/wagon/tck/http/fixture/AuthSnoopFilter.java>:[26,20] package javax.servlet does not exist
[ERROR] <https://analysis.apache.org/jenkins/job/maven-wagon/org.apache.maven.wagon$wagon-tck-http/ws/src/main/java/org/apache/maven/wagon/tck/http/fixture/AuthSnoopFilter.java>:[39,15] cannot find symbol
symbol: class Filter
implements Filter
[ERROR] <https://analysis.apache.org/jenkins/job/maven-wagon/org.apache.maven.wagon$wagon-tck-http/ws/src/main/java/org/apache/maven/wagon/tck/http/fixture/AuthSnoopFilter.java>:[47,32] cannot find symbol
symbol : class ServletRequest
location: class org.apache.maven.wagon.tck.http.fixture.AuthSnoopFilter
[ERROR] <https://analysis.apache.org/jenkins/job/maven-wagon/org.apache.maven.wagon$wagon-tck-http/ws/src/main/java/org/apache/maven/wagon/tck/http/fixture/AuthSnoopFilter.java>:[47,58] cannot find symbol
symbol : class ServletResponse
location: class org.apache.maven.wagon.tck.http.fixture.AuthSnoopFilter
[ERROR] <https://analysis.apache.org/jenkins/job/maven-wagon/org.apache.maven.wagon$wagon-tck-http/ws/src/main/java/org/apache/maven/wagon/tck/http/fixture/AuthSnoopFilter.java>:[47,90] cannot find symbol
symbol : class FilterChain
location: class org.apache.maven.wagon.tck.http.fixture.AuthSnoopFilter
[ERROR] <https://analysis.apache.org/jenkins/job/maven-wagon/org.apache.maven.wagon$wagon-tck-http/ws/src/main/java/org/apache/maven/wagon/tck/http/fixture/AuthSnoopFilter.java>:[48,28] cannot find symbol
symbol : class ServletException
location: class org.apache.maven.wagon.tck.http.fixture.AuthSnoopFilter
[ERROR] <https://analysis.apache.org/jenkins/job/maven-wagon/org.apache.maven.wagon$wagon-tck-http/ws/src/main/java/org/apache/maven/wagon/tck/http/fixture/AuthSnoopFilter.java>:[65,28] cannot find symbol
symbol : class FilterConfig
location: class org.apache.maven.wagon.tck.http.fixture.AuthSnoopFilter
[ERROR] <https://analysis.apache.org/jenkins/job/maven-wagon/org.apache.maven.wagon$wagon-tck-http/ws/src/main/java/org/apache/maven/wagon/tck/http/fixture/AuthSnoopFilter.java>:[66,15] cannot find symbol
symbol : class ServletException
location: class org.apache.maven.wagon.tck.http.fixture.AuthSnoopFilter
[ERROR] <https://analysis.apache.org/jenkins/job/maven-wagon/org.apache.maven.wagon$wagon-tck-http/ws/src/main/java/org/apache/maven/wagon/tck/http/fixture/ServletExceptionServlet.java>:[25,25] package javax.servlet.http does not exist
[ERROR] <https://analysis.apache.org/jenkins/job/maven-wagon/org.apache.maven.wagon$wagon-tck-http/ws/src/main/java/org/apache/maven/wagon/tck/http/fixture/ServletExceptionServlet.java>:[33,12] cannot find symbol
symbol: class HttpServlet
extends HttpServlet
[ERROR] <https://analysis.apache.org/jenkins/job/maven-wagon/org.apache.maven.wagon$wagon-tck-http/ws/src/main/java/org/apache/maven/wagon/tck/http/fixture/ServletExceptionServlet.java>:[46,34] cannot find symbol
symbol : class HttpServletRequest
location: class org.apache.maven.wagon.tck.http.fixture.ServletExceptionServlet
[ERROR] <https://analysis.apache.org/jenkins/job/maven-wagon/org.apache.maven.wagon$wagon-tck-http/ws/src/main/java/org/apache/maven/wagon/tck/http/fixture/ServletExceptionServlet.java>:[46,68] cannot find symbol
symbol : class HttpServletResponse
location: class org.apache.maven.wagon.tck.http.fixture.ServletExceptionServlet
[ERROR] <https://analysis.apache.org/jenkins/job/maven-wagon/org.apache.maven.wagon$wagon-tck-http/ws/src/main/java/org/apache/maven/wagon/tck/http/fixture/ServletExceptionServlet.java>:[47,15] cannot find symbol
symbol : class ServletException
location: class org.apache.maven.wagon.tck.http.fixture.ServletExceptionServlet
[ERROR] <https://analysis.apache.org/jenkins/job/maven-wagon/org.apache.maven.wagon$wagon-tck-http/ws/src/main/java/org/apache/maven/wagon/tck/http/fixture/RedirectionServlet.java>:[68,4] method does not override or implement a method from a supertype
[ERROR] <https://analysis.apache.org/jenkins/job/maven-wagon/org.apache.maven.wagon$wagon-tck-http/ws/src/main/java/org/apache/maven/wagon/tck/http/fixture/ErrorCodeServlet.java>:[48,4] method does not override or implement a method from a supertype
[ERROR] <https://analysis.apache.org/jenkins/job/maven-wagon/org.apache.maven.wagon$wagon-tck-http/ws/src/main/java/org/apache/maven/wagon/tck/http/fixture/ProxyAuthenticationFilter.java>:[59,8] cannot find symbol
symbol : class HttpServletRequest
location: class org.apache.maven.wagon.tck.http.fixture.ProxyAuthenticationFilter
[ERROR] <https://analysis.apache.org/jenkins/job/maven-wagon/org.apache.maven.wagon$wagon-tck-http/ws/src/main/java/org/apache/maven/wagon/tck/http/fixture/ProxyAuthenticationFilter.java>:[59,38] cannot find symbol
symbol : class HttpServletRequest
location: class org.apache.maven.wagon.tck.http.fixture.ProxyAuthenticationFilter
[ERROR] <https://analysis.apache.org/jenkins/job/maven-wagon/org.apache.maven.wagon$wagon-tck-http/ws/src/main/java/org/apache/maven/wagon/tck/http/fixture/ProxyAuthenticationFilter.java>:[60,8] cannot find symbol
symbol : class HttpServletResponse
location: class org.apache.maven.wagon.tck.http.fixture.ProxyAuthenticationFilter
[ERROR] <https://analysis.apache.org/jenkins/job/maven-wagon/org.apache.maven.wagon$wagon-tck-http/ws/src/main/java/org/apache/maven/wagon/tck/http/fixture/ProxyAuthenticationFilter.java>:[60,40] cannot find symbol
symbol : class HttpServletResponse
location: class org.apache.maven.wagon.tck.http.fixture.ProxyAuthenticationFilter
[ERROR] <https://analysis.apache.org/jenkins/job/maven-wagon/org.apache.maven.wagon$wagon-tck-http/ws/src/main/java/org/apache/maven/wagon/tck/http/fixture/ProxyAuthenticationFilter.java>:[65,32] cannot find symbol
symbol : variable HttpServletResponse
location: class org.apache.maven.wagon.tck.http.fixture.ProxyAuthenticationFilter
[ERROR] <https://analysis.apache.org/jenkins/job/maven-wagon/org.apache.maven.wagon$wagon-tck-http/ws/src/main/java/org/apache/maven/wagon/tck/http/fixture/ProxyAuthenticationFilter.java>:[77,36] cannot find symbol
symbol : variable HttpServletResponse
location: class org.apache.maven.wagon.tck.http.fixture.ProxyAuthenticationFilter
[ERROR] <https://analysis.apache.org/jenkins/job/maven-wagon/org.apache.maven.wagon$wagon-tck-http/ws/src/main/java/org/apache/maven/wagon/tck/http/fixture/ServerFixture.java>:[81,17] cannot access org.mortbay.component.AbstractLifeCycle
class file for org.mortbay.component.AbstractLifeCycle not found
server = new Server();
[ERROR] <https://analysis.apache.org/jenkins/job/maven-wagon/org.apache.maven.wagon$wagon-tck-http/ws/src/main/java/org/apache/maven/wagon/tck/http/fixture/ServerFixture.java>:[102,21] cannot access org.mortbay.component.LifeCycle
class file for org.mortbay.component.LifeCycle not found
connector.setHost( "localhost" );
[ERROR] <https://analysis.apache.org/jenkins/job/maven-wagon/org.apache.maven.wagon$wagon-tck-http/ws/src/main/java/org/apache/maven/wagon/tck/http/fixture/ServerFixture.java>:[179,20] operator != cannot be applied to org.mortbay.jetty.Server,<nulltype>
[ERROR] <https://analysis.apache.org/jenkins/job/maven-wagon/org.apache.maven.wagon$wagon-tck-http/ws/src/main/java/org/apache/maven/wagon/tck/http/fixture/ServerFixture.java>:[181,18] cannot find symbol
symbol : method stop()
location: class org.mortbay.jetty.Server
[ERROR] <https://analysis.apache.org/jenkins/job/maven-wagon/org.apache.maven.wagon$wagon-tck-http/ws/src/main/java/org/apache/maven/wagon/tck/http/fixture/ServerFixture.java>:[188,19] cannot find symbol
symbol : method isStarted()
location: class org.mortbay.jetty.Server
[ERROR] <https://analysis.apache.org/jenkins/job/maven-wagon/org.apache.maven.wagon$wagon-tck-http/ws/src/main/java/org/apache/maven/wagon/tck/http/fixture/ServerFixture.java>:[188,41] cannot find symbol
symbol : method isRunning()
location: class org.mortbay.jetty.Server
[ERROR] <https://analysis.apache.org/jenkins/job/maven-wagon/org.apache.maven.wagon$wagon-tck-http/ws/src/main/java/org/apache/maven/wagon/tck/http/fixture/ServerFixture.java>:[192,14] cannot find symbol
symbol : method start()
location: class org.mortbay.jetty.Server
[ERROR] <https://analysis.apache.org/jenkins/job/maven-wagon/org.apache.maven.wagon$wagon-tck-http/ws/src/main/java/org/apache/maven/wagon/tck/http/fixture/ServerFixture.java>:[195,43] cannot find symbol
symbol : method isStarted()
location: class org.mortbay.jetty.Server
[ERROR] <https://analysis.apache.org/jenkins/job/maven-wagon/org.apache.maven.wagon$wagon-tck-http/ws/src/main/java/org/apache/maven/wagon/tck/http/fixture/ServerFixture.java>:[197,18] cannot find symbol
symbol : method wait(int)
location: class org.mortbay.jetty.Server
[ERROR] <https://analysis.apache.org/jenkins/job/maven-wagon/org.apache.maven.wagon$wagon-tck-http/ws/src/main/java/org/apache/maven/wagon/tck/http/fixture/ServerFixture.java>:[201,20] cannot find symbol
symbol : method isStarted()
location: class org.mortbay.jetty.Server
[ERROR] <https://analysis.apache.org/jenkins/job/maven-wagon/org.apache.maven.wagon$wagon-tck-http/ws/src/main/java/org/apache/maven/wagon/tck/http/GetWagonTests.java>:[102,8] cannot find symbol
symbol : class Servlet
location: class org.apache.maven.wagon.tck.http.GetWagonTests
[ERROR] <https://analysis.apache.org/jenkins/job/maven-wagon/org.apache.maven.wagon$wagon-tck-http/ws/src/main/java/org/apache/maven/wagon/tck/http/GetWagonTests.java>:[123,16] cannot find symbol
symbol: class Servlet
Servlet servlet = new LatencyServlet( -1 );
[ERROR] <https://analysis.apache.org/jenkins/job/maven-wagon/org.apache.maven.wagon$wagon-tck-http/ws/src/main/java/org/apache/maven/wagon/tck/http/GetWagonTests.java>:[226,63] cannot find symbol
symbol : variable HttpServletResponse
location: class org.apache.maven.wagon.tck.http.GetWagonTests
[ERROR] <https://analysis.apache.org/jenkins/job/maven-wagon/org.apache.maven.wagon$wagon-tck-http/ws/src/main/java/org/apache/maven/wagon/tck/http/GetWagonTests.java>:[238,63] cannot find symbol
symbol : variable HttpServletResponse
location: class org.apache.maven.wagon.tck.http.GetWagonTests
[ERROR] <https://analysis.apache.org/jenkins/job/maven-wagon/org.apache.maven.wagon$wagon-tck-http/ws/src/main/java/org/apache/maven/wagon/tck/http/GetWagonTests.java>:[253,63] cannot find symbol
symbol : variable HttpServletResponse
location: class org.apache.maven.wagon.tck.http.GetWagonTests
[ERROR] <https://analysis.apache.org/jenkins/job/maven-wagon/org.apache.maven.wagon$wagon-tck-http/ws/src/main/java/org/apache/maven/wagon/tck/http/GetWagonTests.java>:[268,63] cannot find symbol
symbol : variable HttpServletResponse
location: class org.apache.maven.wagon.tck.http.GetWagonTests
[ERROR] <https://analysis.apache.org/jenkins/job/maven-wagon/org.apache.maven.wagon$wagon-tck-http/ws/src/main/java/org/apache/maven/wagon/tck/http/GetWagonTests.java>:[284,63] cannot find symbol
symbol : variable HttpServletResponse
location: class org.apache.maven.wagon.tck.http.GetWagonTests
[ERROR] <https://analysis.apache.org/jenkins/job/maven-wagon/org.apache.maven.wagon$wagon-tck-http/ws/src/main/java/org/apache/maven/wagon/tck/http/GetWagonTests.java>:[308,63] cannot find symbol
symbol : variable HttpServletResponse
location: class org.apache.maven.wagon.tck.http.GetWagonTests
[ERROR] <https://analysis.apache.org/jenkins/job/maven-wagon/org.apache.maven.wagon$wagon-tck-http/ws/src/main/java/org/apache/maven/wagon/tck/http/GetWagonTests.java>:[337,63] cannot find symbol
symbol : variable HttpServletResponse
location: class org.apache.maven.wagon.tck.http.GetWagonTests
[ERROR] <https://analysis.apache.org/jenkins/job/maven-wagon/org.apache.maven.wagon$wagon-tck-http/ws/src/main/java/org/apache/maven/wagon/tck/http/GetWagonTests.java>:[366,63] cannot find symbol
symbol : variable HttpServletResponse
location: class org.apache.maven.wagon.tck.http.GetWagonTests
[ERROR] <https://analysis.apache.org/jenkins/job/maven-wagon/org.apache.maven.wagon$wagon-tck-http/ws/src/main/java/org/apache/maven/wagon/tck/http/GetWagonTests.java>:[407,27] cannot find symbol
symbol : variable HttpServletResponse
location: class org.apache.maven.wagon.tck.http.GetWagonTests
[ERROR] <https://analysis.apache.org/jenkins/job/maven-wagon/org.apache.maven.wagon$wagon-tck-http/ws/src/main/java/org/apache/maven/wagon/tck/http/GetWagonTests.java>:[415,27] cannot find symbol
symbol : variable HttpServletResponse
location: class org.apache.maven.wagon.tck.http.GetWagonTests
[ERROR] <https://analysis.apache.org/jenkins/job/maven-wagon/org.apache.maven.wagon$wagon-tck-http/ws/src/main/java/org/apache/maven/wagon/tck/http/GetWagonTests.java>:[430,61] cannot find symbol
symbol : variable HttpServletResponse
location: class org.apache.maven.wagon.tck.http.GetWagonTests
[ERROR] <https://analysis.apache.org/jenkins/job/maven-wagon/org.apache.maven.wagon$wagon-tck-http/ws/src/main/java/org/apache/maven/wagon/tck/http/GetWagonTests.java>:[536,21] cannot find symbol
symbol : variable HttpServletResponse
location: class org.apache.maven.wagon.tck.http.GetWagonTests
[INFO] 100 errors
[INFO] -------------------------------------------------------------
[JENKINS] Archiving disabled
Jenkins build is back to normal : maven-wagon » Apache Maven Wagon :: HTTP Test Compatibility Kit #149
Posted by gm...@apache.org.
See <https://analysis.apache.org/jenkins/job/maven-wagon/org.apache.maven.wagon$wagon-tck-http/149/>
Build failed in Jenkins: maven-wagon » Apache Maven Wagon :: HTTP Test Compatibility Kit #148
Posted by gm...@apache.org.
See <https://analysis.apache.org/jenkins/job/maven-wagon/org.apache.maven.wagon$wagon-tck-http/148/changes>
Changes:
[jenkins] [maven-release-plugin] prepare release wagon-2.10
[jenkins] [maven-release-plugin] prepare for next development iteration
------------------------------------------
[...truncated 35 lines...]
[INFO] Using 'UTF-8' encoding to copy filtered resources.
[INFO] Copying 3 resources
[INFO] Copying 3 resources
[INFO]
[INFO] --- maven-compiler-plugin:3.1:compile (default-compile) @ wagon-tck-http ---
[INFO] Changes detected - recompiling the module!
[INFO] Compiling 15 source files to <https://analysis.apache.org/jenkins/job/maven-wagon/org.apache.maven.wagon$wagon-tck-http/ws/target/classes>
[INFO] -------------------------------------------------------------
[ERROR] COMPILATION ERROR :
[INFO] -------------------------------------------------------------
[ERROR] <https://analysis.apache.org/jenkins/job/maven-wagon/org.apache.maven.wagon$wagon-tck-http/ws/src/main/java/org/apache/maven/wagon/tck/http/fixture/RedirectionServlet.java>:[22,20] package javax.servlet does not exist
[ERROR] <https://analysis.apache.org/jenkins/job/maven-wagon/org.apache.maven.wagon$wagon-tck-http/ws/src/main/java/org/apache/maven/wagon/tck/http/fixture/RedirectionServlet.java>:[23,25] package javax.servlet.http does not exist
[ERROR] <https://analysis.apache.org/jenkins/job/maven-wagon/org.apache.maven.wagon$wagon-tck-http/ws/src/main/java/org/apache/maven/wagon/tck/http/fixture/RedirectionServlet.java>:[24,25] package javax.servlet.http does not exist
[ERROR] <https://analysis.apache.org/jenkins/job/maven-wagon/org.apache.maven.wagon$wagon-tck-http/ws/src/main/java/org/apache/maven/wagon/tck/http/fixture/RedirectionServlet.java>:[25,25] package javax.servlet.http does not exist
[ERROR] <https://analysis.apache.org/jenkins/job/maven-wagon/org.apache.maven.wagon$wagon-tck-http/ws/src/main/java/org/apache/maven/wagon/tck/http/fixture/RedirectionServlet.java>:[32,12] cannot find symbol
symbol: class HttpServlet
extends HttpServlet
[ERROR] <https://analysis.apache.org/jenkins/job/maven-wagon/org.apache.maven.wagon$wagon-tck-http/ws/src/main/java/org/apache/maven/wagon/tck/http/fixture/RedirectionServlet.java>:[69,34] cannot find symbol
symbol : class HttpServletRequest
location: class org.apache.maven.wagon.tck.http.fixture.RedirectionServlet
[ERROR] <https://analysis.apache.org/jenkins/job/maven-wagon/org.apache.maven.wagon$wagon-tck-http/ws/src/main/java/org/apache/maven/wagon/tck/http/fixture/RedirectionServlet.java>:[69,64] cannot find symbol
symbol : class HttpServletResponse
location: class org.apache.maven.wagon.tck.http.fixture.RedirectionServlet
[ERROR] <https://analysis.apache.org/jenkins/job/maven-wagon/org.apache.maven.wagon$wagon-tck-http/ws/src/main/java/org/apache/maven/wagon/tck/http/fixture/RedirectionServlet.java>:[70,15] cannot find symbol
symbol : class ServletException
location: class org.apache.maven.wagon.tck.http.fixture.RedirectionServlet
[ERROR] <https://analysis.apache.org/jenkins/job/maven-wagon/org.apache.maven.wagon$wagon-tck-http/ws/src/main/java/org/apache/maven/wagon/tck/http/fixture/ErrorCodeServlet.java>:[24,20] package javax.servlet does not exist
[ERROR] <https://analysis.apache.org/jenkins/job/maven-wagon/org.apache.maven.wagon$wagon-tck-http/ws/src/main/java/org/apache/maven/wagon/tck/http/fixture/ErrorCodeServlet.java>:[25,25] package javax.servlet.http does not exist
[ERROR] <https://analysis.apache.org/jenkins/job/maven-wagon/org.apache.maven.wagon$wagon-tck-http/ws/src/main/java/org/apache/maven/wagon/tck/http/fixture/ErrorCodeServlet.java>:[26,25] package javax.servlet.http does not exist
[ERROR] <https://analysis.apache.org/jenkins/job/maven-wagon/org.apache.maven.wagon$wagon-tck-http/ws/src/main/java/org/apache/maven/wagon/tck/http/fixture/ErrorCodeServlet.java>:[27,25] package javax.servlet.http does not exist
[ERROR] <https://analysis.apache.org/jenkins/job/maven-wagon/org.apache.maven.wagon$wagon-tck-http/ws/src/main/java/org/apache/maven/wagon/tck/http/fixture/ErrorCodeServlet.java>:[33,12] cannot find symbol
symbol: class HttpServlet
extends HttpServlet
[ERROR] <https://analysis.apache.org/jenkins/job/maven-wagon/org.apache.maven.wagon$wagon-tck-http/ws/src/main/java/org/apache/maven/wagon/tck/http/fixture/ErrorCodeServlet.java>:[49,34] cannot find symbol
symbol : class HttpServletRequest
location: class org.apache.maven.wagon.tck.http.fixture.ErrorCodeServlet
[ERROR] <https://analysis.apache.org/jenkins/job/maven-wagon/org.apache.maven.wagon$wagon-tck-http/ws/src/main/java/org/apache/maven/wagon/tck/http/fixture/ErrorCodeServlet.java>:[49,64] cannot find symbol
symbol : class HttpServletResponse
location: class org.apache.maven.wagon.tck.http.fixture.ErrorCodeServlet
[ERROR] <https://analysis.apache.org/jenkins/job/maven-wagon/org.apache.maven.wagon$wagon-tck-http/ws/src/main/java/org/apache/maven/wagon/tck/http/fixture/ErrorCodeServlet.java>:[50,15] cannot find symbol
symbol : class ServletException
location: class org.apache.maven.wagon.tck.http.fixture.ErrorCodeServlet
[ERROR] <https://analysis.apache.org/jenkins/job/maven-wagon/org.apache.maven.wagon$wagon-tck-http/ws/src/main/java/org/apache/maven/wagon/tck/http/fixture/ProxyAuthenticationFilter.java>:[26,20] package javax.servlet does not exist
[ERROR] <https://analysis.apache.org/jenkins/job/maven-wagon/org.apache.maven.wagon$wagon-tck-http/ws/src/main/java/org/apache/maven/wagon/tck/http/fixture/ProxyAuthenticationFilter.java>:[27,20] package javax.servlet does not exist
[ERROR] <https://analysis.apache.org/jenkins/job/maven-wagon/org.apache.maven.wagon$wagon-tck-http/ws/src/main/java/org/apache/maven/wagon/tck/http/fixture/ProxyAuthenticationFilter.java>:[28,20] package javax.servlet does not exist
[ERROR] <https://analysis.apache.org/jenkins/job/maven-wagon/org.apache.maven.wagon$wagon-tck-http/ws/src/main/java/org/apache/maven/wagon/tck/http/fixture/ProxyAuthenticationFilter.java>:[29,20] package javax.servlet does not exist
[ERROR] <https://analysis.apache.org/jenkins/job/maven-wagon/org.apache.maven.wagon$wagon-tck-http/ws/src/main/java/org/apache/maven/wagon/tck/http/fixture/ProxyAuthenticationFilter.java>:[30,20] package javax.servlet does not exist
[ERROR] <https://analysis.apache.org/jenkins/job/maven-wagon/org.apache.maven.wagon$wagon-tck-http/ws/src/main/java/org/apache/maven/wagon/tck/http/fixture/ProxyAuthenticationFilter.java>:[31,20] package javax.servlet does not exist
[ERROR] <https://analysis.apache.org/jenkins/job/maven-wagon/org.apache.maven.wagon$wagon-tck-http/ws/src/main/java/org/apache/maven/wagon/tck/http/fixture/ProxyAuthenticationFilter.java>:[32,25] package javax.servlet.http does not exist
[ERROR] <https://analysis.apache.org/jenkins/job/maven-wagon/org.apache.maven.wagon$wagon-tck-http/ws/src/main/java/org/apache/maven/wagon/tck/http/fixture/ProxyAuthenticationFilter.java>:[33,25] package javax.servlet.http does not exist
[ERROR] <https://analysis.apache.org/jenkins/job/maven-wagon/org.apache.maven.wagon$wagon-tck-http/ws/src/main/java/org/apache/maven/wagon/tck/http/fixture/ProxyAuthenticationFilter.java>:[39,15] cannot find symbol
symbol: class Filter
implements Filter
[ERROR] <https://analysis.apache.org/jenkins/job/maven-wagon/org.apache.maven.wagon$wagon-tck-http/ws/src/main/java/org/apache/maven/wagon/tck/http/fixture/ProxyAuthenticationFilter.java>:[56,32] cannot find symbol
symbol : class ServletRequest
location: class org.apache.maven.wagon.tck.http.fixture.ProxyAuthenticationFilter
[ERROR] <https://analysis.apache.org/jenkins/job/maven-wagon/org.apache.maven.wagon$wagon-tck-http/ws/src/main/java/org/apache/maven/wagon/tck/http/fixture/ProxyAuthenticationFilter.java>:[56,58] cannot find symbol
symbol : class ServletResponse
location: class org.apache.maven.wagon.tck.http.fixture.ProxyAuthenticationFilter
[ERROR] <https://analysis.apache.org/jenkins/job/maven-wagon/org.apache.maven.wagon$wagon-tck-http/ws/src/main/java/org/apache/maven/wagon/tck/http/fixture/ProxyAuthenticationFilter.java>:[56,86] cannot find symbol
symbol : class FilterChain
location: class org.apache.maven.wagon.tck.http.fixture.ProxyAuthenticationFilter
[ERROR] <https://analysis.apache.org/jenkins/job/maven-wagon/org.apache.maven.wagon$wagon-tck-http/ws/src/main/java/org/apache/maven/wagon/tck/http/fixture/ProxyAuthenticationFilter.java>:[57,28] cannot find symbol
symbol : class ServletException
location: class org.apache.maven.wagon.tck.http.fixture.ProxyAuthenticationFilter
[ERROR] <https://analysis.apache.org/jenkins/job/maven-wagon/org.apache.maven.wagon$wagon-tck-http/ws/src/main/java/org/apache/maven/wagon/tck/http/fixture/ProxyAuthenticationFilter.java>:[84,28] cannot find symbol
symbol : class FilterConfig
location: class org.apache.maven.wagon.tck.http.fixture.ProxyAuthenticationFilter
[ERROR] <https://analysis.apache.org/jenkins/job/maven-wagon/org.apache.maven.wagon$wagon-tck-http/ws/src/main/java/org/apache/maven/wagon/tck/http/fixture/ProxyAuthenticationFilter.java>:[85,15] cannot find symbol
symbol : class ServletException
location: class org.apache.maven.wagon.tck.http.fixture.ProxyAuthenticationFilter
[ERROR] <https://analysis.apache.org/jenkins/job/maven-wagon/org.apache.maven.wagon$wagon-tck-http/ws/src/main/java/org/apache/maven/wagon/tck/http/fixture/ServerFixture.java>:[41,20] package javax.servlet does not exist
[ERROR] <https://analysis.apache.org/jenkins/job/maven-wagon/org.apache.maven.wagon$wagon-tck-http/ws/src/main/java/org/apache/maven/wagon/tck/http/fixture/ServerFixture.java>:[42,20] package javax.servlet does not exist
[ERROR] <https://analysis.apache.org/jenkins/job/maven-wagon/org.apache.maven.wagon$wagon-tck-http/ws/src/main/java/org/apache/maven/wagon/tck/http/fixture/ServerFixture.java>:[141,56] cannot find symbol
symbol : class Filter
location: class org.apache.maven.wagon.tck.http.fixture.ServerFixture
[ERROR] <https://analysis.apache.org/jenkins/job/maven-wagon/org.apache.maven.wagon$wagon-tck-http/ws/src/main/java/org/apache/maven/wagon/tck/http/fixture/ServerFixture.java>:[155,57] cannot find symbol
symbol : class Servlet
location: class org.apache.maven.wagon.tck.http.fixture.ServerFixture
[ERROR] <https://analysis.apache.org/jenkins/job/maven-wagon/org.apache.maven.wagon$wagon-tck-http/ws/src/main/java/org/apache/maven/wagon/tck/http/GetWagonTests.java>:[42,25] package javax.servlet.http does not exist
[ERROR] <https://analysis.apache.org/jenkins/job/maven-wagon/org.apache.maven.wagon$wagon-tck-http/ws/src/main/java/org/apache/maven/wagon/tck/http/fixture/ProxyConnectionVerifierFilter.java>:[27,20] package javax.servlet does not exist
[ERROR] <https://analysis.apache.org/jenkins/job/maven-wagon/org.apache.maven.wagon$wagon-tck-http/ws/src/main/java/org/apache/maven/wagon/tck/http/fixture/ProxyConnectionVerifierFilter.java>:[28,20] package javax.servlet does not exist
[ERROR] <https://analysis.apache.org/jenkins/job/maven-wagon/org.apache.maven.wagon$wagon-tck-http/ws/src/main/java/org/apache/maven/wagon/tck/http/fixture/ProxyConnectionVerifierFilter.java>:[29,20] package javax.servlet does not exist
[ERROR] <https://analysis.apache.org/jenkins/job/maven-wagon/org.apache.maven.wagon$wagon-tck-http/ws/src/main/java/org/apache/maven/wagon/tck/http/fixture/ProxyConnectionVerifierFilter.java>:[30,20] package javax.servlet does not exist
[ERROR] <https://analysis.apache.org/jenkins/job/maven-wagon/org.apache.maven.wagon$wagon-tck-http/ws/src/main/java/org/apache/maven/wagon/tck/http/fixture/ProxyConnectionVerifierFilter.java>:[31,20] package javax.servlet does not exist
[ERROR] <https://analysis.apache.org/jenkins/job/maven-wagon/org.apache.maven.wagon$wagon-tck-http/ws/src/main/java/org/apache/maven/wagon/tck/http/fixture/ProxyConnectionVerifierFilter.java>:[32,25] package javax.servlet.http does not exist
[ERROR] <https://analysis.apache.org/jenkins/job/maven-wagon/org.apache.maven.wagon$wagon-tck-http/ws/src/main/java/org/apache/maven/wagon/tck/http/fixture/ProxyConnectionVerifierFilter.java>:[40,15] cannot find symbol
symbol: class Filter
implements Filter
[ERROR] <https://analysis.apache.org/jenkins/job/maven-wagon/org.apache.maven.wagon$wagon-tck-http/ws/src/main/java/org/apache/maven/wagon/tck/http/fixture/ProxyConnectionVerifierFilter.java>:[49,32] cannot find symbol
symbol : class ServletRequest
location: class org.apache.maven.wagon.tck.http.fixture.ProxyConnectionVerifierFilter
[ERROR] <https://analysis.apache.org/jenkins/job/maven-wagon/org.apache.maven.wagon$wagon-tck-http/ws/src/main/java/org/apache/maven/wagon/tck/http/fixture/ProxyConnectionVerifierFilter.java>:[49,58] cannot find symbol
symbol : class ServletResponse
location: class org.apache.maven.wagon.tck.http.fixture.ProxyConnectionVerifierFilter
[ERROR] <https://analysis.apache.org/jenkins/job/maven-wagon/org.apache.maven.wagon$wagon-tck-http/ws/src/main/java/org/apache/maven/wagon/tck/http/fixture/ProxyConnectionVerifierFilter.java>:[49,86] cannot find symbol
symbol : class FilterChain
location: class org.apache.maven.wagon.tck.http.fixture.ProxyConnectionVerifierFilter
[ERROR] <https://analysis.apache.org/jenkins/job/maven-wagon/org.apache.maven.wagon$wagon-tck-http/ws/src/main/java/org/apache/maven/wagon/tck/http/fixture/ProxyConnectionVerifierFilter.java>:[50,28] cannot find symbol
symbol : class ServletException
location: class org.apache.maven.wagon.tck.http.fixture.ProxyConnectionVerifierFilter
[ERROR] <https://analysis.apache.org/jenkins/job/maven-wagon/org.apache.maven.wagon$wagon-tck-http/ws/src/main/java/org/apache/maven/wagon/tck/http/fixture/ProxyConnectionVerifierFilter.java>:[76,28] cannot find symbol
symbol : class FilterConfig
location: class org.apache.maven.wagon.tck.http.fixture.ProxyConnectionVerifierFilter
[ERROR] <https://analysis.apache.org/jenkins/job/maven-wagon/org.apache.maven.wagon$wagon-tck-http/ws/src/main/java/org/apache/maven/wagon/tck/http/fixture/ProxyConnectionVerifierFilter.java>:[77,15] cannot find symbol
symbol : class ServletException
location: class org.apache.maven.wagon.tck.http.fixture.ProxyConnectionVerifierFilter
[ERROR] <https://analysis.apache.org/jenkins/job/maven-wagon/org.apache.maven.wagon$wagon-tck-http/ws/src/main/java/org/apache/maven/wagon/tck/http/fixture/LatencyServlet.java>:[28,25] package javax.servlet.http does not exist
[ERROR] <https://analysis.apache.org/jenkins/job/maven-wagon/org.apache.maven.wagon$wagon-tck-http/ws/src/main/java/org/apache/maven/wagon/tck/http/fixture/LatencyServlet.java>:[39,12] cannot find symbol
symbol: class HttpServlet
extends HttpServlet
[ERROR] <https://analysis.apache.org/jenkins/job/maven-wagon/org.apache.maven.wagon$wagon-tck-http/ws/src/main/java/org/apache/maven/wagon/tck/http/fixture/LatencyServlet.java>:[55,32] cannot find symbol
symbol : class HttpServletRequest
location: class org.apache.maven.wagon.tck.http.fixture.LatencyServlet
[ERROR] <https://analysis.apache.org/jenkins/job/maven-wagon/org.apache.maven.wagon$wagon-tck-http/ws/src/main/java/org/apache/maven/wagon/tck/http/fixture/LatencyServlet.java>:[55,62] cannot find symbol
symbol : class HttpServletResponse
location: class org.apache.maven.wagon.tck.http.fixture.LatencyServlet
[ERROR] <https://analysis.apache.org/jenkins/job/maven-wagon/org.apache.maven.wagon$wagon-tck-http/ws/src/main/java/org/apache/maven/wagon/tck/http/fixture/LatencyServlet.java>:[56,15] cannot find symbol
symbol : class ServletException
location: class org.apache.maven.wagon.tck.http.fixture.LatencyServlet
[ERROR] <https://analysis.apache.org/jenkins/job/maven-wagon/org.apache.maven.wagon$wagon-tck-http/ws/src/main/java/org/apache/maven/wagon/tck/http/fixture/AuthSnoopFilter.java>:[25,20] package javax.servlet does not exist
[ERROR] <https://analysis.apache.org/jenkins/job/maven-wagon/org.apache.maven.wagon$wagon-tck-http/ws/src/main/java/org/apache/maven/wagon/tck/http/fixture/AuthSnoopFilter.java>:[26,20] package javax.servlet does not exist
[ERROR] <https://analysis.apache.org/jenkins/job/maven-wagon/org.apache.maven.wagon$wagon-tck-http/ws/src/main/java/org/apache/maven/wagon/tck/http/fixture/AuthSnoopFilter.java>:[39,15] cannot find symbol
symbol: class Filter
implements Filter
[ERROR] <https://analysis.apache.org/jenkins/job/maven-wagon/org.apache.maven.wagon$wagon-tck-http/ws/src/main/java/org/apache/maven/wagon/tck/http/fixture/AuthSnoopFilter.java>:[47,32] cannot find symbol
symbol : class ServletRequest
location: class org.apache.maven.wagon.tck.http.fixture.AuthSnoopFilter
[ERROR] <https://analysis.apache.org/jenkins/job/maven-wagon/org.apache.maven.wagon$wagon-tck-http/ws/src/main/java/org/apache/maven/wagon/tck/http/fixture/AuthSnoopFilter.java>:[47,58] cannot find symbol
symbol : class ServletResponse
location: class org.apache.maven.wagon.tck.http.fixture.AuthSnoopFilter
[ERROR] <https://analysis.apache.org/jenkins/job/maven-wagon/org.apache.maven.wagon$wagon-tck-http/ws/src/main/java/org/apache/maven/wagon/tck/http/fixture/AuthSnoopFilter.java>:[47,90] cannot find symbol
symbol : class FilterChain
location: class org.apache.maven.wagon.tck.http.fixture.AuthSnoopFilter
[ERROR] <https://analysis.apache.org/jenkins/job/maven-wagon/org.apache.maven.wagon$wagon-tck-http/ws/src/main/java/org/apache/maven/wagon/tck/http/fixture/AuthSnoopFilter.java>:[48,28] cannot find symbol
symbol : class ServletException
location: class org.apache.maven.wagon.tck.http.fixture.AuthSnoopFilter
[ERROR] <https://analysis.apache.org/jenkins/job/maven-wagon/org.apache.maven.wagon$wagon-tck-http/ws/src/main/java/org/apache/maven/wagon/tck/http/fixture/AuthSnoopFilter.java>:[65,28] cannot find symbol
symbol : class FilterConfig
location: class org.apache.maven.wagon.tck.http.fixture.AuthSnoopFilter
[ERROR] <https://analysis.apache.org/jenkins/job/maven-wagon/org.apache.maven.wagon$wagon-tck-http/ws/src/main/java/org/apache/maven/wagon/tck/http/fixture/AuthSnoopFilter.java>:[66,15] cannot find symbol
symbol : class ServletException
location: class org.apache.maven.wagon.tck.http.fixture.AuthSnoopFilter
[ERROR] <https://analysis.apache.org/jenkins/job/maven-wagon/org.apache.maven.wagon$wagon-tck-http/ws/src/main/java/org/apache/maven/wagon/tck/http/fixture/ServletExceptionServlet.java>:[25,25] package javax.servlet.http does not exist
[ERROR] <https://analysis.apache.org/jenkins/job/maven-wagon/org.apache.maven.wagon$wagon-tck-http/ws/src/main/java/org/apache/maven/wagon/tck/http/fixture/ServletExceptionServlet.java>:[33,12] cannot find symbol
symbol: class HttpServlet
extends HttpServlet
[ERROR] <https://analysis.apache.org/jenkins/job/maven-wagon/org.apache.maven.wagon$wagon-tck-http/ws/src/main/java/org/apache/maven/wagon/tck/http/fixture/ServletExceptionServlet.java>:[46,34] cannot find symbol
symbol : class HttpServletRequest
location: class org.apache.maven.wagon.tck.http.fixture.ServletExceptionServlet
[ERROR] <https://analysis.apache.org/jenkins/job/maven-wagon/org.apache.maven.wagon$wagon-tck-http/ws/src/main/java/org/apache/maven/wagon/tck/http/fixture/ServletExceptionServlet.java>:[46,68] cannot find symbol
symbol : class HttpServletResponse
location: class org.apache.maven.wagon.tck.http.fixture.ServletExceptionServlet
[ERROR] <https://analysis.apache.org/jenkins/job/maven-wagon/org.apache.maven.wagon$wagon-tck-http/ws/src/main/java/org/apache/maven/wagon/tck/http/fixture/ServletExceptionServlet.java>:[47,15] cannot find symbol
symbol : class ServletException
location: class org.apache.maven.wagon.tck.http.fixture.ServletExceptionServlet
[ERROR] <https://analysis.apache.org/jenkins/job/maven-wagon/org.apache.maven.wagon$wagon-tck-http/ws/src/main/java/org/apache/maven/wagon/tck/http/fixture/RedirectionServlet.java>:[68,4] method does not override or implement a method from a supertype
[ERROR] <https://analysis.apache.org/jenkins/job/maven-wagon/org.apache.maven.wagon$wagon-tck-http/ws/src/main/java/org/apache/maven/wagon/tck/http/fixture/ErrorCodeServlet.java>:[48,4] method does not override or implement a method from a supertype
[ERROR] <https://analysis.apache.org/jenkins/job/maven-wagon/org.apache.maven.wagon$wagon-tck-http/ws/src/main/java/org/apache/maven/wagon/tck/http/fixture/ProxyAuthenticationFilter.java>:[59,8] cannot find symbol
symbol : class HttpServletRequest
location: class org.apache.maven.wagon.tck.http.fixture.ProxyAuthenticationFilter
[ERROR] <https://analysis.apache.org/jenkins/job/maven-wagon/org.apache.maven.wagon$wagon-tck-http/ws/src/main/java/org/apache/maven/wagon/tck/http/fixture/ProxyAuthenticationFilter.java>:[59,38] cannot find symbol
symbol : class HttpServletRequest
location: class org.apache.maven.wagon.tck.http.fixture.ProxyAuthenticationFilter
[ERROR] <https://analysis.apache.org/jenkins/job/maven-wagon/org.apache.maven.wagon$wagon-tck-http/ws/src/main/java/org/apache/maven/wagon/tck/http/fixture/ProxyAuthenticationFilter.java>:[60,8] cannot find symbol
symbol : class HttpServletResponse
location: class org.apache.maven.wagon.tck.http.fixture.ProxyAuthenticationFilter
[ERROR] <https://analysis.apache.org/jenkins/job/maven-wagon/org.apache.maven.wagon$wagon-tck-http/ws/src/main/java/org/apache/maven/wagon/tck/http/fixture/ProxyAuthenticationFilter.java>:[60,40] cannot find symbol
symbol : class HttpServletResponse
location: class org.apache.maven.wagon.tck.http.fixture.ProxyAuthenticationFilter
[ERROR] <https://analysis.apache.org/jenkins/job/maven-wagon/org.apache.maven.wagon$wagon-tck-http/ws/src/main/java/org/apache/maven/wagon/tck/http/fixture/ProxyAuthenticationFilter.java>:[65,32] cannot find symbol
symbol : variable HttpServletResponse
location: class org.apache.maven.wagon.tck.http.fixture.ProxyAuthenticationFilter
[ERROR] <https://analysis.apache.org/jenkins/job/maven-wagon/org.apache.maven.wagon$wagon-tck-http/ws/src/main/java/org/apache/maven/wagon/tck/http/fixture/ProxyAuthenticationFilter.java>:[77,36] cannot find symbol
symbol : variable HttpServletResponse
location: class org.apache.maven.wagon.tck.http.fixture.ProxyAuthenticationFilter
[ERROR] <https://analysis.apache.org/jenkins/job/maven-wagon/org.apache.maven.wagon$wagon-tck-http/ws/src/main/java/org/apache/maven/wagon/tck/http/fixture/ServerFixture.java>:[81,17] cannot access org.mortbay.component.AbstractLifeCycle
class file for org.mortbay.component.AbstractLifeCycle not found
server = new Server();
[ERROR] <https://analysis.apache.org/jenkins/job/maven-wagon/org.apache.maven.wagon$wagon-tck-http/ws/src/main/java/org/apache/maven/wagon/tck/http/fixture/ServerFixture.java>:[102,21] cannot access org.mortbay.component.LifeCycle
class file for org.mortbay.component.LifeCycle not found
connector.setHost( "localhost" );
[ERROR] <https://analysis.apache.org/jenkins/job/maven-wagon/org.apache.maven.wagon$wagon-tck-http/ws/src/main/java/org/apache/maven/wagon/tck/http/fixture/ServerFixture.java>:[179,20] operator != cannot be applied to org.mortbay.jetty.Server,<nulltype>
[ERROR] <https://analysis.apache.org/jenkins/job/maven-wagon/org.apache.maven.wagon$wagon-tck-http/ws/src/main/java/org/apache/maven/wagon/tck/http/fixture/ServerFixture.java>:[181,18] cannot find symbol
symbol : method stop()
location: class org.mortbay.jetty.Server
[ERROR] <https://analysis.apache.org/jenkins/job/maven-wagon/org.apache.maven.wagon$wagon-tck-http/ws/src/main/java/org/apache/maven/wagon/tck/http/fixture/ServerFixture.java>:[188,19] cannot find symbol
symbol : method isStarted()
location: class org.mortbay.jetty.Server
[ERROR] <https://analysis.apache.org/jenkins/job/maven-wagon/org.apache.maven.wagon$wagon-tck-http/ws/src/main/java/org/apache/maven/wagon/tck/http/fixture/ServerFixture.java>:[188,41] cannot find symbol
symbol : method isRunning()
location: class org.mortbay.jetty.Server
[ERROR] <https://analysis.apache.org/jenkins/job/maven-wagon/org.apache.maven.wagon$wagon-tck-http/ws/src/main/java/org/apache/maven/wagon/tck/http/fixture/ServerFixture.java>:[192,14] cannot find symbol
symbol : method start()
location: class org.mortbay.jetty.Server
[ERROR] <https://analysis.apache.org/jenkins/job/maven-wagon/org.apache.maven.wagon$wagon-tck-http/ws/src/main/java/org/apache/maven/wagon/tck/http/fixture/ServerFixture.java>:[195,43] cannot find symbol
symbol : method isStarted()
location: class org.mortbay.jetty.Server
[ERROR] <https://analysis.apache.org/jenkins/job/maven-wagon/org.apache.maven.wagon$wagon-tck-http/ws/src/main/java/org/apache/maven/wagon/tck/http/fixture/ServerFixture.java>:[197,18] cannot find symbol
symbol : method wait(int)
location: class org.mortbay.jetty.Server
[ERROR] <https://analysis.apache.org/jenkins/job/maven-wagon/org.apache.maven.wagon$wagon-tck-http/ws/src/main/java/org/apache/maven/wagon/tck/http/fixture/ServerFixture.java>:[201,20] cannot find symbol
symbol : method isStarted()
location: class org.mortbay.jetty.Server
[ERROR] <https://analysis.apache.org/jenkins/job/maven-wagon/org.apache.maven.wagon$wagon-tck-http/ws/src/main/java/org/apache/maven/wagon/tck/http/GetWagonTests.java>:[102,8] cannot find symbol
symbol : class Servlet
location: class org.apache.maven.wagon.tck.http.GetWagonTests
[ERROR] <https://analysis.apache.org/jenkins/job/maven-wagon/org.apache.maven.wagon$wagon-tck-http/ws/src/main/java/org/apache/maven/wagon/tck/http/GetWagonTests.java>:[123,16] cannot find symbol
symbol: class Servlet
Servlet servlet = new LatencyServlet( -1 );
[ERROR] <https://analysis.apache.org/jenkins/job/maven-wagon/org.apache.maven.wagon$wagon-tck-http/ws/src/main/java/org/apache/maven/wagon/tck/http/GetWagonTests.java>:[226,63] cannot find symbol
symbol : variable HttpServletResponse
location: class org.apache.maven.wagon.tck.http.GetWagonTests
[ERROR] <https://analysis.apache.org/jenkins/job/maven-wagon/org.apache.maven.wagon$wagon-tck-http/ws/src/main/java/org/apache/maven/wagon/tck/http/GetWagonTests.java>:[238,63] cannot find symbol
symbol : variable HttpServletResponse
location: class org.apache.maven.wagon.tck.http.GetWagonTests
[ERROR] <https://analysis.apache.org/jenkins/job/maven-wagon/org.apache.maven.wagon$wagon-tck-http/ws/src/main/java/org/apache/maven/wagon/tck/http/GetWagonTests.java>:[253,63] cannot find symbol
symbol : variable HttpServletResponse
location: class org.apache.maven.wagon.tck.http.GetWagonTests
[ERROR] <https://analysis.apache.org/jenkins/job/maven-wagon/org.apache.maven.wagon$wagon-tck-http/ws/src/main/java/org/apache/maven/wagon/tck/http/GetWagonTests.java>:[268,63] cannot find symbol
symbol : variable HttpServletResponse
location: class org.apache.maven.wagon.tck.http.GetWagonTests
[ERROR] <https://analysis.apache.org/jenkins/job/maven-wagon/org.apache.maven.wagon$wagon-tck-http/ws/src/main/java/org/apache/maven/wagon/tck/http/GetWagonTests.java>:[284,63] cannot find symbol
symbol : variable HttpServletResponse
location: class org.apache.maven.wagon.tck.http.GetWagonTests
[ERROR] <https://analysis.apache.org/jenkins/job/maven-wagon/org.apache.maven.wagon$wagon-tck-http/ws/src/main/java/org/apache/maven/wagon/tck/http/GetWagonTests.java>:[308,63] cannot find symbol
symbol : variable HttpServletResponse
location: class org.apache.maven.wagon.tck.http.GetWagonTests
[ERROR] <https://analysis.apache.org/jenkins/job/maven-wagon/org.apache.maven.wagon$wagon-tck-http/ws/src/main/java/org/apache/maven/wagon/tck/http/GetWagonTests.java>:[337,63] cannot find symbol
symbol : variable HttpServletResponse
location: class org.apache.maven.wagon.tck.http.GetWagonTests
[ERROR] <https://analysis.apache.org/jenkins/job/maven-wagon/org.apache.maven.wagon$wagon-tck-http/ws/src/main/java/org/apache/maven/wagon/tck/http/GetWagonTests.java>:[366,63] cannot find symbol
symbol : variable HttpServletResponse
location: class org.apache.maven.wagon.tck.http.GetWagonTests
[ERROR] <https://analysis.apache.org/jenkins/job/maven-wagon/org.apache.maven.wagon$wagon-tck-http/ws/src/main/java/org/apache/maven/wagon/tck/http/GetWagonTests.java>:[407,27] cannot find symbol
symbol : variable HttpServletResponse
location: class org.apache.maven.wagon.tck.http.GetWagonTests
[ERROR] <https://analysis.apache.org/jenkins/job/maven-wagon/org.apache.maven.wagon$wagon-tck-http/ws/src/main/java/org/apache/maven/wagon/tck/http/GetWagonTests.java>:[415,27] cannot find symbol
symbol : variable HttpServletResponse
location: class org.apache.maven.wagon.tck.http.GetWagonTests
[ERROR] <https://analysis.apache.org/jenkins/job/maven-wagon/org.apache.maven.wagon$wagon-tck-http/ws/src/main/java/org/apache/maven/wagon/tck/http/GetWagonTests.java>:[430,61] cannot find symbol
symbol : variable HttpServletResponse
location: class org.apache.maven.wagon.tck.http.GetWagonTests
[ERROR] <https://analysis.apache.org/jenkins/job/maven-wagon/org.apache.maven.wagon$wagon-tck-http/ws/src/main/java/org/apache/maven/wagon/tck/http/GetWagonTests.java>:[536,21] cannot find symbol
symbol : variable HttpServletResponse
location: class org.apache.maven.wagon.tck.http.GetWagonTests
[INFO] 100 errors
[INFO] -------------------------------------------------------------
[JENKINS] Archiving disabled
Build failed in Jenkins: maven-wagon » Apache Maven Wagon :: HTTP Test Compatibility Kit #147
Posted by gm...@apache.org.
See <https://analysis.apache.org/jenkins/job/maven-wagon/org.apache.maven.wagon$wagon-tck-http/147/>
------------------------------------------
[...truncated 35 lines...]
[INFO] Using 'UTF-8' encoding to copy filtered resources.
[INFO] Copying 3 resources
[INFO] Copying 3 resources
[INFO]
[INFO] --- maven-compiler-plugin:3.1:compile (default-compile) @ wagon-tck-http ---
[INFO] Changes detected - recompiling the module!
[INFO] Compiling 15 source files to <https://analysis.apache.org/jenkins/job/maven-wagon/org.apache.maven.wagon$wagon-tck-http/ws/target/classes>
[INFO] -------------------------------------------------------------
[ERROR] COMPILATION ERROR :
[INFO] -------------------------------------------------------------
[ERROR] <https://analysis.apache.org/jenkins/job/maven-wagon/org.apache.maven.wagon$wagon-tck-http/ws/src/main/java/org/apache/maven/wagon/tck/http/fixture/RedirectionServlet.java>:[22,20] package javax.servlet does not exist
[ERROR] <https://analysis.apache.org/jenkins/job/maven-wagon/org.apache.maven.wagon$wagon-tck-http/ws/src/main/java/org/apache/maven/wagon/tck/http/fixture/RedirectionServlet.java>:[23,25] package javax.servlet.http does not exist
[ERROR] <https://analysis.apache.org/jenkins/job/maven-wagon/org.apache.maven.wagon$wagon-tck-http/ws/src/main/java/org/apache/maven/wagon/tck/http/fixture/RedirectionServlet.java>:[24,25] package javax.servlet.http does not exist
[ERROR] <https://analysis.apache.org/jenkins/job/maven-wagon/org.apache.maven.wagon$wagon-tck-http/ws/src/main/java/org/apache/maven/wagon/tck/http/fixture/RedirectionServlet.java>:[25,25] package javax.servlet.http does not exist
[ERROR] <https://analysis.apache.org/jenkins/job/maven-wagon/org.apache.maven.wagon$wagon-tck-http/ws/src/main/java/org/apache/maven/wagon/tck/http/fixture/RedirectionServlet.java>:[32,12] cannot find symbol
symbol: class HttpServlet
extends HttpServlet
[ERROR] <https://analysis.apache.org/jenkins/job/maven-wagon/org.apache.maven.wagon$wagon-tck-http/ws/src/main/java/org/apache/maven/wagon/tck/http/fixture/RedirectionServlet.java>:[69,34] cannot find symbol
symbol : class HttpServletRequest
location: class org.apache.maven.wagon.tck.http.fixture.RedirectionServlet
[ERROR] <https://analysis.apache.org/jenkins/job/maven-wagon/org.apache.maven.wagon$wagon-tck-http/ws/src/main/java/org/apache/maven/wagon/tck/http/fixture/RedirectionServlet.java>:[69,64] cannot find symbol
symbol : class HttpServletResponse
location: class org.apache.maven.wagon.tck.http.fixture.RedirectionServlet
[ERROR] <https://analysis.apache.org/jenkins/job/maven-wagon/org.apache.maven.wagon$wagon-tck-http/ws/src/main/java/org/apache/maven/wagon/tck/http/fixture/RedirectionServlet.java>:[70,15] cannot find symbol
symbol : class ServletException
location: class org.apache.maven.wagon.tck.http.fixture.RedirectionServlet
[ERROR] <https://analysis.apache.org/jenkins/job/maven-wagon/org.apache.maven.wagon$wagon-tck-http/ws/src/main/java/org/apache/maven/wagon/tck/http/fixture/ErrorCodeServlet.java>:[24,20] package javax.servlet does not exist
[ERROR] <https://analysis.apache.org/jenkins/job/maven-wagon/org.apache.maven.wagon$wagon-tck-http/ws/src/main/java/org/apache/maven/wagon/tck/http/fixture/ErrorCodeServlet.java>:[25,25] package javax.servlet.http does not exist
[ERROR] <https://analysis.apache.org/jenkins/job/maven-wagon/org.apache.maven.wagon$wagon-tck-http/ws/src/main/java/org/apache/maven/wagon/tck/http/fixture/ErrorCodeServlet.java>:[26,25] package javax.servlet.http does not exist
[ERROR] <https://analysis.apache.org/jenkins/job/maven-wagon/org.apache.maven.wagon$wagon-tck-http/ws/src/main/java/org/apache/maven/wagon/tck/http/fixture/ErrorCodeServlet.java>:[27,25] package javax.servlet.http does not exist
[ERROR] <https://analysis.apache.org/jenkins/job/maven-wagon/org.apache.maven.wagon$wagon-tck-http/ws/src/main/java/org/apache/maven/wagon/tck/http/fixture/ErrorCodeServlet.java>:[33,12] cannot find symbol
symbol: class HttpServlet
extends HttpServlet
[ERROR] <https://analysis.apache.org/jenkins/job/maven-wagon/org.apache.maven.wagon$wagon-tck-http/ws/src/main/java/org/apache/maven/wagon/tck/http/fixture/ErrorCodeServlet.java>:[49,34] cannot find symbol
symbol : class HttpServletRequest
location: class org.apache.maven.wagon.tck.http.fixture.ErrorCodeServlet
[ERROR] <https://analysis.apache.org/jenkins/job/maven-wagon/org.apache.maven.wagon$wagon-tck-http/ws/src/main/java/org/apache/maven/wagon/tck/http/fixture/ErrorCodeServlet.java>:[49,64] cannot find symbol
symbol : class HttpServletResponse
location: class org.apache.maven.wagon.tck.http.fixture.ErrorCodeServlet
[ERROR] <https://analysis.apache.org/jenkins/job/maven-wagon/org.apache.maven.wagon$wagon-tck-http/ws/src/main/java/org/apache/maven/wagon/tck/http/fixture/ErrorCodeServlet.java>:[50,15] cannot find symbol
symbol : class ServletException
location: class org.apache.maven.wagon.tck.http.fixture.ErrorCodeServlet
[ERROR] <https://analysis.apache.org/jenkins/job/maven-wagon/org.apache.maven.wagon$wagon-tck-http/ws/src/main/java/org/apache/maven/wagon/tck/http/fixture/ProxyAuthenticationFilter.java>:[26,20] package javax.servlet does not exist
[ERROR] <https://analysis.apache.org/jenkins/job/maven-wagon/org.apache.maven.wagon$wagon-tck-http/ws/src/main/java/org/apache/maven/wagon/tck/http/fixture/ProxyAuthenticationFilter.java>:[27,20] package javax.servlet does not exist
[ERROR] <https://analysis.apache.org/jenkins/job/maven-wagon/org.apache.maven.wagon$wagon-tck-http/ws/src/main/java/org/apache/maven/wagon/tck/http/fixture/ProxyAuthenticationFilter.java>:[28,20] package javax.servlet does not exist
[ERROR] <https://analysis.apache.org/jenkins/job/maven-wagon/org.apache.maven.wagon$wagon-tck-http/ws/src/main/java/org/apache/maven/wagon/tck/http/fixture/ProxyAuthenticationFilter.java>:[29,20] package javax.servlet does not exist
[ERROR] <https://analysis.apache.org/jenkins/job/maven-wagon/org.apache.maven.wagon$wagon-tck-http/ws/src/main/java/org/apache/maven/wagon/tck/http/fixture/ProxyAuthenticationFilter.java>:[30,20] package javax.servlet does not exist
[ERROR] <https://analysis.apache.org/jenkins/job/maven-wagon/org.apache.maven.wagon$wagon-tck-http/ws/src/main/java/org/apache/maven/wagon/tck/http/fixture/ProxyAuthenticationFilter.java>:[31,20] package javax.servlet does not exist
[ERROR] <https://analysis.apache.org/jenkins/job/maven-wagon/org.apache.maven.wagon$wagon-tck-http/ws/src/main/java/org/apache/maven/wagon/tck/http/fixture/ProxyAuthenticationFilter.java>:[32,25] package javax.servlet.http does not exist
[ERROR] <https://analysis.apache.org/jenkins/job/maven-wagon/org.apache.maven.wagon$wagon-tck-http/ws/src/main/java/org/apache/maven/wagon/tck/http/fixture/ProxyAuthenticationFilter.java>:[33,25] package javax.servlet.http does not exist
[ERROR] <https://analysis.apache.org/jenkins/job/maven-wagon/org.apache.maven.wagon$wagon-tck-http/ws/src/main/java/org/apache/maven/wagon/tck/http/fixture/ProxyAuthenticationFilter.java>:[39,15] cannot find symbol
symbol: class Filter
implements Filter
[ERROR] <https://analysis.apache.org/jenkins/job/maven-wagon/org.apache.maven.wagon$wagon-tck-http/ws/src/main/java/org/apache/maven/wagon/tck/http/fixture/ProxyAuthenticationFilter.java>:[56,32] cannot find symbol
symbol : class ServletRequest
location: class org.apache.maven.wagon.tck.http.fixture.ProxyAuthenticationFilter
[ERROR] <https://analysis.apache.org/jenkins/job/maven-wagon/org.apache.maven.wagon$wagon-tck-http/ws/src/main/java/org/apache/maven/wagon/tck/http/fixture/ProxyAuthenticationFilter.java>:[56,58] cannot find symbol
symbol : class ServletResponse
location: class org.apache.maven.wagon.tck.http.fixture.ProxyAuthenticationFilter
[ERROR] <https://analysis.apache.org/jenkins/job/maven-wagon/org.apache.maven.wagon$wagon-tck-http/ws/src/main/java/org/apache/maven/wagon/tck/http/fixture/ProxyAuthenticationFilter.java>:[56,86] cannot find symbol
symbol : class FilterChain
location: class org.apache.maven.wagon.tck.http.fixture.ProxyAuthenticationFilter
[ERROR] <https://analysis.apache.org/jenkins/job/maven-wagon/org.apache.maven.wagon$wagon-tck-http/ws/src/main/java/org/apache/maven/wagon/tck/http/fixture/ProxyAuthenticationFilter.java>:[57,28] cannot find symbol
symbol : class ServletException
location: class org.apache.maven.wagon.tck.http.fixture.ProxyAuthenticationFilter
[ERROR] <https://analysis.apache.org/jenkins/job/maven-wagon/org.apache.maven.wagon$wagon-tck-http/ws/src/main/java/org/apache/maven/wagon/tck/http/fixture/ProxyAuthenticationFilter.java>:[84,28] cannot find symbol
symbol : class FilterConfig
location: class org.apache.maven.wagon.tck.http.fixture.ProxyAuthenticationFilter
[ERROR] <https://analysis.apache.org/jenkins/job/maven-wagon/org.apache.maven.wagon$wagon-tck-http/ws/src/main/java/org/apache/maven/wagon/tck/http/fixture/ProxyAuthenticationFilter.java>:[85,15] cannot find symbol
symbol : class ServletException
location: class org.apache.maven.wagon.tck.http.fixture.ProxyAuthenticationFilter
[ERROR] <https://analysis.apache.org/jenkins/job/maven-wagon/org.apache.maven.wagon$wagon-tck-http/ws/src/main/java/org/apache/maven/wagon/tck/http/fixture/ServerFixture.java>:[41,20] package javax.servlet does not exist
[ERROR] <https://analysis.apache.org/jenkins/job/maven-wagon/org.apache.maven.wagon$wagon-tck-http/ws/src/main/java/org/apache/maven/wagon/tck/http/fixture/ServerFixture.java>:[42,20] package javax.servlet does not exist
[ERROR] <https://analysis.apache.org/jenkins/job/maven-wagon/org.apache.maven.wagon$wagon-tck-http/ws/src/main/java/org/apache/maven/wagon/tck/http/fixture/ServerFixture.java>:[141,56] cannot find symbol
symbol : class Filter
location: class org.apache.maven.wagon.tck.http.fixture.ServerFixture
[ERROR] <https://analysis.apache.org/jenkins/job/maven-wagon/org.apache.maven.wagon$wagon-tck-http/ws/src/main/java/org/apache/maven/wagon/tck/http/fixture/ServerFixture.java>:[155,57] cannot find symbol
symbol : class Servlet
location: class org.apache.maven.wagon.tck.http.fixture.ServerFixture
[ERROR] <https://analysis.apache.org/jenkins/job/maven-wagon/org.apache.maven.wagon$wagon-tck-http/ws/src/main/java/org/apache/maven/wagon/tck/http/GetWagonTests.java>:[42,25] package javax.servlet.http does not exist
[ERROR] <https://analysis.apache.org/jenkins/job/maven-wagon/org.apache.maven.wagon$wagon-tck-http/ws/src/main/java/org/apache/maven/wagon/tck/http/fixture/ProxyConnectionVerifierFilter.java>:[27,20] package javax.servlet does not exist
[ERROR] <https://analysis.apache.org/jenkins/job/maven-wagon/org.apache.maven.wagon$wagon-tck-http/ws/src/main/java/org/apache/maven/wagon/tck/http/fixture/ProxyConnectionVerifierFilter.java>:[28,20] package javax.servlet does not exist
[ERROR] <https://analysis.apache.org/jenkins/job/maven-wagon/org.apache.maven.wagon$wagon-tck-http/ws/src/main/java/org/apache/maven/wagon/tck/http/fixture/ProxyConnectionVerifierFilter.java>:[29,20] package javax.servlet does not exist
[ERROR] <https://analysis.apache.org/jenkins/job/maven-wagon/org.apache.maven.wagon$wagon-tck-http/ws/src/main/java/org/apache/maven/wagon/tck/http/fixture/ProxyConnectionVerifierFilter.java>:[30,20] package javax.servlet does not exist
[ERROR] <https://analysis.apache.org/jenkins/job/maven-wagon/org.apache.maven.wagon$wagon-tck-http/ws/src/main/java/org/apache/maven/wagon/tck/http/fixture/ProxyConnectionVerifierFilter.java>:[31,20] package javax.servlet does not exist
[ERROR] <https://analysis.apache.org/jenkins/job/maven-wagon/org.apache.maven.wagon$wagon-tck-http/ws/src/main/java/org/apache/maven/wagon/tck/http/fixture/ProxyConnectionVerifierFilter.java>:[32,25] package javax.servlet.http does not exist
[ERROR] <https://analysis.apache.org/jenkins/job/maven-wagon/org.apache.maven.wagon$wagon-tck-http/ws/src/main/java/org/apache/maven/wagon/tck/http/fixture/ProxyConnectionVerifierFilter.java>:[40,15] cannot find symbol
symbol: class Filter
implements Filter
[ERROR] <https://analysis.apache.org/jenkins/job/maven-wagon/org.apache.maven.wagon$wagon-tck-http/ws/src/main/java/org/apache/maven/wagon/tck/http/fixture/ProxyConnectionVerifierFilter.java>:[49,32] cannot find symbol
symbol : class ServletRequest
location: class org.apache.maven.wagon.tck.http.fixture.ProxyConnectionVerifierFilter
[ERROR] <https://analysis.apache.org/jenkins/job/maven-wagon/org.apache.maven.wagon$wagon-tck-http/ws/src/main/java/org/apache/maven/wagon/tck/http/fixture/ProxyConnectionVerifierFilter.java>:[49,58] cannot find symbol
symbol : class ServletResponse
location: class org.apache.maven.wagon.tck.http.fixture.ProxyConnectionVerifierFilter
[ERROR] <https://analysis.apache.org/jenkins/job/maven-wagon/org.apache.maven.wagon$wagon-tck-http/ws/src/main/java/org/apache/maven/wagon/tck/http/fixture/ProxyConnectionVerifierFilter.java>:[49,86] cannot find symbol
symbol : class FilterChain
location: class org.apache.maven.wagon.tck.http.fixture.ProxyConnectionVerifierFilter
[ERROR] <https://analysis.apache.org/jenkins/job/maven-wagon/org.apache.maven.wagon$wagon-tck-http/ws/src/main/java/org/apache/maven/wagon/tck/http/fixture/ProxyConnectionVerifierFilter.java>:[50,28] cannot find symbol
symbol : class ServletException
location: class org.apache.maven.wagon.tck.http.fixture.ProxyConnectionVerifierFilter
[ERROR] <https://analysis.apache.org/jenkins/job/maven-wagon/org.apache.maven.wagon$wagon-tck-http/ws/src/main/java/org/apache/maven/wagon/tck/http/fixture/ProxyConnectionVerifierFilter.java>:[76,28] cannot find symbol
symbol : class FilterConfig
location: class org.apache.maven.wagon.tck.http.fixture.ProxyConnectionVerifierFilter
[ERROR] <https://analysis.apache.org/jenkins/job/maven-wagon/org.apache.maven.wagon$wagon-tck-http/ws/src/main/java/org/apache/maven/wagon/tck/http/fixture/ProxyConnectionVerifierFilter.java>:[77,15] cannot find symbol
symbol : class ServletException
location: class org.apache.maven.wagon.tck.http.fixture.ProxyConnectionVerifierFilter
[ERROR] <https://analysis.apache.org/jenkins/job/maven-wagon/org.apache.maven.wagon$wagon-tck-http/ws/src/main/java/org/apache/maven/wagon/tck/http/fixture/LatencyServlet.java>:[28,25] package javax.servlet.http does not exist
[ERROR] <https://analysis.apache.org/jenkins/job/maven-wagon/org.apache.maven.wagon$wagon-tck-http/ws/src/main/java/org/apache/maven/wagon/tck/http/fixture/LatencyServlet.java>:[39,12] cannot find symbol
symbol: class HttpServlet
extends HttpServlet
[ERROR] <https://analysis.apache.org/jenkins/job/maven-wagon/org.apache.maven.wagon$wagon-tck-http/ws/src/main/java/org/apache/maven/wagon/tck/http/fixture/LatencyServlet.java>:[55,32] cannot find symbol
symbol : class HttpServletRequest
location: class org.apache.maven.wagon.tck.http.fixture.LatencyServlet
[ERROR] <https://analysis.apache.org/jenkins/job/maven-wagon/org.apache.maven.wagon$wagon-tck-http/ws/src/main/java/org/apache/maven/wagon/tck/http/fixture/LatencyServlet.java>:[55,62] cannot find symbol
symbol : class HttpServletResponse
location: class org.apache.maven.wagon.tck.http.fixture.LatencyServlet
[ERROR] <https://analysis.apache.org/jenkins/job/maven-wagon/org.apache.maven.wagon$wagon-tck-http/ws/src/main/java/org/apache/maven/wagon/tck/http/fixture/LatencyServlet.java>:[56,15] cannot find symbol
symbol : class ServletException
location: class org.apache.maven.wagon.tck.http.fixture.LatencyServlet
[ERROR] <https://analysis.apache.org/jenkins/job/maven-wagon/org.apache.maven.wagon$wagon-tck-http/ws/src/main/java/org/apache/maven/wagon/tck/http/fixture/AuthSnoopFilter.java>:[25,20] package javax.servlet does not exist
[ERROR] <https://analysis.apache.org/jenkins/job/maven-wagon/org.apache.maven.wagon$wagon-tck-http/ws/src/main/java/org/apache/maven/wagon/tck/http/fixture/AuthSnoopFilter.java>:[26,20] package javax.servlet does not exist
[ERROR] <https://analysis.apache.org/jenkins/job/maven-wagon/org.apache.maven.wagon$wagon-tck-http/ws/src/main/java/org/apache/maven/wagon/tck/http/fixture/AuthSnoopFilter.java>:[39,15] cannot find symbol
symbol: class Filter
implements Filter
[ERROR] <https://analysis.apache.org/jenkins/job/maven-wagon/org.apache.maven.wagon$wagon-tck-http/ws/src/main/java/org/apache/maven/wagon/tck/http/fixture/AuthSnoopFilter.java>:[47,32] cannot find symbol
symbol : class ServletRequest
location: class org.apache.maven.wagon.tck.http.fixture.AuthSnoopFilter
[ERROR] <https://analysis.apache.org/jenkins/job/maven-wagon/org.apache.maven.wagon$wagon-tck-http/ws/src/main/java/org/apache/maven/wagon/tck/http/fixture/AuthSnoopFilter.java>:[47,58] cannot find symbol
symbol : class ServletResponse
location: class org.apache.maven.wagon.tck.http.fixture.AuthSnoopFilter
[ERROR] <https://analysis.apache.org/jenkins/job/maven-wagon/org.apache.maven.wagon$wagon-tck-http/ws/src/main/java/org/apache/maven/wagon/tck/http/fixture/AuthSnoopFilter.java>:[47,90] cannot find symbol
symbol : class FilterChain
location: class org.apache.maven.wagon.tck.http.fixture.AuthSnoopFilter
[ERROR] <https://analysis.apache.org/jenkins/job/maven-wagon/org.apache.maven.wagon$wagon-tck-http/ws/src/main/java/org/apache/maven/wagon/tck/http/fixture/AuthSnoopFilter.java>:[48,28] cannot find symbol
symbol : class ServletException
location: class org.apache.maven.wagon.tck.http.fixture.AuthSnoopFilter
[ERROR] <https://analysis.apache.org/jenkins/job/maven-wagon/org.apache.maven.wagon$wagon-tck-http/ws/src/main/java/org/apache/maven/wagon/tck/http/fixture/AuthSnoopFilter.java>:[65,28] cannot find symbol
symbol : class FilterConfig
location: class org.apache.maven.wagon.tck.http.fixture.AuthSnoopFilter
[ERROR] <https://analysis.apache.org/jenkins/job/maven-wagon/org.apache.maven.wagon$wagon-tck-http/ws/src/main/java/org/apache/maven/wagon/tck/http/fixture/AuthSnoopFilter.java>:[66,15] cannot find symbol
symbol : class ServletException
location: class org.apache.maven.wagon.tck.http.fixture.AuthSnoopFilter
[ERROR] <https://analysis.apache.org/jenkins/job/maven-wagon/org.apache.maven.wagon$wagon-tck-http/ws/src/main/java/org/apache/maven/wagon/tck/http/fixture/ServletExceptionServlet.java>:[25,25] package javax.servlet.http does not exist
[ERROR] <https://analysis.apache.org/jenkins/job/maven-wagon/org.apache.maven.wagon$wagon-tck-http/ws/src/main/java/org/apache/maven/wagon/tck/http/fixture/ServletExceptionServlet.java>:[33,12] cannot find symbol
symbol: class HttpServlet
extends HttpServlet
[ERROR] <https://analysis.apache.org/jenkins/job/maven-wagon/org.apache.maven.wagon$wagon-tck-http/ws/src/main/java/org/apache/maven/wagon/tck/http/fixture/ServletExceptionServlet.java>:[46,34] cannot find symbol
symbol : class HttpServletRequest
location: class org.apache.maven.wagon.tck.http.fixture.ServletExceptionServlet
[ERROR] <https://analysis.apache.org/jenkins/job/maven-wagon/org.apache.maven.wagon$wagon-tck-http/ws/src/main/java/org/apache/maven/wagon/tck/http/fixture/ServletExceptionServlet.java>:[46,68] cannot find symbol
symbol : class HttpServletResponse
location: class org.apache.maven.wagon.tck.http.fixture.ServletExceptionServlet
[ERROR] <https://analysis.apache.org/jenkins/job/maven-wagon/org.apache.maven.wagon$wagon-tck-http/ws/src/main/java/org/apache/maven/wagon/tck/http/fixture/ServletExceptionServlet.java>:[47,15] cannot find symbol
symbol : class ServletException
location: class org.apache.maven.wagon.tck.http.fixture.ServletExceptionServlet
[ERROR] <https://analysis.apache.org/jenkins/job/maven-wagon/org.apache.maven.wagon$wagon-tck-http/ws/src/main/java/org/apache/maven/wagon/tck/http/fixture/RedirectionServlet.java>:[68,4] method does not override or implement a method from a supertype
[ERROR] <https://analysis.apache.org/jenkins/job/maven-wagon/org.apache.maven.wagon$wagon-tck-http/ws/src/main/java/org/apache/maven/wagon/tck/http/fixture/ErrorCodeServlet.java>:[48,4] method does not override or implement a method from a supertype
[ERROR] <https://analysis.apache.org/jenkins/job/maven-wagon/org.apache.maven.wagon$wagon-tck-http/ws/src/main/java/org/apache/maven/wagon/tck/http/fixture/ProxyAuthenticationFilter.java>:[59,8] cannot find symbol
symbol : class HttpServletRequest
location: class org.apache.maven.wagon.tck.http.fixture.ProxyAuthenticationFilter
[ERROR] <https://analysis.apache.org/jenkins/job/maven-wagon/org.apache.maven.wagon$wagon-tck-http/ws/src/main/java/org/apache/maven/wagon/tck/http/fixture/ProxyAuthenticationFilter.java>:[59,38] cannot find symbol
symbol : class HttpServletRequest
location: class org.apache.maven.wagon.tck.http.fixture.ProxyAuthenticationFilter
[ERROR] <https://analysis.apache.org/jenkins/job/maven-wagon/org.apache.maven.wagon$wagon-tck-http/ws/src/main/java/org/apache/maven/wagon/tck/http/fixture/ProxyAuthenticationFilter.java>:[60,8] cannot find symbol
symbol : class HttpServletResponse
location: class org.apache.maven.wagon.tck.http.fixture.ProxyAuthenticationFilter
[ERROR] <https://analysis.apache.org/jenkins/job/maven-wagon/org.apache.maven.wagon$wagon-tck-http/ws/src/main/java/org/apache/maven/wagon/tck/http/fixture/ProxyAuthenticationFilter.java>:[60,40] cannot find symbol
symbol : class HttpServletResponse
location: class org.apache.maven.wagon.tck.http.fixture.ProxyAuthenticationFilter
[ERROR] <https://analysis.apache.org/jenkins/job/maven-wagon/org.apache.maven.wagon$wagon-tck-http/ws/src/main/java/org/apache/maven/wagon/tck/http/fixture/ProxyAuthenticationFilter.java>:[65,32] cannot find symbol
symbol : variable HttpServletResponse
location: class org.apache.maven.wagon.tck.http.fixture.ProxyAuthenticationFilter
[ERROR] <https://analysis.apache.org/jenkins/job/maven-wagon/org.apache.maven.wagon$wagon-tck-http/ws/src/main/java/org/apache/maven/wagon/tck/http/fixture/ProxyAuthenticationFilter.java>:[77,36] cannot find symbol
symbol : variable HttpServletResponse
location: class org.apache.maven.wagon.tck.http.fixture.ProxyAuthenticationFilter
[ERROR] <https://analysis.apache.org/jenkins/job/maven-wagon/org.apache.maven.wagon$wagon-tck-http/ws/src/main/java/org/apache/maven/wagon/tck/http/fixture/ServerFixture.java>:[81,17] cannot access org.mortbay.component.AbstractLifeCycle
class file for org.mortbay.component.AbstractLifeCycle not found
server = new Server();
[ERROR] <https://analysis.apache.org/jenkins/job/maven-wagon/org.apache.maven.wagon$wagon-tck-http/ws/src/main/java/org/apache/maven/wagon/tck/http/fixture/ServerFixture.java>:[102,21] cannot access org.mortbay.component.LifeCycle
class file for org.mortbay.component.LifeCycle not found
connector.setHost( "localhost" );
[ERROR] <https://analysis.apache.org/jenkins/job/maven-wagon/org.apache.maven.wagon$wagon-tck-http/ws/src/main/java/org/apache/maven/wagon/tck/http/fixture/ServerFixture.java>:[179,20] operator != cannot be applied to org.mortbay.jetty.Server,<nulltype>
[ERROR] <https://analysis.apache.org/jenkins/job/maven-wagon/org.apache.maven.wagon$wagon-tck-http/ws/src/main/java/org/apache/maven/wagon/tck/http/fixture/ServerFixture.java>:[181,18] cannot find symbol
symbol : method stop()
location: class org.mortbay.jetty.Server
[ERROR] <https://analysis.apache.org/jenkins/job/maven-wagon/org.apache.maven.wagon$wagon-tck-http/ws/src/main/java/org/apache/maven/wagon/tck/http/fixture/ServerFixture.java>:[188,19] cannot find symbol
symbol : method isStarted()
location: class org.mortbay.jetty.Server
[ERROR] <https://analysis.apache.org/jenkins/job/maven-wagon/org.apache.maven.wagon$wagon-tck-http/ws/src/main/java/org/apache/maven/wagon/tck/http/fixture/ServerFixture.java>:[188,41] cannot find symbol
symbol : method isRunning()
location: class org.mortbay.jetty.Server
[ERROR] <https://analysis.apache.org/jenkins/job/maven-wagon/org.apache.maven.wagon$wagon-tck-http/ws/src/main/java/org/apache/maven/wagon/tck/http/fixture/ServerFixture.java>:[192,14] cannot find symbol
symbol : method start()
location: class org.mortbay.jetty.Server
[ERROR] <https://analysis.apache.org/jenkins/job/maven-wagon/org.apache.maven.wagon$wagon-tck-http/ws/src/main/java/org/apache/maven/wagon/tck/http/fixture/ServerFixture.java>:[195,43] cannot find symbol
symbol : method isStarted()
location: class org.mortbay.jetty.Server
[ERROR] <https://analysis.apache.org/jenkins/job/maven-wagon/org.apache.maven.wagon$wagon-tck-http/ws/src/main/java/org/apache/maven/wagon/tck/http/fixture/ServerFixture.java>:[197,18] cannot find symbol
symbol : method wait(int)
location: class org.mortbay.jetty.Server
[ERROR] <https://analysis.apache.org/jenkins/job/maven-wagon/org.apache.maven.wagon$wagon-tck-http/ws/src/main/java/org/apache/maven/wagon/tck/http/fixture/ServerFixture.java>:[201,20] cannot find symbol
symbol : method isStarted()
location: class org.mortbay.jetty.Server
[ERROR] <https://analysis.apache.org/jenkins/job/maven-wagon/org.apache.maven.wagon$wagon-tck-http/ws/src/main/java/org/apache/maven/wagon/tck/http/GetWagonTests.java>:[102,8] cannot find symbol
symbol : class Servlet
location: class org.apache.maven.wagon.tck.http.GetWagonTests
[ERROR] <https://analysis.apache.org/jenkins/job/maven-wagon/org.apache.maven.wagon$wagon-tck-http/ws/src/main/java/org/apache/maven/wagon/tck/http/GetWagonTests.java>:[123,16] cannot find symbol
symbol: class Servlet
Servlet servlet = new LatencyServlet( -1 );
[ERROR] <https://analysis.apache.org/jenkins/job/maven-wagon/org.apache.maven.wagon$wagon-tck-http/ws/src/main/java/org/apache/maven/wagon/tck/http/GetWagonTests.java>:[226,63] cannot find symbol
symbol : variable HttpServletResponse
location: class org.apache.maven.wagon.tck.http.GetWagonTests
[ERROR] <https://analysis.apache.org/jenkins/job/maven-wagon/org.apache.maven.wagon$wagon-tck-http/ws/src/main/java/org/apache/maven/wagon/tck/http/GetWagonTests.java>:[238,63] cannot find symbol
symbol : variable HttpServletResponse
location: class org.apache.maven.wagon.tck.http.GetWagonTests
[ERROR] <https://analysis.apache.org/jenkins/job/maven-wagon/org.apache.maven.wagon$wagon-tck-http/ws/src/main/java/org/apache/maven/wagon/tck/http/GetWagonTests.java>:[253,63] cannot find symbol
symbol : variable HttpServletResponse
location: class org.apache.maven.wagon.tck.http.GetWagonTests
[ERROR] <https://analysis.apache.org/jenkins/job/maven-wagon/org.apache.maven.wagon$wagon-tck-http/ws/src/main/java/org/apache/maven/wagon/tck/http/GetWagonTests.java>:[268,63] cannot find symbol
symbol : variable HttpServletResponse
location: class org.apache.maven.wagon.tck.http.GetWagonTests
[ERROR] <https://analysis.apache.org/jenkins/job/maven-wagon/org.apache.maven.wagon$wagon-tck-http/ws/src/main/java/org/apache/maven/wagon/tck/http/GetWagonTests.java>:[284,63] cannot find symbol
symbol : variable HttpServletResponse
location: class org.apache.maven.wagon.tck.http.GetWagonTests
[ERROR] <https://analysis.apache.org/jenkins/job/maven-wagon/org.apache.maven.wagon$wagon-tck-http/ws/src/main/java/org/apache/maven/wagon/tck/http/GetWagonTests.java>:[308,63] cannot find symbol
symbol : variable HttpServletResponse
location: class org.apache.maven.wagon.tck.http.GetWagonTests
[ERROR] <https://analysis.apache.org/jenkins/job/maven-wagon/org.apache.maven.wagon$wagon-tck-http/ws/src/main/java/org/apache/maven/wagon/tck/http/GetWagonTests.java>:[337,63] cannot find symbol
symbol : variable HttpServletResponse
location: class org.apache.maven.wagon.tck.http.GetWagonTests
[ERROR] <https://analysis.apache.org/jenkins/job/maven-wagon/org.apache.maven.wagon$wagon-tck-http/ws/src/main/java/org/apache/maven/wagon/tck/http/GetWagonTests.java>:[366,63] cannot find symbol
symbol : variable HttpServletResponse
location: class org.apache.maven.wagon.tck.http.GetWagonTests
[ERROR] <https://analysis.apache.org/jenkins/job/maven-wagon/org.apache.maven.wagon$wagon-tck-http/ws/src/main/java/org/apache/maven/wagon/tck/http/GetWagonTests.java>:[407,27] cannot find symbol
symbol : variable HttpServletResponse
location: class org.apache.maven.wagon.tck.http.GetWagonTests
[ERROR] <https://analysis.apache.org/jenkins/job/maven-wagon/org.apache.maven.wagon$wagon-tck-http/ws/src/main/java/org/apache/maven/wagon/tck/http/GetWagonTests.java>:[415,27] cannot find symbol
symbol : variable HttpServletResponse
location: class org.apache.maven.wagon.tck.http.GetWagonTests
[ERROR] <https://analysis.apache.org/jenkins/job/maven-wagon/org.apache.maven.wagon$wagon-tck-http/ws/src/main/java/org/apache/maven/wagon/tck/http/GetWagonTests.java>:[430,61] cannot find symbol
symbol : variable HttpServletResponse
location: class org.apache.maven.wagon.tck.http.GetWagonTests
[ERROR] <https://analysis.apache.org/jenkins/job/maven-wagon/org.apache.maven.wagon$wagon-tck-http/ws/src/main/java/org/apache/maven/wagon/tck/http/GetWagonTests.java>:[536,21] cannot find symbol
symbol : variable HttpServletResponse
location: class org.apache.maven.wagon.tck.http.GetWagonTests
[INFO] 100 errors
[INFO] -------------------------------------------------------------
[JENKINS] Archiving disabled