You are viewing a plain text version of this content. The canonical link for it is here.
Posted to commits@cayenne.apache.org by Apache Hudson Server <hu...@hudson.zones.apache.org> on 2010/08/04 20:18:45 UTC

Build failed in Hudson: Cayenne-30 » JDK 1.6 (latest),Ubuntu #94

See <http://hudson.zones.apache.org/hudson/job/Cayenne-30/./jdk=JDK%201.6%20(latest),label=Ubuntu/94/changes>

Changes:

[aadamchik] empty dir

[aadamchik] refreshing docs

------------------------------------------
[...truncated 73751 lines...]
Tests run: 1, Failures: 0, Errors: 0, Skipped: 0, Time elapsed: 0.005 sec
Running org.apache.cayenne.jpa.itest.ch2._2_1_5_EmbeddableTest
Tests run: 3, Failures: 0, Errors: 0, Skipped: 0, Time elapsed: 0.128 sec
Running org.apache.cayenne.jpa.itest.ch2._2_1_1_PeristentFieldsAndPropertiesTest
Tests run: 5, Failures: 0, Errors: 0, Skipped: 0, Time elapsed: 0.015 sec
Running org.apache.cayenne.jpa.itest.ch2._2_1_10_1_SingleTablePerClassTest
Tests run: 2, Failures: 0, Errors: 0, Skipped: 0, Time elapsed: 0.087 sec
Running org.apache.cayenne.jpa.itest.ch2._2_1_4_PrimaryKeyAndIdentityTest
Tests run: 2, Failures: 0, Errors: 0, Skipped: 0, Time elapsed: 0.009 sec
Running org.apache.cayenne.jpa.itest.ch2._2_1_6_MappingDefaultsNonRelationshipTest
Tests run: 4, Failures: 0, Errors: 0, Skipped: 0, Time elapsed: 0.037 sec
Running org.apache.cayenne.jpa.itest.ch2._2_1_7_EntityRelationshipsTest
Tests run: 2, Failures: 0, Errors: 0, Skipped: 0, Time elapsed: 0.007 sec

Results :

Tests run: 20, Failures: 0, Errors: 0, Skipped: 0

[INFO] [jar:jar {execution: default-jar}]
[INFO] Building jar: <http://hudson.zones.apache.org/hudson/job/Cayenne-30/./jdk=JDK%201.6%20(latest),label=Ubuntu/ws/STABLE-3.0/itests/jpa-chapter2/target/jpa-chapter2-3.0-SNAPSHOT.jar>
[INFO] [install:install {execution: default-install}]
[INFO] Installing <http://hudson.zones.apache.org/hudson/job/Cayenne-30/./jdk=JDK%201.6%20(latest),label=Ubuntu/ws/STABLE-3.0/itests/jpa-chapter2/target/jpa-chapter2-3.0-SNAPSHOT.jar> to /home/hudson/.m2/repository/org/apache/cayenne/itests/jpa-chapter2/3.0-SNAPSHOT/jpa-chapter2-3.0-SNAPSHOT.jar
[INFO] ------------------------------------------------------------------------
[INFO] Building Integration Tests - JPA Chapter 3
[INFO]    task-segment: [clean, install]
[INFO] ------------------------------------------------------------------------
[INFO] [clean:clean {execution: default-clean}]
[INFO] Deleting directory <http://hudson.zones.apache.org/hudson/job/Cayenne-30/./jdk=JDK%201.6%20(latest),label=Ubuntu/ws/STABLE-3.0/itests/jpa-chapter3/target>
[INFO] [resources:resources {execution: default-resources}]
[WARNING] Using platform encoding (UTF-8 actually) to copy filtered resources, i.e. build is platform dependent!
[INFO] Copying 1 resource
[INFO] [compiler:compile {execution: default-compile}]
[INFO] Compiling 9 source files to <http://hudson.zones.apache.org/hudson/job/Cayenne-30/./jdk=JDK%201.6%20(latest),label=Ubuntu/ws/STABLE-3.0/itests/jpa-chapter3/target/classes>
[INFO] [resources:testResources {execution: default-testResources}]
[WARNING] Using platform encoding (UTF-8 actually) to copy filtered resources, i.e. build is platform dependent!
[INFO] Copying 1 resource
[INFO] [compiler:testCompile {execution: default-testCompile}]
[INFO] Compiling 5 source files to <http://hudson.zones.apache.org/hudson/job/Cayenne-30/./jdk=JDK%201.6%20(latest),label=Ubuntu/ws/STABLE-3.0/itests/jpa-chapter3/target/test-classes>
[WARNING] <http://hudson.zones.apache.org/hudson/job/Cayenne-30/./jdk=JDK%201.6%20(latest),label=Ubuntu/ws/STABLE-3.0/itests/jpa-chapter3/src/test/java/org/apache/cayenne/jpa/itest/ch3/_3_6_1_QueryAPITest.java>:[30,22] sun.java2d.pipe.SpanShapeRenderer is Sun proprietary API and may be removed in a future release

[WARNING] <http://hudson.zones.apache.org/hudson/job/Cayenne-30/./jdk=JDK%201.6%20(latest),label=Ubuntu/ws/STABLE-3.0/itests/jpa-chapter3/src/test/java/org/apache/cayenne/jpa/itest/ch3/_3_6_1_QueryAPITest.java>:[30,22] sun.java2d.pipe.SpanShapeRenderer is Sun proprietary API and may be removed in a future release

[INFO] [surefire:test {execution: default-test}]
[INFO] Surefire report directory: <http://hudson.zones.apache.org/hudson/job/Cayenne-30/./jdk=JDK%201.6%20(latest),label=Ubuntu/ws/STABLE-3.0/itests/jpa-chapter3/target/surefire-reports>
*** CayenneAgent starting...

-------------------------------------------------------
 T E S T S
-------------------------------------------------------
Running org.apache.cayenne.jpa.itest.ch3._3_1_1_EntityManagerTransactionTest
log4j:WARN No appenders could be found for logger (org.apache.cayenne.jpa.Provider).
log4j:WARN Please initialize the log4j system properly.
Tests run: 1, Failures: 0, Errors: 0, Skipped: 0, Time elapsed: 0.751 sec
Running org.apache.cayenne.jpa.itest.ch3._3_1_1_EntityManagerTest
Tests run: 12, Failures: 0, Errors: 0, Skipped: 0, Time elapsed: 0.129 sec
Running org.apache.cayenne.jpa.itest.ch3._3_6_1_QueryAPITest
Tests run: 8, Failures: 0, Errors: 0, Skipped: 0, Time elapsed: 0.035 sec
Running org.apache.cayenne.jpa.itest.ch3._3_6_6_SQLQueriesTest
Tests run: 2, Failures: 0, Errors: 0, Skipped: 0, Time elapsed: 0.006 sec
Running org.apache.cayenne.jpa.itest.ch3._3_5_1_LifecycleCallbackMethodsTest
Tests run: 2, Failures: 0, Errors: 0, Skipped: 0, Time elapsed: 0.01 sec

Results :

Tests run: 25, Failures: 0, Errors: 0, Skipped: 0

[INFO] [jar:jar {execution: default-jar}]
[INFO] Building jar: <http://hudson.zones.apache.org/hudson/job/Cayenne-30/./jdk=JDK%201.6%20(latest),label=Ubuntu/ws/STABLE-3.0/itests/jpa-chapter3/target/jpa-chapter3-3.0-SNAPSHOT.jar>
[INFO] [install:install {execution: default-install}]
[INFO] Installing <http://hudson.zones.apache.org/hudson/job/Cayenne-30/./jdk=JDK%201.6%20(latest),label=Ubuntu/ws/STABLE-3.0/itests/jpa-chapter3/target/jpa-chapter3-3.0-SNAPSHOT.jar> to /home/hudson/.m2/repository/org/apache/cayenne/itests/jpa-chapter3/3.0-SNAPSHOT/jpa-chapter3-3.0-SNAPSHOT.jar
[INFO] ------------------------------------------------------------------------
[INFO] Building Integration Tests - JPA Chapter 5
[INFO]    task-segment: [clean, install]
[INFO] ------------------------------------------------------------------------
[INFO] [clean:clean {execution: default-clean}]
[INFO] Deleting directory <http://hudson.zones.apache.org/hudson/job/Cayenne-30/./jdk=JDK%201.6%20(latest),label=Ubuntu/ws/STABLE-3.0/itests/jpa-chapter5/target>
[INFO] [resources:resources {execution: default-resources}]
[WARNING] Using platform encoding (UTF-8 actually) to copy filtered resources, i.e. build is platform dependent!
[INFO] Copying 1 resource
[INFO] [compiler:compile {execution: default-compile}]
[INFO] Compiling 2 source files to <http://hudson.zones.apache.org/hudson/job/Cayenne-30/./jdk=JDK%201.6%20(latest),label=Ubuntu/ws/STABLE-3.0/itests/jpa-chapter5/target/classes>
[INFO] [resources:testResources {execution: default-testResources}]
[WARNING] Using platform encoding (UTF-8 actually) to copy filtered resources, i.e. build is platform dependent!
[INFO] Copying 1 resource
[INFO] [compiler:testCompile {execution: default-testCompile}]
[INFO] Compiling 3 source files to <http://hudson.zones.apache.org/hudson/job/Cayenne-30/./jdk=JDK%201.6%20(latest),label=Ubuntu/ws/STABLE-3.0/itests/jpa-chapter5/target/test-classes>
[INFO] [surefire:test {execution: default-test}]
[INFO] Surefire report directory: <http://hudson.zones.apache.org/hudson/job/Cayenne-30/./jdk=JDK%201.6%20(latest),label=Ubuntu/ws/STABLE-3.0/itests/jpa-chapter5/target/surefire-reports>
*** CayenneAgent starting...

-------------------------------------------------------
 T E S T S
-------------------------------------------------------
Running org.apache.cayenne.jpa.itest.ch5._5_5_2_ResourceLocalEntityManagerTest
Tests run: 1, Failures: 0, Errors: 0, Skipped: 0, Time elapsed: 0.022 sec
Running org.apache.cayenne.jpa.itest.ch5._5_5_1_JtaEntityManagerTest
Apache OpenEJB 3.0    build: 20080408-04:13
http://openejb.apache.org/
log4j:WARN No appenders could be found for logger (org.apache.cayenne.jpa.Provider).
log4j:WARN Please initialize the log4j system properly.
Tests run: 2, Failures: 0, Errors: 0, Skipped: 0, Time elapsed: 1.838 sec
Running org.apache.cayenne.jpa.itest.ch5._5_4_EntityMangerFactoryTest
Tests run: 2, Failures: 0, Errors: 0, Skipped: 0, Time elapsed: 0.023 sec

Results :

Tests run: 5, Failures: 0, Errors: 0, Skipped: 0

[INFO] [jar:jar {execution: default-jar}]
[INFO] Building jar: <http://hudson.zones.apache.org/hudson/job/Cayenne-30/./jdk=JDK%201.6%20(latest),label=Ubuntu/ws/STABLE-3.0/itests/jpa-chapter5/target/jpa-chapter5-3.0-SNAPSHOT.jar>
[INFO] [install:install {execution: default-install}]
[INFO] Installing <http://hudson.zones.apache.org/hudson/job/Cayenne-30/./jdk=JDK%201.6%20(latest),label=Ubuntu/ws/STABLE-3.0/itests/jpa-chapter5/target/jpa-chapter5-3.0-SNAPSHOT.jar> to /home/hudson/.m2/repository/org/apache/cayenne/itests/jpa-chapter5/3.0-SNAPSHOT/jpa-chapter5-3.0-SNAPSHOT.jar
[INFO] ------------------------------------------------------------------------
[INFO] Building Integration Tests - JPA Chapter 6
[INFO]    task-segment: [clean, install]
[INFO] ------------------------------------------------------------------------
[INFO] [clean:clean {execution: default-clean}]
[INFO] Deleting directory <http://hudson.zones.apache.org/hudson/job/Cayenne-30/./jdk=JDK%201.6%20(latest),label=Ubuntu/ws/STABLE-3.0/itests/jpa-chapter6/target>
[INFO] [resources:resources {execution: default-resources}]
[WARNING] Using platform encoding (UTF-8 actually) to copy filtered resources, i.e. build is platform dependent!
[INFO] Copying 1 resource
[INFO] [compiler:compile {execution: default-compile}]
[INFO] Compiling 1 source file to <http://hudson.zones.apache.org/hudson/job/Cayenne-30/./jdk=JDK%201.6%20(latest),label=Ubuntu/ws/STABLE-3.0/itests/jpa-chapter6/target/classes>
[INFO] [resources:testResources {execution: default-testResources}]
[WARNING] Using platform encoding (UTF-8 actually) to copy filtered resources, i.e. build is platform dependent!
[INFO] Copying 1 resource
[INFO] [compiler:testCompile {execution: default-testCompile}]
[INFO] Compiling 1 source file to <http://hudson.zones.apache.org/hudson/job/Cayenne-30/./jdk=JDK%201.6%20(latest),label=Ubuntu/ws/STABLE-3.0/itests/jpa-chapter6/target/test-classes>
[INFO] [surefire:test {execution: default-test}]
[INFO] Surefire report directory: <http://hudson.zones.apache.org/hudson/job/Cayenne-30/./jdk=JDK%201.6%20(latest),label=Ubuntu/ws/STABLE-3.0/itests/jpa-chapter6/target/surefire-reports>
*** CayenneAgent starting...

-------------------------------------------------------
 T E S T S
-------------------------------------------------------
Running org.apache.cayenne.jpa.itest.ch6._6_1_2_6_PersistentClassSourcesTest
log4j:WARN No appenders could be found for logger (org.apache.cayenne.jpa.Provider).
log4j:WARN Please initialize the log4j system properly.
Tests run: 1, Failures: 0, Errors: 0, Skipped: 0, Time elapsed: 0.749 sec

Results :

Tests run: 1, Failures: 0, Errors: 0, Skipped: 0

[INFO] [jar:jar {execution: default-jar}]
[INFO] Building jar: <http://hudson.zones.apache.org/hudson/job/Cayenne-30/./jdk=JDK%201.6%20(latest),label=Ubuntu/ws/STABLE-3.0/itests/jpa-chapter6/target/jpa-chapter6-3.0-SNAPSHOT.jar>
[INFO] [install:install {execution: default-install}]
[INFO] Installing <http://hudson.zones.apache.org/hudson/job/Cayenne-30/./jdk=JDK%201.6%20(latest),label=Ubuntu/ws/STABLE-3.0/itests/jpa-chapter6/target/jpa-chapter6-3.0-SNAPSHOT.jar> to /home/hudson/.m2/repository/org/apache/cayenne/itests/jpa-chapter6/3.0-SNAPSHOT/jpa-chapter6-3.0-SNAPSHOT.jar
[INFO] ------------------------------------------------------------------------
[INFO] Building Integration Tests - JPA Chapter 9
[INFO]    task-segment: [clean, install]
[INFO] ------------------------------------------------------------------------
[INFO] [clean:clean {execution: default-clean}]
[INFO] Deleting directory <http://hudson.zones.apache.org/hudson/job/Cayenne-30/./jdk=JDK%201.6%20(latest),label=Ubuntu/ws/STABLE-3.0/itests/jpa-chapter9/target>
[INFO] [resources:resources {execution: default-resources}]
[WARNING] Using platform encoding (UTF-8 actually) to copy filtered resources, i.e. build is platform dependent!
[INFO] Copying 1 resource
[INFO] [compiler:compile {execution: default-compile}]
[INFO] Compiling 4 source files to <http://hudson.zones.apache.org/hudson/job/Cayenne-30/./jdk=JDK%201.6%20(latest),label=Ubuntu/ws/STABLE-3.0/itests/jpa-chapter9/target/classes>
[INFO] [resources:testResources {execution: default-testResources}]
[WARNING] Using platform encoding (UTF-8 actually) to copy filtered resources, i.e. build is platform dependent!
[INFO] Copying 1 resource
[INFO] [compiler:testCompile {execution: default-testCompile}]
[INFO] Compiling 3 source files to <http://hudson.zones.apache.org/hudson/job/Cayenne-30/./jdk=JDK%201.6%20(latest),label=Ubuntu/ws/STABLE-3.0/itests/jpa-chapter9/target/test-classes>
[INFO] ------------------------------------------------------------------------
[ERROR] BUILD ERROR
[INFO] ------------------------------------------------------------------------
[INFO] Fatal error compiling

Embedded error: Error while executing the compiler.
PermGen space
[INFO] ------------------------------------------------------------------------
[INFO] Trace
org.apache.maven.lifecycle.LifecycleExecutionException: Fatal error compiling
	at org.apache.maven.lifecycle.DefaultLifecycleExecutor.executeGoals(DefaultLifecycleExecutor.java:719)
	at org.apache.maven.lifecycle.DefaultLifecycleExecutor.executeGoalWithLifecycle(DefaultLifecycleExecutor.java:556)
	at org.apache.maven.lifecycle.DefaultLifecycleExecutor.executeGoal(DefaultLifecycleExecutor.java:535)
	at org.apache.maven.lifecycle.DefaultLifecycleExecutor.executeGoalAndHandleFailures(DefaultLifecycleExecutor.java:387)
	at org.apache.maven.lifecycle.DefaultLifecycleExecutor.executeTaskSegments(DefaultLifecycleExecutor.java:348)
	at org.apache.maven.lifecycle.DefaultLifecycleExecutor.execute(DefaultLifecycleExecutor.java:180)
	at org.apache.maven.DefaultMaven.doExecute(DefaultMaven.java:328)
	at org.apache.maven.DefaultMaven.execute(DefaultMaven.java:138)
	at org.apache.maven.cli.MavenCli.main(MavenCli.java:362)
	at org.apache.maven.cli.compat.CompatibleMain.main(CompatibleMain.java:60)
	at sun.reflect.NativeMethodAccessorImpl.invoke0(Native Method)
	at sun.reflect.NativeMethodAccessorImpl.invoke(NativeMethodAccessorImpl.java:39)
	at sun.reflect.DelegatingMethodAccessorImpl.invoke(DelegatingMethodAccessorImpl.java:25)
	at java.lang.reflect.Method.invoke(Method.java:597)
	at org.codehaus.classworlds.Launcher.launchEnhanced(Launcher.java:315)
	at org.codehaus.classworlds.Launcher.launch(Launcher.java:255)
	at org.codehaus.classworlds.Launcher.mainWithExitCode(Launcher.java:430)
	at org.codehaus.classworlds.Launcher.main(Launcher.java:375)
Caused by: org.apache.maven.plugin.MojoExecutionException: Fatal error compiling
	at org.apache.maven.plugin.AbstractCompilerMojo.execute(AbstractCompilerMojo.java:498)
	at org.apache.maven.plugin.TestCompilerMojo.execute(TestCompilerMojo.java:102)
	at org.apache.maven.plugin.DefaultPluginManager.executeMojo(DefaultPluginManager.java:490)
	at org.apache.maven.lifecycle.DefaultLifecycleExecutor.executeGoals(DefaultLifecycleExecutor.java:694)
	... 17 more
Caused by: org.codehaus.plexus.compiler.CompilerException: Error while executing the compiler.
	at org.codehaus.plexus.compiler.javac.JavacCompiler.compileInProcess(JavacCompiler.java:434)
	at org.codehaus.plexus.compiler.javac.JavacCompiler.compile(JavacCompiler.java:141)
	at org.apache.maven.plugin.AbstractCompilerMojo.execute(AbstractCompilerMojo.java:493)
	... 20 more
Caused by: java.lang.reflect.InvocationTargetException
	at sun.reflect.NativeMethodAccessorImpl.invoke0(Native Method)
	at sun.reflect.NativeMethodAccessorImpl.invoke(NativeMethodAccessorImpl.java:39)
	at sun.reflect.DelegatingMethodAccessorImpl.invoke(DelegatingMethodAccessorImpl.java:25)
	at java.lang.reflect.Method.invoke(Method.java:597)
	at org.codehaus.plexus.compiler.javac.JavacCompiler.compileInProcess(JavacCompiler.java:420)
	... 22 more
Caused by: java.lang.OutOfMemoryError: PermGen space
	at java.lang.ClassLoader.defineClass1(Native Method)
	at java.lang.ClassLoader.defineClassCond(ClassLoader.java:632)
	at java.lang.ClassLoader.defineClass(ClassLoader.java:616)
	at java.security.SecureClassLoader.defineClass(SecureClassLoader.java:141)
	at java.net.URLClassLoader.defineClass(URLClassLoader.java:283)
	at java.net.URLClassLoader.access$000(URLClassLoader.java:58)
	at java.net.URLClassLoader$1.run(URLClassLoader.java:197)
	at java.security.AccessController.doPrivileged(Native Method)
	at java.net.URLClassLoader.findClass(URLClassLoader.java:190)
	at org.codehaus.plexus.compiler.javac.IsolatedClassLoader.loadClass(IsolatedClassLoader.java:56)
	at java.util.ResourceBundle$Control.newBundle(ResourceBundle.java:2289)
	at java.util.ResourceBundle.loadBundle(ResourceBundle.java:1364)
	at java.util.ResourceBundle.findBundle(ResourceBundle.java:1328)
	at java.util.ResourceBundle.findBundle(ResourceBundle.java:1282)
	at java.util.ResourceBundle.findBundle(ResourceBundle.java:1282)
	at java.util.ResourceBundle.getBundleImpl(ResourceBundle.java:1224)
	at java.util.ResourceBundle.getBundle(ResourceBundle.java:705)
	at com.sun.tools.javac.util.Messages.add(Messages.java:66)
	at com.sun.tools.javac.util.Messages.<init>(Messages.java:52)
	at com.sun.tools.javac.main.Main.getLocalizedString(Main.java:447)
	at com.sun.tools.javac.main.Main.resourceMessage(Main.java:421)
	at com.sun.tools.javac.main.Main.compile(Main.java:364)
	at com.sun.tools.javac.main.Main.compile(Main.java:279)
	at com.sun.tools.javac.main.Main.compile(Main.java:270)
	at com.sun.tools.javac.Main.compile(Main.java:87)
	at sun.reflect.NativeMethodAccessorImpl.invoke0(Native Method)
	at sun.reflect.NativeMethodAccessorImpl.invoke(NativeMethodAccessorImpl.java:39)
	at sun.reflect.DelegatingMethodAccessorImpl.invoke(DelegatingMethodAccessorImpl.java:25)
	at java.lang.reflect.Method.invoke(Method.java:597)
	at org.codehaus.plexus.compiler.javac.JavacCompiler.compileInProcess(JavacCompiler.java:420)
	at org.codehaus.plexus.compiler.javac.JavacCompiler.compile(JavacCompiler.java:141)
	at org.apache.maven.plugin.AbstractCompilerMojo.execute(AbstractCompilerMojo.java:493)
[INFO] ------------------------------------------------------------------------
[INFO] Total time: 2 minutes 13 seconds
[INFO] Finished at: Wed Aug 04 18:21:03 UTC 2010
[INFO] Final Memory: 101M/971M
[INFO] ------------------------------------------------------------------------
Recording test results


Hudson build is back to normal : Cayenne-30 » JDK 1.6 (latest),Ubuntu #95

Posted by Apache Hudson Server <hu...@hudson.apache.org>.
See <https://hudson.apache.org/hudson/job/Cayenne-30/./jdk=JDK%201.6%20(latest),label=Ubuntu/95/changes>