You are viewing a plain text version of this content. The canonical link for it is here.
Posted to notifications@jclouds.apache.org by BuildHive <bu...@cloudbees.com> on 2014/05/13 10:50:33 UTC

Build failed in Jenkins: jclouds » jclouds-labs #1028

See <https://buildhive.cloudbees.com/job/jclouds/job/jclouds-labs/1028/changes>

Changes:

[Ignasi Barrera] Address checkstyle violations

------------------------------------------
GitHub pull request #60 to jclouds/jclouds-labs
Building remotely on s-1c6a6d25 in workspace <https://buildhive.cloudbees.com/job/jclouds/job/jclouds-labs/ws/>
Fetching changes from the remote Git repository
Fetching upstream changes from git://github.com/jclouds/jclouds-labs.git
  Opening connection
    Done: 0
  Counting objects
    Done: 24
  Finding sources
    Done: 24
  Getting sizes
    Done: 22
  Compressing objects
    Done: 1561
  Writing objects
    Done: 24
  remote: Resolving deltas
  remote: Updating references
Merging refs/tags/changes/1028
Checking out Revision 249bb586e820b4ca7ccd2fd78fd0ed3f865f12ca (master)
Cleaning workspace
Resetting working tree
Parsing POMs
Modules changed, recalculating dependency graph
[jclouds-labs] $ /usr/bin/tenant-isolate /opt/jdk/jdk1.7.latest/bin/java -XX:MaxPermSize=256m -cp /scratch/jenkins/maven3-agent.jar:/opt/maven/latest/boot/plexus-classworlds-2.5.1.jar org.jvnet.hudson.maven3.agent.Maven3Main /opt/maven/latest /scratch/jenkins/slave.jar /scratch/jenkins/maven3-interceptor.jar 41862
<===[JENKINS REMOTING CAPACITY]===>   channel started
log4j:WARN No appenders could be found for logger (org.apache.commons.beanutils.converters.BooleanConverter).
log4j:WARN Please initialize the log4j system properly.
Executing Maven:  -B -f <https://buildhive.cloudbees.com/job/jclouds/job/jclouds-labs/ws/pom.xml> clean verify -U -e -Dmaven.javadoc.skip=true
java.lang.reflect.InvocationTargetException
	at sun.reflect.NativeMethodAccessorImpl.invoke0(Native Method)
	at sun.reflect.NativeMethodAccessorImpl.invoke(NativeMethodAccessorImpl.java:57)
	at sun.reflect.DelegatingMethodAccessorImpl.invoke(DelegatingMethodAccessorImpl.java:43)
	at java.lang.reflect.Method.invoke(Method.java:606)
	at org.codehaus.plexus.classworlds.launcher.Launcher.launchStandard(Launcher.java:330)
	at org.codehaus.plexus.classworlds.launcher.Launcher.launch(Launcher.java:238)
	at org.jvnet.hudson.maven3.agent.Maven3Main.launch(Maven3Main.java:158)
	at hudson.maven.Maven3Builder.call(Maven3Builder.java:104)
	at hudson.maven.Maven3Builder.call(Maven3Builder.java:70)
	at hudson.remoting.UserRequest.perform(UserRequest.java:118)
	at hudson.remoting.UserRequest.perform(UserRequest.java:48)
	at hudson.remoting.Request$2.run(Request.java:328)
	at hudson.remoting.InterceptingExecutorService$1.call(InterceptingExecutorService.java:72)
	at java.util.concurrent.FutureTask.run(FutureTask.java:262)
	at java.util.concurrent.ThreadPoolExecutor.runWorker(ThreadPoolExecutor.java:1145)
	at java.util.concurrent.ThreadPoolExecutor$Worker.run(ThreadPoolExecutor.java:615)
	at java.lang.Thread.run(Thread.java:744)
Caused by: java.lang.NoClassDefFoundError: org/apache/maven/cli/MavenLoggerManager
	at org.jvnet.hudson.maven3.launcher.Maven3Launcher.main(Maven3Launcher.java:73)
	... 17 more
Caused by: java.lang.ClassNotFoundException: org.apache.maven.cli.MavenLoggerManager
	at org.codehaus.plexus.classworlds.strategy.SelfFirstStrategy.loadClass(SelfFirstStrategy.java:50)
	at org.codehaus.plexus.classworlds.realm.ClassRealm.unsynchronizedLoadClass(ClassRealm.java:259)
	at org.codehaus.plexus.classworlds.realm.ClassRealm.loadClass(ClassRealm.java:235)
	at org.codehaus.plexus.classworlds.realm.ClassRealm.loadClass(ClassRealm.java:227)
	... 18 more
channel stopped
ERROR: Failed to parse POMs
hudson.util.IOException2: java.lang.reflect.InvocationTargetException
	at hudson.maven.Maven3Builder.call(Maven3Builder.java:158)
	at hudson.maven.Maven3Builder.call(Maven3Builder.java:70)
	at hudson.remoting.UserRequest.perform(UserRequest.java:118)
	at hudson.remoting.UserRequest.perform(UserRequest.java:48)
	at hudson.remoting.Request$2.run(Request.java:328)
	at hudson.remoting.InterceptingExecutorService$1.call(InterceptingExecutorService.java:72)
	at java.util.concurrent.FutureTask.run(FutureTask.java:262)
	at java.util.concurrent.ThreadPoolExecutor.runWorker(ThreadPoolExecutor.java:1145)
	at java.util.concurrent.ThreadPoolExecutor$Worker.run(ThreadPoolExecutor.java:615)
	at java.lang.Thread.run(Thread.java:744)
Caused by: java.lang.Exception: java.lang.reflect.InvocationTargetException
	at org.jvnet.hudson.maven3.agent.Maven3Main.launch(Maven3Main.java:161)
	at hudson.maven.Maven3Builder.call(Maven3Builder.java:104)
	... 9 more
Caused by: java.lang.reflect.InvocationTargetException
	at sun.reflect.NativeMethodAccessorImpl.invoke0(Native Method)
	at sun.reflect.NativeMethodAccessorImpl.invoke(NativeMethodAccessorImpl.java:57)
	at sun.reflect.DelegatingMethodAccessorImpl.invoke(DelegatingMethodAccessorImpl.java:43)
	at java.lang.reflect.Method.invoke(Method.java:606)
	at org.codehaus.plexus.classworlds.launcher.Launcher.launchStandard(Launcher.java:330)
	at org.codehaus.plexus.classworlds.launcher.Launcher.launch(Launcher.java:238)
	at org.jvnet.hudson.maven3.agent.Maven3Main.launch(Maven3Main.java:158)
	... 10 more
Caused by: java.lang.NoClassDefFoundError: org/apache/maven/cli/MavenLoggerManager
	at org.jvnet.hudson.maven3.launcher.Maven3Launcher.main(Maven3Launcher.java:73)
	... 17 more
Caused by: java.lang.ClassNotFoundException: org.apache.maven.cli.MavenLoggerManager
	at org.codehaus.plexus.classworlds.strategy.SelfFirstStrategy.loadClass(SelfFirstStrategy.java:50)
	at org.codehaus.plexus.classworlds.realm.ClassRealm.unsynchronizedLoadClass(ClassRealm.java:259)
	at org.codehaus.plexus.classworlds.realm.ClassRealm.loadClass(ClassRealm.java:235)
	at org.codehaus.plexus.classworlds.realm.ClassRealm.loadClass(ClassRealm.java:227)
	... 18 more

Jenkins build is back to normal : jclouds » jclouds-labs #1032

Posted by BuildHive <bu...@cloudbees.com>.
See <https://buildhive.cloudbees.com/job/jclouds/job/jclouds-labs/1032/changes>


Build failed in Jenkins: jclouds » jclouds-labs #1031

Posted by BuildHive <bu...@cloudbees.com>.
See <https://buildhive.cloudbees.com/job/jclouds/job/jclouds-labs/1031/changes>

Changes:

[igreenfi] Add vSphere support

[igreenfi] Remove copyright from pom.xml

------------------------------------------
[...truncated 6096 lines...]
[INFO] Exclude: **/*LoggingModule
[INFO] Exclude: **/*ViewMBeanFactory
[INFO] Exclude: **/target/**
[INFO] Exclude: **/test-output/**
[INFO] Exclude: **/bin/**
[INFO] Exclude: **/.settings/**
[INFO] Exclude: **/.classpath
[INFO] Exclude: **/.dir-locals.el
[INFO] Exclude: **/.project
[INFO] Exclude: **/.idea/**
[INFO] Exclude: **/*.iml
[INFO] Exclude: **/*.eml
[INFO] Exclude: **/*.ipr
[INFO] Exclude: **/*.iws
[INFO] Exclude: **/*.DS_STORE
[INFO] Exclude: **/TAGS
[INFO] Exclude: **/.metadata/**
[INFO] Exclude: **/atlassian-ide-plugin.xml
[INFO] Exclude: **/.DS_Store
[INFO] Exclude: .mailmap
[INFO] Exclude: .git/**
[INFO] Exclude: **/.gitignore
[INFO] Exclude: **/.gitattributes
[INFO] Exclude: .repository/**
[INFO] Exclude: .repository/**
[INFO] Exclude: gc.log
[INFO] 4 resources included (use -debug for more details)
Warning:  org.apache.xerces.jaxp.SAXParserImpl$JAXPSAXParser: Property 'http://www.oracle.com/xml/jaxp/properties/entityExpansionLimit' is not recognized.
Compiler warnings:
  WARNING:  'org.apache.xerces.jaxp.SAXParserImpl: Property 'http://javax.xml.XMLConstants/property/accessExternalDTD' is not recognized.'
Warning:  org.apache.xerces.parsers.SAXParser: Feature 'http://javax.xml.XMLConstants/feature/secure-processing' is not recognized.
Warning:  org.apache.xerces.parsers.SAXParser: Property 'http://javax.xml.XMLConstants/property/accessExternalDTD' is not recognized.
Warning:  org.apache.xerces.parsers.SAXParser: Property 'http://www.oracle.com/xml/jaxp/properties/entityExpansionLimit' is not recognized.
[INFO] Rat check: Summary of files. Unapproved: 0 unknown: 0 generated: 0 approved: 4 licence.
[INFO] 
[INFO] --- maven-jar-plugin:2.4:test-jar (default) @ management-blobstore ---
[INFO] Building jar: <https://buildhive.cloudbees.com/job/jclouds/job/jclouds-labs/ws/jclouds-management/management-blobstore/target/management-blobstore-1.8.0-SNAPSHOT-tests.jar>
[INFO] 
[INFO] --- maven-surefire-plugin:2.12.4:test (integration) @ management-blobstore ---
[JENKINS] Recording test results
[INFO] 
[INFO] --- maven-duplicate-finder-plugin:1.0.5:check (default) @ management-blobstore ---
[INFO] Checking compile classpath
[INFO] Checking runtime classpath
[INFO] Checking test classpath
[JENKINS] Archiving <https://buildhive.cloudbees.com/job/jclouds/job/jclouds-labs/ws/jclouds-management/management-blobstore/pom.xml> to /home/jenkins/jenkins_home/jobs/jclouds/jobs/jclouds-labs/modules/org.apache.jclouds.labs.management$management-blobstore/builds/2014-05-14_05-55-27/archive/org.apache.jclouds.labs.management/management-blobstore/1.8.0-SNAPSHOT/management-blobstore-1.8.0-SNAPSHOT.pom
[JENKINS] Archiving <https://buildhive.cloudbees.com/job/jclouds/job/jclouds-labs/ws/jclouds-management/management-blobstore/target/management-blobstore-1.8.0-SNAPSHOT.jar> to /home/jenkins/jenkins_home/jobs/jclouds/jobs/jclouds-labs/modules/org.apache.jclouds.labs.management$management-blobstore/builds/2014-05-14_05-55-27/archive/org.apache.jclouds.labs.management/management-blobstore/1.8.0-SNAPSHOT/management-blobstore-1.8.0-SNAPSHOT.jar
[JENKINS] Archiving <https://buildhive.cloudbees.com/job/jclouds/job/jclouds-labs/ws/jclouds-management/management-blobstore/target/management-blobstore-1.8.0-SNAPSHOT-tests.jar> to /home/jenkins/jenkins_home/jobs/jclouds/jobs/jclouds-labs/modules/org.apache.jclouds.labs.management$management-blobstore/builds/2014-05-14_05-55-27/archive/org.apache.jclouds.labs.management/management-blobstore/1.8.0-SNAPSHOT/management-blobstore-1.8.0-SNAPSHOT-tests.jar
[INFO]                                                                         
[INFO] ------------------------------------------------------------------------
[INFO] Building jclouds vSphere api (lab) 1.8.0-SNAPSHOT
[INFO] ------------------------------------------------------------------------
Downloading: http://repo.cloudbees.com/content/repositories/central/com/vmware/vijava/5.1/vijava-5.1.pom
Downloaded: http://repo.cloudbees.com/content/repositories/central/com/vmware/vijava/5.1/vijava-5.1.pom (2 KB at 16.7 KB/sec)
Downloading: http://repo.cloudbees.com/content/repositories/central/dom4j/dom4j/1.6.1/dom4j-1.6.1.pom
Downloaded: http://repo.cloudbees.com/content/repositories/central/dom4j/dom4j/1.6.1/dom4j-1.6.1.pom (7 KB at 194.3 KB/sec)
Downloading: http://repo.cloudbees.com/content/repositories/central/com/vmware/vijava/5.1/vijava-5.1.jar
Downloading: http://repo.cloudbees.com/content/repositories/central/dom4j/dom4j/1.6.1/dom4j-1.6.1.jar
Downloaded: http://repo.cloudbees.com/content/repositories/central/dom4j/dom4j/1.6.1/dom4j-1.6.1.jar (307 KB at 1666.0 KB/sec)
Downloaded: http://repo.cloudbees.com/content/repositories/central/com/vmware/vijava/5.1/vijava-5.1.jar (1979 KB at 6088.5 KB/sec)
[INFO] 
[INFO] --- maven-clean-plugin:2.5:clean (default-clean) @ vsphere ---
[INFO] 
[INFO] --- maven-enforcer-plugin:1.1.1:enforce (enforce-banned-dependencies) @ vsphere ---
[INFO] 
[INFO] --- maven-enforcer-plugin:1.1.1:enforce (enforce-java) @ vsphere ---
[INFO] [INFO] artifact net.schmizz:sshj: checking for updates from central

[INFO] --- maven-remote-resources-plugin:1.5:process (default) @ vsphere ---
[INFO] artifact net.schmizz:sshj: checking for updates from jclouds-sona-snapshots-nexus
[INFO] [INFO] Using 'UTF-8' encoding to copy filtered resources.

[INFO] --- maven-resources-plugin:2.6:resources (default-resources) @ vsphere ---
[INFO] skip non existing resourceDirectory <https://buildhive.cloudbees.com/job/jclouds/job/jclouds-labs/ws/vsphere/src/main/clojure>
[INFO] Copying 1 resource
[INFO] Copying 3 resources
[INFO] [INFO] Changes detected - recompiling the module!
[INFO] Compiling 29 source files to <https://buildhive.cloudbees.com/job/jclouds/job/jclouds-labs/ws/vsphere/target/classes>

[INFO] --- maven-compiler-plugin:3.1:compile (default-compile) @ vsphere ---
[WARNING] bootstrap class path not set in conjunction with -source 1.6
[WARNING] <https://buildhive.cloudbees.com/job/jclouds/job/jclouds-labs/ws/vsphere/src/main/java/org/jclouds/vsphere/loaders/VSphereTemplateLoader.java>:[66,9] finally clause cannot complete normally
[WARNING] <https://buildhive.cloudbees.com/job/jclouds/job/jclouds-labs/ws/vsphere/src/main/java/org/jclouds/vsphere/compute/config/VSphereComputeServiceContextModule.java>: <https://buildhive.cloudbees.com/job/jclouds/job/jclouds-labs/ws/vsphere/src/main/java/org/jclouds/vsphere/compute/config/VSphereComputeServiceContextModule.java> uses unchecked or unsafe operations.
[WARNING] <https://buildhive.cloudbees.com/job/jclouds/job/jclouds-labs/ws/vsphere/src/main/java/org/jclouds/vsphere/compute/config/VSphereComputeServiceContextModule.java>: Recompile with -Xlint:unchecked for details.
[INFO] 
[INFO] --- maven-resources-plugin:2.6:testResources (default-testResources) @ vsphere ---
[INFO] Using 'UTF-8' encoding to copy filtered resources.
[INFO] skip non existing resourceDirectory <https://buildhive.cloudbees.com/job/jclouds/job/jclouds-labs/ws/vsphere/src/test/clojure>
[INFO] Copying 1 resource
[INFO] Copying 3 resources
[INFO] 
[INFO] --- maven-compiler-plugin:3.1:testCompile (default-testCompile) @ vsphere ---
[INFO] Changes detected - recompiling the module!
[INFO] Compiling 1 source file to <https://buildhive.cloudbees.com/job/jclouds/job/jclouds-labs/ws/vsphere/target/test-classes>
[WARNING] bootstrap class path not set in conjunction with -source 1.6
[WARNING] <https://buildhive.cloudbees.com/job/jclouds/job/jclouds-labs/ws/vsphere/src/test/java/org/jclouds/vsphere/ContextBuilderTest.java>: <https://buildhive.cloudbees.com/job/jclouds/job/jclouds-labs/ws/vsphere/src/test/java/org/jclouds/vsphere/ContextBuilderTest.java> uses unchecked or unsafe operations.
[WARNING] <https://buildhive.cloudbees.com/job/jclouds/job/jclouds-labs/ws/vsphere/src/test/java/org/jclouds/vsphere/ContextBuilderTest.java>: Recompile with -Xlint:unchecked for details.
[INFO] 
[INFO] --- maven-surefire-plugin:2.12.4:test (default-test) @ vsphere ---
[INFO] Surefire report directory: <https://buildhive.cloudbees.com/job/jclouds/job/jclouds-labs/ws/vsphere/target/surefire-reports>

-------------------------------------------------------
 T E S T S
-------------------------------------------------------
Running org.jclouds.vsphere.ContextBuilderTest
Configuring TestNG with: org.apache.maven.surefire.testng.conf.TestNG652Configurator@4dd6c275
Tests run: 0, Failures: 0, Errors: 0, Skipped: 0, Time elapsed: 1.776 sec

Results :

Tests run: 0, Failures: 0, Errors: 0, Skipped: 0

[JENKINS] Recording test results
[INFO] 
[INFO] --- maven-bundle-plugin:2.3.7:bundle (default-bundle) @ vsphere ---
[INFO] 
[INFO] --- maven-site-plugin:3.3:attach-descriptor (attach-descriptor) @ vsphere ---
[INFO] 
[INFO] --- apache-rat-plugin:0.10:check (default) @ vsphere ---
[INFO] 51 implicit excludes (use -debug for more details).
[INFO] Exclude: **/src/test/resources/**/*.sh
[INFO] Exclude: **/src/test/resources/**/*.bat
[INFO] Exclude: **/src/test/resources/**/*.cmd
[INFO] Exclude: **/src/test/resources/**/*.txt
[INFO] Exclude: **/src/test/resources/**/*.gz
[INFO] Exclude: **/src/test/resources/**/*.xml
[INFO] Exclude: **/src/test/resources/**/*.iso
[INFO] Exclude: **/LICENSE.txt
[INFO] Exclude: **/header.txt
[INFO] Exclude: **/NOTICE.txt
[INFO] Exclude: **/DISCLAIMER
[INFO] Exclude: **/BUILD.txt
[INFO] Exclude: **/CHANGES.txt
[INFO] Exclude: **/README.md
[INFO] Exclude: **/README.txt
[INFO] Exclude: **/DEPENDENCIES
[INFO] Exclude: **/*json
[INFO] Exclude: **/*readme
[INFO] Exclude: **/*ProviderMetadata
[INFO] Exclude: **/*ApiMetadata
[INFO] Exclude: **/*LoggingModule
[INFO] Exclude: **/*ViewMBeanFactory
[INFO] Exclude: **/target/**
[INFO] Exclude: **/test-output/**
[INFO] Exclude: **/bin/**
[INFO] Exclude: **/.settings/**
[INFO] Exclude: **/.classpath
[INFO] Exclude: **/.dir-locals.el
[INFO] Exclude: **/.project
[INFO] Exclude: **/.idea/**
[INFO] Exclude: **/*.iml
[INFO] Exclude: **/*.eml
[INFO] Exclude: **/*.ipr
[INFO] Exclude: **/*.iws
[INFO] Exclude: **/*.DS_STORE
[INFO] Exclude: **/TAGS
[INFO] Exclude: **/.metadata/**
[INFO] Exclude: **/atlassian-ide-plugin.xml
[INFO] Exclude: **/.DS_Store
[INFO] Exclude: .mailmap
[INFO] Exclude: .git/**
[INFO] Exclude: **/.gitignore
[INFO] Exclude: **/.gitattributes
[INFO] Exclude: .repository/**
[INFO] Exclude: .repository/**
[INFO] Exclude: gc.log
[INFO] 31 resources included (use -debug for more details)
Warning:  org.apache.xerces.jaxp.SAXParserImpl$JAXPSAXParser: Property 'http://www.oracle.com/xml/jaxp/properties/entityExpansionLimit' is not recognized.
Compiler warnings:
  WARNING:  'org.apache.xerces.jaxp.SAXParserImpl: Property 'http://javax.xml.XMLConstants/property/accessExternalDTD' is not recognized.'
Warning:  org.apache.xerces.parsers.SAXParser: Feature 'http://javax.xml.XMLConstants/feature/secure-processing' is not recognized.
Warning:  org.apache.xerces.parsers.SAXParser: Property 'http://javax.xml.XMLConstants/property/accessExternalDTD' is not recognized.
Warning:  org.apache.xerces.parsers.SAXParser: Property 'http://www.oracle.com/xml/jaxp/properties/entityExpansionLimit' is not recognized.
[INFO] Rat check: Summary of files. Unapproved: 1 unknown: 1 generated: 0 approved: 30 licence.
[JENKINS] Archiving <https://buildhive.cloudbees.com/job/jclouds/job/jclouds-labs/ws/vsphere/pom.xml> to /home/jenkins/jenkins_home/jobs/jclouds/jobs/jclouds-labs/modules/org.apache.jclouds.api$vsphere/builds/2014-05-14_05-55-27/archive/org.apache.jclouds.api/vsphere/1.8.0-SNAPSHOT/vsphere-1.8.0-SNAPSHOT.pom
[JENKINS] Archiving <https://buildhive.cloudbees.com/job/jclouds/job/jclouds-labs/ws/vsphere/target/vsphere-1.8.0-SNAPSHOT.jar> to /home/jenkins/jenkins_home/jobs/jclouds/jobs/jclouds-labs/modules/org.apache.jclouds.api$vsphere/builds/2014-05-14_05-55-27/archive/org.apache.jclouds.api/vsphere/1.8.0-SNAPSHOT/vsphere-1.8.0-SNAPSHOT.jar
[INFO] ------------------------------------------------------------------------
[INFO] Reactor Summary:
[INFO] 
[INFO] Apache jclouds labs ............................... SUCCESS [36.160s]
[INFO] jclouds virtualbox api ............................ SUCCESS [1:26.647s]
[INFO] jclouds dmtf domain objects ....................... SUCCESS [8.434s]
[INFO] jclouds vcloud-director api ....................... SUCCESS [2:09.417s]
[INFO] jclouds cdmi api .................................. SUCCESS [17.965s]
[INFO] jclouds CloudSigma v2 API ......................... SUCCESS [1:17.560s]
[INFO] jclouds CloudSigma v2 Las Vegas Provider .......... SUCCESS [4.928s]
[INFO] jclouds CloudSigma v2 Washington DC Provider ...... SUCCESS [5.269s]
[INFO] jclouds CloudSigma v2 Zurich Provider ............. SUCCESS [4.209s]
[INFO] jclouds DigitalOcean Provider ..................... SUCCESS [1:01.225s]
[INFO] jclouds joyent-cloudapi api ....................... SUCCESS [42.434s]
[INFO] jclouds joyentcloud provider ...................... SUCCESS [6.972s]
[INFO] jclouds Fujitsu Global Cloud Platform ............. SUCCESS [1:15.051s]
[INFO] jclouds Fujitsu Global Cloud Platform AU provider . SUCCESS [8.929s]
[INFO] jclouds Fujitsu Global Cloud Platform DE provider . SUCCESS [8.347s]
[INFO] jclouds Abiquo api ................................ SUCCESS [1:49.000s]
[INFO] jclouds :: represetations ......................... SUCCESS [0.843s]
[INFO] jclouds :: representations :: core ................ SUCCESS [8.392s]
[INFO] jclouds :: representations :: codec ............... SUCCESS [21.178s]
[INFO] jclouds :: management ............................. SUCCESS [0.947s]
[INFO] jclouds :: management :: core ..................... SUCCESS [12.454s]
[INFO] jclouds :: management :: compute .................. SUCCESS [2.092s]
[INFO] jclouds :: management :: blobstore ................ SUCCESS [2.341s]
[INFO] jclouds vSphere api (lab) ......................... FAILURE [7.525s]
[INFO] ------------------------------------------------------------------------
[INFO] BUILD FAILURE
[INFO] ------------------------------------------------------------------------
[INFO] Total time: 12:49.379s
[INFO] Finished at: Wed May 14 06:08:34 UTC 2014
[INFO] Final Memory: 64M/153M
[INFO] ------------------------------------------------------------------------
mavenExecutionResult exceptions not empty
message : Failed to execute goal org.apache.rat:apache-rat-plugin:0.10:check (default) on project vsphere: Too many files with unapproved license: 1 See RAT report in: <https://buildhive.cloudbees.com/job/jclouds/job/jclouds-labs/ws/vsphere/target/rat.txt>
cause : Too many files with unapproved license: 1 See RAT report in: <https://buildhive.cloudbees.com/job/jclouds/job/jclouds-labs/ws/vsphere/target/rat.txt>
Stack trace : 
org.apache.maven.lifecycle.LifecycleExecutionException: Failed to execute goal org.apache.rat:apache-rat-plugin:0.10:check (default) on project vsphere: Too many files with unapproved license: 1 See RAT report in: <https://buildhive.cloudbees.com/job/jclouds/job/jclouds-labs/ws/vsphere/target/rat.txt>
	at org.apache.maven.lifecycle.internal.MojoExecutor.execute(MojoExecutor.java:213)
	at org.apache.maven.lifecycle.internal.MojoExecutor.execute(MojoExecutor.java:153)
	at org.apache.maven.lifecycle.internal.MojoExecutor.execute(MojoExecutor.java:145)
	at org.apache.maven.lifecycle.internal.LifecycleModuleBuilder.buildProject(LifecycleModuleBuilder.java:84)
	at org.apache.maven.lifecycle.internal.LifecycleModuleBuilder.buildProject(LifecycleModuleBuilder.java:59)
	at org.apache.maven.lifecycle.internal.LifecycleStarter.singleThreadedBuild(LifecycleStarter.java:183)
	at org.apache.maven.lifecycle.internal.LifecycleStarter.execute(LifecycleStarter.java:161)
	at org.apache.maven.DefaultMaven.doExecute(DefaultMaven.java:320)
	at org.apache.maven.DefaultMaven.execute(DefaultMaven.java:156)
	at org.jvnet.hudson.maven3.launcher.Maven3Launcher.main(Maven3Launcher.java:79)
	at sun.reflect.NativeMethodAccessorImpl.invoke0(Native Method)
	at sun.reflect.NativeMethodAccessorImpl.invoke(NativeMethodAccessorImpl.java:57)
	at sun.reflect.DelegatingMethodAccessorImpl.invoke(DelegatingMethodAccessorImpl.java:43)
	at java.lang.reflect.Method.invoke(Method.java:606)
	at org.codehaus.plexus.classworlds.launcher.Launcher.launchStandard(Launcher.java:329)
	at org.codehaus.plexus.classworlds.launcher.Launcher.launch(Launcher.java:239)
	at org.jvnet.hudson.maven3.agent.Maven3Main.launch(Maven3Main.java:158)
	at hudson.maven.Maven3Builder.call(Maven3Builder.java:104)
	at hudson.maven.Maven3Builder.call(Maven3Builder.java:70)
	at hudson.remoting.UserRequest.perform(UserRequest.java:118)
	at hudson.remoting.UserRequest.perform(UserRequest.java:48)
	at hudson.remoting.Request$2.run(Request.java:328)
	at hudson.remoting.InterceptingExecutorService$1.call(InterceptingExecutorService.java:72)
	at java.util.concurrent.FutureTask.run(FutureTask.java:262)
	at java.util.concurrent.ThreadPoolExecutor.runWorker(ThreadPoolExecutor.java:1145)
	at java.util.concurrent.ThreadPoolExecutor$Worker.run(ThreadPoolExecutor.java:615)
	at java.lang.Thread.run(Thread.java:744)
Caused by: org.apache.rat.mp.RatCheckException: Too many files with unapproved license: 1 See RAT report in: <https://buildhive.cloudbees.com/job/jclouds/job/jclouds-labs/ws/vsphere/target/rat.txt>
	at org.apache.rat.mp.RatCheckMojo.check(RatCheckMojo.java:183)
	at org.apache.rat.mp.RatCheckMojo.execute(RatCheckMojo.java:171)
	at org.apache.maven.plugin.DefaultBuildPluginManager.executeMojo(DefaultBuildPluginManager.java:101)
	at org.apache.maven.lifecycle.internal.MojoExecutor.execute(MojoExecutor.java:209)
	... 26 more
channel stopped

Build failed in Jenkins: jclouds » jclouds-labs #1030

Posted by BuildHive <bu...@cloudbees.com>.
See <https://buildhive.cloudbees.com/job/jclouds/job/jclouds-labs/1030/>

------------------------------------------
Started by upstream project "jclouds/jclouds" build number 1092
originally caused by:
 GitHub pull request #365 to jclouds/jclouds
Building remotely on s-1c6a6d25 in workspace <https://buildhive.cloudbees.com/job/jclouds/job/jclouds-labs/ws/>
Fetching changes from the remote Git repository
Fetching upstream changes from git://github.com/jclouds/jclouds-labs.git
Checking out Revision e255b82ce80f1abb0cf5440498b70692982e2612 (origin/master)
Cleaning workspace
Resetting working tree
Parsing POMs
Modules changed, recalculating dependency graph
[jclouds-labs] $ /usr/bin/tenant-isolate /opt/jdk/jdk1.7.latest/bin/java -XX:MaxPermSize=256m -cp /scratch/jenkins/maven3-agent.jar:/opt/maven/latest/boot/plexus-classworlds-2.5.1.jar org.jvnet.hudson.maven3.agent.Maven3Main /opt/maven/latest /scratch/jenkins/slave.jar /scratch/jenkins/maven3-interceptor.jar 44738
<===[JENKINS REMOTING CAPACITY]===>   channel started
log4j:WARN No appenders could be found for logger (org.apache.commons.beanutils.converters.BooleanConverter).
log4j:WARN Please initialize the log4j system properly.
Executing Maven:  -B -f <https://buildhive.cloudbees.com/job/jclouds/job/jclouds-labs/ws/pom.xml> clean verify -U -e -Dmaven.javadoc.skip=true
java.lang.reflect.InvocationTargetException
	at sun.reflect.NativeMethodAccessorImpl.invoke0(Native Method)
	at sun.reflect.NativeMethodAccessorImpl.invoke(NativeMethodAccessorImpl.java:57)
	at sun.reflect.DelegatingMethodAccessorImpl.invoke(DelegatingMethodAccessorImpl.java:43)
	at java.lang.reflect.Method.invoke(Method.java:606)
	at org.codehaus.plexus.classworlds.launcher.Launcher.launchStandard(Launcher.java:330)
	at org.codehaus.plexus.classworlds.launcher.Launcher.launch(Launcher.java:238)
	at org.jvnet.hudson.maven3.agent.Maven3Main.launch(Maven3Main.java:158)
	at hudson.maven.Maven3Builder.call(Maven3Builder.java:104)
	at hudson.maven.Maven3Builder.call(Maven3Builder.java:70)
	at hudson.remoting.UserRequest.perform(UserRequest.java:118)
	at hudson.remoting.UserRequest.perform(UserRequest.java:48)
	at hudson.remoting.Request$2.run(Request.java:328)
	at hudson.remoting.InterceptingExecutorService$1.call(InterceptingExecutorService.java:72)
	at java.util.concurrent.FutureTask.run(FutureTask.java:262)
	at java.util.concurrent.ThreadPoolExecutor.runWorker(ThreadPoolExecutor.java:1145)
	at java.util.concurrent.ThreadPoolExecutor$Worker.run(ThreadPoolExecutor.java:615)
	at java.lang.Thread.run(Thread.java:744)
Caused by: java.lang.NoClassDefFoundError: org/apache/maven/cli/MavenLoggerManager
	at org.jvnet.hudson.maven3.launcher.Maven3Launcher.main(Maven3Launcher.java:73)
	... 17 more
Caused by: java.lang.ClassNotFoundException: org.apache.maven.cli.MavenLoggerManager
	at org.codehaus.plexus.classworlds.strategy.SelfFirstStrategy.loadClass(SelfFirstStrategy.java:50)
	at org.codehaus.plexus.classworlds.realm.ClassRealm.unsynchronizedLoadClass(ClassRealm.java:259)
	at org.codehaus.plexus.classworlds.realm.ClassRealm.loadClass(ClassRealm.java:235)
	at org.codehaus.plexus.classworlds.realm.ClassRealm.loadClass(ClassRealm.java:227)
	... 18 more
channel stopped
ERROR: Failed to parse POMs
hudson.util.IOException2: java.lang.reflect.InvocationTargetException
	at hudson.maven.Maven3Builder.call(Maven3Builder.java:158)
	at hudson.maven.Maven3Builder.call(Maven3Builder.java:70)
	at hudson.remoting.UserRequest.perform(UserRequest.java:118)
	at hudson.remoting.UserRequest.perform(UserRequest.java:48)
	at hudson.remoting.Request$2.run(Request.java:328)
	at hudson.remoting.InterceptingExecutorService$1.call(InterceptingExecutorService.java:72)
	at java.util.concurrent.FutureTask.run(FutureTask.java:262)
	at java.util.concurrent.ThreadPoolExecutor.runWorker(ThreadPoolExecutor.java:1145)
	at java.util.concurrent.ThreadPoolExecutor$Worker.run(ThreadPoolExecutor.java:615)
	at java.lang.Thread.run(Thread.java:744)
Caused by: java.lang.Exception: java.lang.reflect.InvocationTargetException
	at org.jvnet.hudson.maven3.agent.Maven3Main.launch(Maven3Main.java:161)
	at hudson.maven.Maven3Builder.call(Maven3Builder.java:104)
	... 9 more
Caused by: java.lang.reflect.InvocationTargetException
	at sun.reflect.NativeMethodAccessorImpl.invoke0(Native Method)
	at sun.reflect.NativeMethodAccessorImpl.invoke(NativeMethodAccessorImpl.java:57)
	at sun.reflect.DelegatingMethodAccessorImpl.invoke(DelegatingMethodAccessorImpl.java:43)
	at java.lang.reflect.Method.invoke(Method.java:606)
	at org.codehaus.plexus.classworlds.launcher.Launcher.launchStandard(Launcher.java:330)
	at org.codehaus.plexus.classworlds.launcher.Launcher.launch(Launcher.java:238)
	at org.jvnet.hudson.maven3.agent.Maven3Main.launch(Maven3Main.java:158)
	... 10 more
Caused by: java.lang.NoClassDefFoundError: org/apache/maven/cli/MavenLoggerManager
	at org.jvnet.hudson.maven3.launcher.Maven3Launcher.main(Maven3Launcher.java:73)
	... 17 more
Caused by: java.lang.ClassNotFoundException: org.apache.maven.cli.MavenLoggerManager
	at org.codehaus.plexus.classworlds.strategy.SelfFirstStrategy.loadClass(SelfFirstStrategy.java:50)
	at org.codehaus.plexus.classworlds.realm.ClassRealm.unsynchronizedLoadClass(ClassRealm.java:259)
	at org.codehaus.plexus.classworlds.realm.ClassRealm.loadClass(ClassRealm.java:235)
	at org.codehaus.plexus.classworlds.realm.ClassRealm.loadClass(ClassRealm.java:227)
	... 18 more

Build failed in Jenkins: jclouds » jclouds-labs #1029

Posted by BuildHive <bu...@cloudbees.com>.
See <https://buildhive.cloudbees.com/job/jclouds/job/jclouds-labs/1029/changes>

Changes:

[igreenfi] Add vSphere support

------------------------------------------
GitHub pull request #61 to jclouds/jclouds-labs
Building remotely on s-1c6a6d25 in workspace <https://buildhive.cloudbees.com/job/jclouds/job/jclouds-labs/ws/>
Fetching changes from the remote Git repository
Fetching upstream changes from git://github.com/jclouds/jclouds-labs.git
  Opening connection
    Done: 0
  Counting objects
    Done: 65
  Finding sources
    Done: 65
  Getting sizes
    Done: 53
  Compressing objects
    Done: 0
  Writing objects
    Done: 65
  remote: Resolving deltas
  remote: Updating references
Merging refs/tags/changes/1029
Checking out Revision fe38f850d644ea8872dbe275a897898dbb7b0bf2 (master)
Cleaning workspace
Resetting working tree
Parsing POMs
Discovered a new module org.apache.jclouds.api:vsphere jclouds vSphere api (lab)
Modules changed, recalculating dependency graph
[jclouds-labs] $ /usr/bin/tenant-isolate /opt/jdk/jdk1.7.latest/bin/java -XX:MaxPermSize=256m -cp /scratch/jenkins/maven3-agent.jar:/opt/maven/latest/boot/plexus-classworlds-2.5.1.jar org.jvnet.hudson.maven3.agent.Maven3Main /opt/maven/latest /scratch/jenkins/slave.jar /scratch/jenkins/maven3-interceptor.jar 53631
<===[JENKINS REMOTING CAPACITY]===>   channel started
log4j:WARN No appenders could be found for logger (org.apache.commons.beanutils.converters.BooleanConverter).
log4j:WARN Please initialize the log4j system properly.
Executing Maven:  -B -f <https://buildhive.cloudbees.com/job/jclouds/job/jclouds-labs/ws/pom.xml> clean verify -U -e -Dmaven.javadoc.skip=true
java.lang.reflect.InvocationTargetException
	at sun.reflect.NativeMethodAccessorImpl.invoke0(Native Method)
	at sun.reflect.NativeMethodAccessorImpl.invoke(NativeMethodAccessorImpl.java:57)
	at sun.reflect.DelegatingMethodAccessorImpl.invoke(DelegatingMethodAccessorImpl.java:43)
	at java.lang.reflect.Method.invoke(Method.java:606)
	at org.codehaus.plexus.classworlds.launcher.Launcher.launchStandard(Launcher.java:330)
	at org.codehaus.plexus.classworlds.launcher.Launcher.launch(Launcher.java:238)
	at org.jvnet.hudson.maven3.agent.Maven3Main.launch(Maven3Main.java:158)
	at hudson.maven.Maven3Builder.call(Maven3Builder.java:104)
	at hudson.maven.Maven3Builder.call(Maven3Builder.java:70)
	at hudson.remoting.UserRequest.perform(UserRequest.java:118)
	at hudson.remoting.UserRequest.perform(UserRequest.java:48)
	at hudson.remoting.Request$2.run(Request.java:328)
	at hudson.remoting.InterceptingExecutorService$1.call(InterceptingExecutorService.java:72)
	at java.util.concurrent.FutureTask.run(FutureTask.java:262)
	at java.util.concurrent.ThreadPoolExecutor.runWorker(ThreadPoolExecutor.java:1145)
	at java.util.concurrent.ThreadPoolExecutor$Worker.run(ThreadPoolExecutor.java:615)
	at java.lang.Thread.run(Thread.java:744)
Caused by: java.lang.NoClassDefFoundError: org/apache/maven/cli/MavenLoggerManager
	at org.jvnet.hudson.maven3.launcher.Maven3Launcher.main(Maven3Launcher.java:73)
	... 17 more
Caused by: java.lang.ClassNotFoundException: org.apache.maven.cli.MavenLoggerManager
	at org.codehaus.plexus.classworlds.strategy.SelfFirstStrategy.loadClass(SelfFirstStrategy.java:50)
	at org.codehaus.plexus.classworlds.realm.ClassRealm.unsynchronizedLoadClass(ClassRealm.java:259)
	at org.codehaus.plexus.classworlds.realm.ClassRealm.loadClass(ClassRealm.java:235)
	at org.codehaus.plexus.classworlds.realm.ClassRealm.loadClass(ClassRealm.java:227)
	... 18 more
channel stopped
ERROR: Failed to parse POMs
hudson.util.IOException2: java.lang.reflect.InvocationTargetException
	at hudson.maven.Maven3Builder.call(Maven3Builder.java:158)
	at hudson.maven.Maven3Builder.call(Maven3Builder.java:70)
	at hudson.remoting.UserRequest.perform(UserRequest.java:118)
	at hudson.remoting.UserRequest.perform(UserRequest.java:48)
	at hudson.remoting.Request$2.run(Request.java:328)
	at hudson.remoting.InterceptingExecutorService$1.call(InterceptingExecutorService.java:72)
	at java.util.concurrent.FutureTask.run(FutureTask.java:262)
	at java.util.concurrent.ThreadPoolExecutor.runWorker(ThreadPoolExecutor.java:1145)
	at java.util.concurrent.ThreadPoolExecutor$Worker.run(ThreadPoolExecutor.java:615)
	at java.lang.Thread.run(Thread.java:744)
Caused by: java.lang.Exception: java.lang.reflect.InvocationTargetException
	at org.jvnet.hudson.maven3.agent.Maven3Main.launch(Maven3Main.java:161)
	at hudson.maven.Maven3Builder.call(Maven3Builder.java:104)
	... 9 more
Caused by: java.lang.reflect.InvocationTargetException
	at sun.reflect.NativeMethodAccessorImpl.invoke0(Native Method)
	at sun.reflect.NativeMethodAccessorImpl.invoke(NativeMethodAccessorImpl.java:57)
	at sun.reflect.DelegatingMethodAccessorImpl.invoke(DelegatingMethodAccessorImpl.java:43)
	at java.lang.reflect.Method.invoke(Method.java:606)
	at org.codehaus.plexus.classworlds.launcher.Launcher.launchStandard(Launcher.java:330)
	at org.codehaus.plexus.classworlds.launcher.Launcher.launch(Launcher.java:238)
	at org.jvnet.hudson.maven3.agent.Maven3Main.launch(Maven3Main.java:158)
	... 10 more
Caused by: java.lang.NoClassDefFoundError: org/apache/maven/cli/MavenLoggerManager
	at org.jvnet.hudson.maven3.launcher.Maven3Launcher.main(Maven3Launcher.java:73)
	... 17 more
Caused by: java.lang.ClassNotFoundException: org.apache.maven.cli.MavenLoggerManager
	at org.codehaus.plexus.classworlds.strategy.SelfFirstStrategy.loadClass(SelfFirstStrategy.java:50)
	at org.codehaus.plexus.classworlds.realm.ClassRealm.unsynchronizedLoadClass(ClassRealm.java:259)
	at org.codehaus.plexus.classworlds.realm.ClassRealm.loadClass(ClassRealm.java:235)
	at org.codehaus.plexus.classworlds.realm.ClassRealm.loadClass(ClassRealm.java:227)
	... 18 more