You are viewing a plain text version of this content. The canonical link for it is here.
Posted to yarn-dev@hadoop.apache.org by Apache Jenkins Server <je...@builds.apache.org> on 2015/08/13 23:33:05 UTC
Failed: YARN-4028 PreCommit Build #8844
Jira: https://issues.apache.org/jira/browse/YARN-4028
Build: https://builds.apache.org/job/PreCommit-YARN-Build/8844/
###################################################################################
########################## LAST 60 LINES OF THE CONSOLE ###########################
[...truncated 307 lines...]
| +1 | eclipse:eclipse | 0m 34s | The patch built with
| | | | eclipse:eclipse.
| +1 | findbugs | 2m 28s | The patch does not introduce any
| | | | new Findbugs (version 3.0.0)
| | | | warnings.
| +1 | yarn tests | 0m 26s | Tests passed in
| | | | hadoop-yarn-server-common.
| -1 | yarn tests | 53m 39s | Tests failed in
| | | | hadoop-yarn-server-resourcemanager.
| | | 95m 29s |
Reason | Tests
Failed unit tests | hadoop.yarn.server.resourcemanager.scheduler.capacity.TestContainerAllocation
|| Subsystem || Report/Notes ||
============================================================================
| Patch URL | http://issues.apache.org/jira/secure/attachment/12750360/0002-YARN-4028.patch |
| Optional Tests | javadoc javac unit findbugs checkstyle |
| git revision | trunk / b73181f |
| Pre-patch Findbugs warnings | /home/jenkins/jenkins-slave/workspace/PreCommit-YARN-Build/patchprocess/trunkFindbugsWarningshadoop-yarn-server-common.html |
| hadoop-yarn-server-common test log | /home/jenkins/jenkins-slave/workspace/PreCommit-YARN-Build/patchprocess/testrun_hadoop-yarn-server-common.txt |
| hadoop-yarn-server-resourcemanager test log | /home/jenkins/jenkins-slave/workspace/PreCommit-YARN-Build/patchprocess/testrun_hadoop-yarn-server-resourcemanager.txt |
| Test Results | https://builds.apache.org/job/PreCommit-YARN-Build/8844/testReport/ |
| Java | 1.7.0_55 |
| uname | Linux asf903.gq1.ygridcore.net 3.13.0-36-lowlatency #63-Ubuntu SMP PREEMPT Wed Sep 3 21:56:12 UTC 2014 x86_64 x86_64 x86_64 GNU/Linux |
============================================================================
============================================================================
Adding comment to JIRA
============================================================================
============================================================================
Comment added.
5a976b485af118dcd4cf88b72b557c8f2404842f logged out
============================================================================
============================================================================
Finished build.
============================================================================
============================================================================
Build step 'Execute shell' marked build as failure
Archiving artifacts
Sending artifact delta relative to PreCommit-YARN-Build #8782
Archived 43 artifacts
Archive block size is 32768
Received 42 blocks and 15677066 bytes
Compression is 8.1%
Took 3.4 sec
[description-setter] Could not determine description.
Recording test results
Email was triggered for: Failure
Sending email for trigger: Failure
###################################################################################
############################## FAILED TESTS (if any) ##############################
2 tests failed.
FAILED: org.apache.hadoop.yarn.server.resourcemanager.scheduler.capacity.TestContainerAllocation.testAMContainerAllocationWhenDNSUnavailable
Error Message:
expected:<SCHEDULED> but was:<ALLOCATED>
Stack Trace:
java.lang.AssertionError: expected:<SCHEDULED> but was:<ALLOCATED>
at org.junit.Assert.fail(Assert.java:88)
at org.junit.Assert.failNotEquals(Assert.java:743)
at org.junit.Assert.assertEquals(Assert.java:118)
at org.junit.Assert.assertEquals(Assert.java:144)
at org.apache.hadoop.yarn.server.resourcemanager.scheduler.capacity.TestContainerAllocation.testAMContainerAllocationWhenDNSUnavailable(TestContainerAllocation.java:321)
FAILED: org.apache.hadoop.yarn.server.resourcemanager.scheduler.capacity.TestContainerAllocation.testNormalContainerAllocationWhenDNSUnavailable
Error Message:
expected:<0> but was:<1>
Stack Trace:
java.lang.AssertionError: expected:<0> but was:<1>
at org.junit.Assert.fail(Assert.java:88)
at org.junit.Assert.failNotEquals(Assert.java:743)
at org.junit.Assert.assertEquals(Assert.java:118)
at org.junit.Assert.assertEquals(Assert.java:555)
at org.junit.Assert.assertEquals(Assert.java:542)
at org.apache.hadoop.yarn.server.resourcemanager.scheduler.capacity.TestContainerAllocation.testNormalContainerAllocationWhenDNSUnavailable(TestContainerAllocation.java:206)
Success: YARN-4051 PreCommit Build #8849
Posted by Apache Jenkins Server <je...@builds.apache.org>.
Jira: https://issues.apache.org/jira/browse/YARN-4051
Build: https://builds.apache.org/job/PreCommit-YARN-Build/8849/
###################################################################################
########################## LAST 60 LINES OF THE CONSOLE ###########################
[...truncated 282 lines...]
| | | | messages.
| +1 | release audit | 0m 23s | The applied patch does not increase
| | | | the total number of release audit
| | | | warnings.
| +1 | checkstyle | 0m 35s | There were no new checkstyle
| | | | issues.
| +1 | whitespace | 0m 1s | The patch has no lines that end in
| | | | whitespace.
| +1 | install | 1m 22s | mvn install still works.
| +1 | eclipse:eclipse | 0m 32s | The patch built with
| | | | eclipse:eclipse.
| +1 | findbugs | 1m 14s | The patch does not introduce any
| | | | new Findbugs (version 3.0.0)
| | | | warnings.
| +1 | yarn tests | 6m 16s | Tests passed in
| | | | hadoop-yarn-server-nodemanager.
| | | 43m 38s |
|| Subsystem || Report/Notes ||
============================================================================
| Patch URL | http://issues.apache.org/jira/secure/attachment/12750647/YARN-4051.02.patch |
| Optional Tests | javadoc javac unit findbugs checkstyle |
| git revision | trunk / 8dfec7a |
| hadoop-yarn-server-nodemanager test log | /home/jenkins/jenkins-slave/workspace/PreCommit-YARN-Build/patchprocess/testrun_hadoop-yarn-server-nodemanager.txt |
| Test Results | https://builds.apache.org/job/PreCommit-YARN-Build/8849/testReport/ |
| Java | 1.7.0_55 |
| uname | Linux asf906.gq1.ygridcore.net 3.13.0-36-lowlatency #63-Ubuntu SMP PREEMPT Wed Sep 3 21:56:12 UTC 2014 x86_64 x86_64 x86_64 GNU/Linux |
============================================================================
============================================================================
Adding comment to JIRA
============================================================================
============================================================================
Comment added.
d4d3ce255915e0bc5622818901f61034f68dea14 logged out
============================================================================
============================================================================
Finished build.
============================================================================
============================================================================
Archiving artifacts
Sending artifact delta relative to PreCommit-YARN-Build #8782
Archived 29 artifacts
Archive block size is 32768
Received 28 blocks and 10923390 bytes
Compression is 7.7%
Took 3.1 sec
Description set: YARN-4051
Recording test results
Email was triggered for: Success
Sending email for trigger: Success
###################################################################################
############################## FAILED TESTS (if any) ##############################
All tests passed
Failed: YARN-3045 PreCommit Build #8848
Posted by Apache Jenkins Server <je...@builds.apache.org>.
Jira: https://issues.apache.org/jira/browse/YARN-3045
Build: https://builds.apache.org/job/PreCommit-YARN-Build/8848/
###################################################################################
########################## LAST 60 LINES OF THE CONSOLE ###########################
[...truncated 418 lines...]
| +1 | yarn tests | 9m 20s | Tests passed in
| | | | hadoop-yarn-applications-distributeds
| | | | hell.
| +1 | yarn tests | 6m 9s | Tests passed in
| | | | hadoop-yarn-server-nodemanager.
| +1 | yarn tests | 1m 22s | Tests passed in
| | | | hadoop-yarn-server-timelineservice.
| | | 57m 28s |
Reason | Tests
FindBugs | module:hadoop-yarn-server-nodemanager
|| Subsystem || Report/Notes ||
============================================================================
| Patch URL | http://issues.apache.org/jira/secure/attachment/12750640/YARN-3045-YARN-2928.010.patch |
| Optional Tests | javac unit findbugs checkstyle javadoc |
| git revision | YARN-2928 / f40c735 |
| javac | /home/jenkins/jenkins-slave/workspace/PreCommit-YARN-Build/patchprocess/diffJavacWarnings.txt |
| Findbugs warnings | /home/jenkins/jenkins-slave/workspace/PreCommit-YARN-Build/patchprocess/newPatchFindbugsWarningshadoop-yarn-server-nodemanager.html |
| hadoop-yarn-applications-distributedshell test log | /home/jenkins/jenkins-slave/workspace/PreCommit-YARN-Build/patchprocess/testrun_hadoop-yarn-applications-distributedshell.txt |
| hadoop-yarn-server-nodemanager test log | /home/jenkins/jenkins-slave/workspace/PreCommit-YARN-Build/patchprocess/testrun_hadoop-yarn-server-nodemanager.txt |
| hadoop-yarn-server-timelineservice test log | /home/jenkins/jenkins-slave/workspace/PreCommit-YARN-Build/patchprocess/testrun_hadoop-yarn-server-timelineservice.txt |
| Test Results | https://builds.apache.org/job/PreCommit-YARN-Build/8848/testReport/ |
| Java | 1.7.0_55 |
| uname | Linux asf907.gq1.ygridcore.net 3.13.0-36-lowlatency #63-Ubuntu SMP PREEMPT Wed Sep 3 21:56:12 UTC 2014 x86_64 x86_64 x86_64 GNU/Linux |
============================================================================
============================================================================
Adding comment to JIRA
============================================================================
============================================================================
Comment added.
4b41e927b0474f7c8d626fd780e0484f93d59f2f logged out
============================================================================
============================================================================
Finished build.
============================================================================
============================================================================
Build step 'Execute shell' marked build as failure
Archiving artifacts
Sending artifact delta relative to PreCommit-YARN-Build #8782
Archived 52 artifacts
Archive block size is 32768
Received 34 blocks and 9768898 bytes
Compression is 10.2%
Took 2.3 sec
[description-setter] Could not determine description.
Recording test results
Email was triggered for: Failure
Sending email for trigger: Failure
###################################################################################
############################## FAILED TESTS (if any) ##############################
All tests passed
Failed: YARN-3458 PreCommit Build #8847
Posted by Apache Jenkins Server <je...@builds.apache.org>.
Jira: https://issues.apache.org/jira/browse/YARN-3458
Build: https://builds.apache.org/job/PreCommit-YARN-Build/8847/
###################################################################################
########################## LAST 60 LINES OF THE CONSOLE ###########################
[...truncated 292 lines...]
| -1 | whitespace | 0m 0s | The patch has 1 line(s) that end in
| | | | whitespace. Use git apply
| | | | --whitespace=fix.
| +1 | install | 1m 25s | mvn install still works.
| +1 | eclipse:eclipse | 0m 33s | The patch built with
| | | | eclipse:eclipse.
| +1 | findbugs | 1m 33s | The patch does not introduce any
| | | | new Findbugs (version 3.0.0)
| | | | warnings.
| -1 | yarn tests | 1m 56s | Tests failed in hadoop-yarn-common.
| | | 39m 3s |
Reason | Tests
Failed unit tests | hadoop.yarn.util.TestRackResolver
|| Subsystem || Report/Notes ||
============================================================================
| Patch URL | http://issues.apache.org/jira/secure/attachment/12750623/YARN-3458-7.patch |
| Optional Tests | javadoc javac unit findbugs checkstyle |
| git revision | trunk / dc7a061 |
| whitespace | /home/jenkins/jenkins-slave/workspace/PreCommit-YARN-Build/patchprocess/whitespace.txt |
| hadoop-yarn-common test log | /home/jenkins/jenkins-slave/workspace/PreCommit-YARN-Build/patchprocess/testrun_hadoop-yarn-common.txt |
| Test Results | https://builds.apache.org/job/PreCommit-YARN-Build/8847/testReport/ |
| Java | 1.7.0_55 |
| uname | Linux asf909.gq1.ygridcore.net 3.13.0-36-lowlatency #63-Ubuntu SMP PREEMPT Wed Sep 3 21:56:12 UTC 2014 x86_64 x86_64 x86_64 GNU/Linux |
============================================================================
============================================================================
Adding comment to JIRA
============================================================================
============================================================================
Comment added.
7a840a833f76321597421480e634ba785bbd5748 logged out
============================================================================
============================================================================
Finished build.
============================================================================
============================================================================
Build step 'Execute shell' marked build as failure
Archiving artifacts
Sending artifact delta relative to PreCommit-YARN-Build #8782
Archived 27 artifacts
Archive block size is 32768
Received 44 blocks and 8349077 bytes
Compression is 14.7%
Took 2.1 sec
[description-setter] Could not determine description.
Recording test results
Email was triggered for: Failure
Sending email for trigger: Failure
###################################################################################
############################## FAILED TESTS (if any) ##############################
1 tests failed.
FAILED: org.apache.hadoop.yarn.util.TestRackResolver.testCaching
Error Message:
expected:</[default-rack]> but was:</[rack1]>
Stack Trace:
org.junit.ComparisonFailure: expected:</[default-rack]> but was:</[rack1]>
at org.junit.Assert.assertEquals(Assert.java:115)
at org.junit.Assert.assertEquals(Assert.java:144)
at org.apache.hadoop.yarn.util.TestRackResolver.testCaching(TestRackResolver.java:102)
Failed: YARN-3904 PreCommit Build #8846
Posted by Apache Jenkins Server <je...@builds.apache.org>.
Jira: https://issues.apache.org/jira/browse/YARN-3904
Build: https://builds.apache.org/job/PreCommit-YARN-Build/8846/
###################################################################################
########################## LAST 60 LINES OF THE CONSOLE ###########################
[...truncated 343 lines...]
| | | | checkstyle issues (total was 214,
| | | | now 214).
| +1 | whitespace | 0m 0s | The patch has no lines that end in
| | | | whitespace.
| +1 | install | 1m 27s | mvn install still works.
| +1 | eclipse:eclipse | 0m 42s | The patch built with
| | | | eclipse:eclipse.
| +1 | findbugs | 2m 20s | The patch does not introduce any
| | | | new Findbugs (version 3.0.0)
| | | | warnings.
| +1 | yarn tests | 0m 24s | Tests passed in hadoop-yarn-api.
| +1 | yarn tests | 1m 25s | Tests passed in
| | | | hadoop-yarn-server-timelineservice.
| | | 43m 0s |
|| Subsystem || Report/Notes ||
============================================================================
| Patch URL | http://issues.apache.org/jira/secure/attachment/12750594/YARN-3904-YARN-2928.009.patch |
| Optional Tests | javadoc javac unit findbugs checkstyle |
| git revision | YARN-2928 / f40c735 |
| checkstyle | /home/jenkins/jenkins-slave/workspace/PreCommit-YARN-Build/patchprocess/diffcheckstylehadoop-yarn-api.txt |
| hadoop-yarn-api test log | /home/jenkins/jenkins-slave/workspace/PreCommit-YARN-Build/patchprocess/testrun_hadoop-yarn-api.txt |
| hadoop-yarn-server-timelineservice test log | /home/jenkins/jenkins-slave/workspace/PreCommit-YARN-Build/patchprocess/testrun_hadoop-yarn-server-timelineservice.txt |
| Test Results | https://builds.apache.org/job/PreCommit-YARN-Build/8846/testReport/ |
| Java | 1.7.0_55 |
| uname | Linux asf906.gq1.ygridcore.net 3.13.0-36-lowlatency #63-Ubuntu SMP PREEMPT Wed Sep 3 21:56:12 UTC 2014 x86_64 x86_64 x86_64 GNU/Linux |
============================================================================
============================================================================
Adding comment to JIRA
============================================================================
============================================================================
Comment added.
1a236a25ac3e875562a3fb78411561f072f2c914 logged out
============================================================================
============================================================================
Finished build.
============================================================================
============================================================================
Build step 'Execute shell' marked build as failure
Archiving artifacts
Sending artifact delta relative to PreCommit-YARN-Build #8782
Archived 42 artifacts
Archive block size is 32768
Received 26 blocks and 27423921 bytes
Compression is 3.0%
Took 11 sec
[description-setter] Could not determine description.
Recording test results
Email was triggered for: Failure
Sending email for trigger: Failure
###################################################################################
############################## FAILED TESTS (if any) ##############################
All tests passed
Failed: YARN-221 PreCommit Build #8845
Posted by Apache Jenkins Server <je...@builds.apache.org>.
Jira: https://issues.apache.org/jira/browse/YARN-221
Build: https://builds.apache.org/job/PreCommit-YARN-Build/8845/
###################################################################################
########################## LAST 60 LINES OF THE CONSOLE ###########################
[...truncated 450 lines...]
| | | | hadoop-yarn-server-nodemanager.
| -1 | yarn tests | 53m 19s | Tests failed in
| | | | hadoop-yarn-server-resourcemanager.
| | | 141m 10s |
Reason | Tests
Failed unit tests | hadoop.ha.TestZKFailoverController
| hadoop.net.TestNetUtils
| hadoop.yarn.util.TestRackResolver
| hadoop.yarn.server.resourcemanager.scheduler.capacity.TestContainerAllocation
|| Subsystem || Report/Notes ||
============================================================================
| Patch URL | http://issues.apache.org/jira/secure/attachment/12750361/YARN-221-9.patch |
| Optional Tests | javadoc javac unit findbugs checkstyle |
| git revision | trunk / b73181f |
| checkstyle | /home/jenkins/jenkins-slave/workspace/PreCommit-YARN-Build/patchprocess/diffcheckstylehadoop-yarn-api.txt |
| hadoop-common test log | /home/jenkins/jenkins-slave/workspace/PreCommit-YARN-Build/patchprocess/testrun_hadoop-common.txt |
| hadoop-yarn-api test log | /home/jenkins/jenkins-slave/workspace/PreCommit-YARN-Build/patchprocess/testrun_hadoop-yarn-api.txt |
| hadoop-yarn-common test log | /home/jenkins/jenkins-slave/workspace/PreCommit-YARN-Build/patchprocess/testrun_hadoop-yarn-common.txt |
| hadoop-yarn-server-nodemanager test log | /home/jenkins/jenkins-slave/workspace/PreCommit-YARN-Build/patchprocess/testrun_hadoop-yarn-server-nodemanager.txt |
| hadoop-yarn-server-resourcemanager test log | /home/jenkins/jenkins-slave/workspace/PreCommit-YARN-Build/patchprocess/testrun_hadoop-yarn-server-resourcemanager.txt |
| Test Results | https://builds.apache.org/job/PreCommit-YARN-Build/8845/testReport/ |
| Java | 1.7.0_55 |
| uname | Linux asf906.gq1.ygridcore.net 3.13.0-36-lowlatency #63-Ubuntu SMP PREEMPT Wed Sep 3 21:56:12 UTC 2014 x86_64 x86_64 x86_64 GNU/Linux |
============================================================================
============================================================================
Adding comment to JIRA
============================================================================
============================================================================
Comment added.
0b314b333948fbdd28c0649d2e96f9dc6d74411b logged out
============================================================================
============================================================================
Finished build.
============================================================================
============================================================================
Build step 'Execute shell' marked build as failure
Archiving artifacts
Sending artifact delta relative to PreCommit-YARN-Build #8782
Archived 86 artifacts
Archive block size is 32768
Received 28 blocks and 43732197 bytes
Compression is 2.1%
Took 8.9 sec
[description-setter] Could not determine description.
Recording test results
Email was triggered for: Failure
Sending email for trigger: Failure
###################################################################################
############################## FAILED TESTS (if any) ##############################
9 tests failed.
FAILED: org.apache.hadoop.ha.TestZKFailoverController.testGracefulFailoverFailBecomingStandbyAndFailFence
Error Message:
Failover should have failed when old node wont fence
Stack Trace:
java.lang.AssertionError: Failover should have failed when old node wont fence
at org.junit.Assert.fail(Assert.java:88)
at org.apache.hadoop.ha.TestZKFailoverController.testGracefulFailoverFailBecomingStandbyAndFailFence(TestZKFailoverController.java:557)
FAILED: org.apache.hadoop.ha.TestZKFailoverController.testGracefulFailover
Error Message:
test timed out after 25000 milliseconds
Stack Trace:
java.lang.Exception: test timed out after 25000 milliseconds
at java.lang.Thread.sleep(Native Method)
at org.apache.hadoop.ha.ActiveStandbyElectorTestUtil.waitForActiveLockData(ActiveStandbyElectorTestUtil.java:68)
at org.apache.hadoop.ha.MiniZKFCCluster.waitForActiveLockHolder(MiniZKFCCluster.java:253)
at org.apache.hadoop.ha.TestZKFailoverController.testGracefulFailover(TestZKFailoverController.java:449)
FAILED: org.apache.hadoop.ha.TestZKFailoverController.testGracefulFailoverFailBecomingStandby
Error Message:
expected:<1> but was:<0>
Stack Trace:
java.lang.AssertionError: expected:<1> but was:<0>
at org.junit.Assert.fail(Assert.java:88)
at org.junit.Assert.failNotEquals(Assert.java:743)
at org.junit.Assert.assertEquals(Assert.java:118)
at org.junit.Assert.assertEquals(Assert.java:555)
at org.junit.Assert.assertEquals(Assert.java:542)
at org.apache.hadoop.ha.TestZKFailoverController.testGracefulFailoverFailBecomingStandby(TestZKFailoverController.java:535)
FAILED: org.apache.hadoop.ha.TestZKFailoverController.testGracefulFailoverMultipleZKfcs
Error Message:
test timed out after 25000 milliseconds
Stack Trace:
java.lang.Exception: test timed out after 25000 milliseconds
at java.lang.Thread.sleep(Native Method)
at org.apache.hadoop.ha.ActiveStandbyElectorTestUtil.waitForActiveLockData(ActiveStandbyElectorTestUtil.java:68)
at org.apache.hadoop.ha.MiniZKFCCluster.waitForActiveLockHolder(MiniZKFCCluster.java:253)
at org.apache.hadoop.ha.TestZKFailoverController.testGracefulFailoverMultipleZKfcs(TestZKFailoverController.java:617)
FAILED: org.apache.hadoop.ha.TestZKFailoverController.testGracefulFailoverFailBecomingActive
Error Message:
Did not fail to graceful failover when target failed to become active!
Stack Trace:
java.lang.AssertionError: Did not fail to graceful failover when target failed to become active!
at org.junit.Assert.fail(Assert.java:88)
at org.apache.hadoop.ha.TestZKFailoverController.testGracefulFailoverFailBecomingActive(TestZKFailoverController.java:501)
FAILED: org.apache.hadoop.net.TestNetUtils.testNormalizeHostName
Error Message:
expected:<[198.105.254.11]> but was:<[UnknownHost123]>
Stack Trace:
org.junit.ComparisonFailure: expected:<[198.105.254.11]> but was:<[UnknownHost123]>
at org.junit.Assert.assertEquals(Assert.java:115)
at org.junit.Assert.assertEquals(Assert.java:144)
at org.apache.hadoop.net.TestNetUtils.testNormalizeHostName(TestNetUtils.java:631)
FAILED: org.apache.hadoop.yarn.util.TestRackResolver.testCaching
Error Message:
expected:</[default-rack]> but was:</[rack1]>
Stack Trace:
org.junit.ComparisonFailure: expected:</[default-rack]> but was:</[rack1]>
at org.junit.Assert.assertEquals(Assert.java:115)
at org.junit.Assert.assertEquals(Assert.java:144)
at org.apache.hadoop.yarn.util.TestRackResolver.testCaching(TestRackResolver.java:102)
FAILED: org.apache.hadoop.yarn.server.resourcemanager.scheduler.capacity.TestContainerAllocation.testAMContainerAllocationWhenDNSUnavailable
Error Message:
expected:<SCHEDULED> but was:<ALLOCATED>
Stack Trace:
java.lang.AssertionError: expected:<SCHEDULED> but was:<ALLOCATED>
at org.junit.Assert.fail(Assert.java:88)
at org.junit.Assert.failNotEquals(Assert.java:743)
at org.junit.Assert.assertEquals(Assert.java:118)
at org.junit.Assert.assertEquals(Assert.java:144)
at org.apache.hadoop.yarn.server.resourcemanager.scheduler.capacity.TestContainerAllocation.testAMContainerAllocationWhenDNSUnavailable(TestContainerAllocation.java:327)
FAILED: org.apache.hadoop.yarn.server.resourcemanager.scheduler.capacity.TestContainerAllocation.testNormalContainerAllocationWhenDNSUnavailable
Error Message:
expected:<0> but was:<1>
Stack Trace:
java.lang.AssertionError: expected:<0> but was:<1>
at org.junit.Assert.fail(Assert.java:88)
at org.junit.Assert.failNotEquals(Assert.java:743)
at org.junit.Assert.assertEquals(Assert.java:118)
at org.junit.Assert.assertEquals(Assert.java:555)
at org.junit.Assert.assertEquals(Assert.java:542)
at org.apache.hadoop.yarn.server.resourcemanager.scheduler.capacity.TestContainerAllocation.testNormalContainerAllocationWhenDNSUnavailable(TestContainerAllocation.java:206)