You are viewing a plain text version of this content. The canonical link for it is here.
Posted to dev@pulsar.apache.org by Apache Jenkins Server <je...@builds.apache.org> on 2018/05/22 17:31:03 UTC
Jenkins build became unstable: pulsar-master #491
See <https://builds.apache.org/job/pulsar-master/491/display/redirect?page=changes>
Jenkins build is still unstable: pulsar-master #497
Posted by Apache Jenkins Server <je...@builds.apache.org>.
See <https://builds.apache.org/job/pulsar-master/497/display/redirect?page=changes>
Jenkins build is still unstable: pulsar-master #496
Posted by Apache Jenkins Server <je...@builds.apache.org>.
See <https://builds.apache.org/job/pulsar-master/496/display/redirect?page=changes>
Jenkins build is still unstable: pulsar-master #495
Posted by Apache Jenkins Server <je...@builds.apache.org>.
See <https://builds.apache.org/job/pulsar-master/495/display/redirect?page=changes>
Jenkins build is still unstable: pulsar-master #494
Posted by Apache Jenkins Server <je...@builds.apache.org>.
See <https://builds.apache.org/job/pulsar-master/494/display/redirect?page=changes>
Jenkins build is unstable: pulsar-master #493
Posted by Apache Jenkins Server <je...@builds.apache.org>.
See <https://builds.apache.org/job/pulsar-master/493/display/redirect?page=changes>
Build failed in Jenkins: pulsar-master #492
Posted by Apache Jenkins Server <je...@builds.apache.org>.
See <https://builds.apache.org/job/pulsar-master/492/display/redirect?page=changes>
Changes:
[mmerli] In S3 offloader, dont use InputStream#available for stream length
------------------------------------------
[...truncated 341.88 KB...]
[INFO] Changes detected - recompiling the module!
[INFO] Compiling 135 source files to /home/jenkins/jenkins-slave/workspace/pulsar-master/pulsar-broker/target/test-classes
[WARNING] /home/jenkins/jenkins-slave/workspace/pulsar-master/pulsar-broker/src/test/java/org/apache/pulsar/broker/service/PersistentTopicE2ETest.java:[54,36] org.apache.pulsar.client.api.MessageBuilder in org.apache.pulsar.client.api has been deprecated
[WARNING] /home/jenkins/jenkins-slave/workspace/pulsar-master/pulsar-broker/src/test/java/org/apache/pulsar/client/api/v1/V1_ProducerConsumerTest.java:[60,36] org.apache.pulsar.client.api.ConsumerConfiguration in org.apache.pulsar.client.api has been deprecated
[WARNING] /home/jenkins/jenkins-slave/workspace/pulsar-master/pulsar-broker/src/test/java/org/apache/pulsar/client/api/v1/V1_ProducerConsumerTest.java:[65,36] org.apache.pulsar.client.api.MessageBuilder in org.apache.pulsar.client.api has been deprecated
[WARNING] /home/jenkins/jenkins-slave/workspace/pulsar-master/pulsar-broker/src/test/java/org/apache/pulsar/client/api/v1/V1_ProducerConsumerTest.java:[68,36] org.apache.pulsar.client.api.ProducerConfiguration in org.apache.pulsar.client.api has been deprecated
[WARNING] /home/jenkins/jenkins-slave/workspace/pulsar-master/pulsar-broker/src/test/java/org/apache/pulsar/client/impl/MessageIdTest.java:[47,36] org.apache.pulsar.client.api.MessageBuilder in org.apache.pulsar.client.api has been deprecated
[WARNING] /home/jenkins/jenkins-slave/workspace/pulsar-master/pulsar-broker/src/test/java/org/apache/pulsar/broker/service/v1/V1_ReplicatorTest.java:[62,36] org.apache.pulsar.client.api.MessageBuilder in org.apache.pulsar.client.api has been deprecated
[WARNING] /home/jenkins/jenkins-slave/workspace/pulsar-master/pulsar-broker/src/test/java/org/apache/pulsar/broker/service/v1/V1_ReplicatorTestBase.java:[41,36] org.apache.pulsar.client.api.MessageBuilder in org.apache.pulsar.client.api has been deprecated
[WARNING] /home/jenkins/jenkins-slave/workspace/pulsar-master/pulsar-broker/src/test/java/org/apache/pulsar/broker/service/BatchMessageTest.java:[44,36] org.apache.pulsar.client.api.MessageBuilder in org.apache.pulsar.client.api has been deprecated
[WARNING] /home/jenkins/jenkins-slave/workspace/pulsar-master/pulsar-broker/src/test/java/org/apache/pulsar/compaction/CompactionTest.java:[52,36] org.apache.pulsar.client.api.MessageBuilder in org.apache.pulsar.client.api has been deprecated
[WARNING] /home/jenkins/jenkins-slave/workspace/pulsar-master/pulsar-broker/src/test/java/org/apache/pulsar/compaction/CompactorTest.java:[37,36] org.apache.pulsar.client.api.MessageBuilder in org.apache.pulsar.client.api has been deprecated
[WARNING] /home/jenkins/jenkins-slave/workspace/pulsar-master/pulsar-broker/src/test/java/org/apache/pulsar/broker/service/ReplicatorTestBase.java:[38,36] org.apache.pulsar.client.api.MessageBuilder in org.apache.pulsar.client.api has been deprecated
[WARNING] /home/jenkins/jenkins-slave/workspace/pulsar-master/pulsar-broker/src/test/java/org/apache/pulsar/broker/service/ReplicatorTest.java:[54,36] org.apache.pulsar.client.api.MessageBuilder in org.apache.pulsar.client.api has been deprecated
[WARNING] /home/jenkins/jenkins-slave/workspace/pulsar-master/pulsar-broker/src/test/java/org/apache/pulsar/broker/service/PersistentTopicE2ETest.java:[54,36] org.apache.pulsar.client.api.MessageBuilder in org.apache.pulsar.client.api has been deprecated
[WARNING] /home/jenkins/jenkins-slave/workspace/pulsar-master/pulsar-broker/src/test/java/org/apache/pulsar/client/api/v1/V1_ProducerConsumerTest.java:[60,36] org.apache.pulsar.client.api.ConsumerConfiguration in org.apache.pulsar.client.api has been deprecated
[WARNING] /home/jenkins/jenkins-slave/workspace/pulsar-master/pulsar-broker/src/test/java/org/apache/pulsar/client/api/v1/V1_ProducerConsumerTest.java:[65,36] org.apache.pulsar.client.api.MessageBuilder in org.apache.pulsar.client.api has been deprecated
[WARNING] /home/jenkins/jenkins-slave/workspace/pulsar-master/pulsar-broker/src/test/java/org/apache/pulsar/client/api/v1/V1_ProducerConsumerTest.java:[68,36] org.apache.pulsar.client.api.ProducerConfiguration in org.apache.pulsar.client.api has been deprecated
[WARNING] /home/jenkins/jenkins-slave/workspace/pulsar-master/pulsar-broker/src/test/java/org/apache/pulsar/client/impl/MessageIdTest.java:[47,36] org.apache.pulsar.client.api.MessageBuilder in org.apache.pulsar.client.api has been deprecated
[WARNING] /home/jenkins/jenkins-slave/workspace/pulsar-master/pulsar-broker/src/test/java/org/apache/pulsar/broker/service/v1/V1_ReplicatorTest.java:[62,36] org.apache.pulsar.client.api.MessageBuilder in org.apache.pulsar.client.api has been deprecated
[WARNING] /home/jenkins/jenkins-slave/workspace/pulsar-master/pulsar-broker/src/test/java/org/apache/pulsar/broker/service/v1/V1_ReplicatorTestBase.java:[41,36] org.apache.pulsar.client.api.MessageBuilder in org.apache.pulsar.client.api has been deprecated
[WARNING] /home/jenkins/jenkins-slave/workspace/pulsar-master/pulsar-broker/src/test/java/org/apache/pulsar/broker/service/BatchMessageTest.java:[44,36] org.apache.pulsar.client.api.MessageBuilder in org.apache.pulsar.client.api has been deprecated
[WARNING] /home/jenkins/jenkins-slave/workspace/pulsar-master/pulsar-broker/src/test/java/org/apache/pulsar/compaction/CompactionTest.java:[52,36] org.apache.pulsar.client.api.MessageBuilder in org.apache.pulsar.client.api has been deprecated
[WARNING] /home/jenkins/jenkins-slave/workspace/pulsar-master/pulsar-broker/src/test/java/org/apache/pulsar/compaction/CompactorTest.java:[37,36] org.apache.pulsar.client.api.MessageBuilder in org.apache.pulsar.client.api has been deprecated
[WARNING] /home/jenkins/jenkins-slave/workspace/pulsar-master/pulsar-broker/src/test/java/org/apache/pulsar/broker/service/ReplicatorTestBase.java:[38,36] org.apache.pulsar.client.api.MessageBuilder in org.apache.pulsar.client.api has been deprecated
[WARNING] /home/jenkins/jenkins-slave/workspace/pulsar-master/pulsar-broker/src/test/java/org/apache/pulsar/broker/service/ReplicatorTest.java:[54,36] org.apache.pulsar.client.api.MessageBuilder in org.apache.pulsar.client.api has been deprecated
[WARNING] /home/jenkins/jenkins-slave/workspace/pulsar-master/pulsar-broker/src/test/java/org/apache/pulsar/broker/service/PersistentTopicE2ETest.java:[54,36] org.apache.pulsar.client.api.MessageBuilder in org.apache.pulsar.client.api has been deprecated
[WARNING] /home/jenkins/jenkins-slave/workspace/pulsar-master/pulsar-broker/src/test/java/org/apache/pulsar/client/api/v1/V1_ProducerConsumerTest.java:[60,36] org.apache.pulsar.client.api.ConsumerConfiguration in org.apache.pulsar.client.api has been deprecated
[WARNING] /home/jenkins/jenkins-slave/workspace/pulsar-master/pulsar-broker/src/test/java/org/apache/pulsar/client/api/v1/V1_ProducerConsumerTest.java:[65,36] org.apache.pulsar.client.api.MessageBuilder in org.apache.pulsar.client.api has been deprecated
[WARNING] /home/jenkins/jenkins-slave/workspace/pulsar-master/pulsar-broker/src/test/java/org/apache/pulsar/client/api/v1/V1_ProducerConsumerTest.java:[68,36] org.apache.pulsar.client.api.ProducerConfiguration in org.apache.pulsar.client.api has been deprecated
[WARNING] /home/jenkins/jenkins-slave/workspace/pulsar-master/pulsar-broker/src/test/java/org/apache/pulsar/client/impl/MessageIdTest.java:[47,36] org.apache.pulsar.client.api.MessageBuilder in org.apache.pulsar.client.api has been deprecated
[WARNING] /home/jenkins/jenkins-slave/workspace/pulsar-master/pulsar-broker/src/test/java/org/apache/pulsar/broker/service/v1/V1_ReplicatorTest.java:[62,36] org.apache.pulsar.client.api.MessageBuilder in org.apache.pulsar.client.api has been deprecated
[WARNING] /home/jenkins/jenkins-slave/workspace/pulsar-master/pulsar-broker/src/test/java/org/apache/pulsar/broker/service/v1/V1_ReplicatorTestBase.java:[41,36] org.apache.pulsar.client.api.MessageBuilder in org.apache.pulsar.client.api has been deprecated
[WARNING] /home/jenkins/jenkins-slave/workspace/pulsar-master/pulsar-broker/src/test/java/org/apache/pulsar/broker/service/BatchMessageTest.java:[44,36] org.apache.pulsar.client.api.MessageBuilder in org.apache.pulsar.client.api has been deprecated
[WARNING] /home/jenkins/jenkins-slave/workspace/pulsar-master/pulsar-broker/src/test/java/org/apache/pulsar/compaction/CompactionTest.java:[52,36] org.apache.pulsar.client.api.MessageBuilder in org.apache.pulsar.client.api has been deprecated
[WARNING] /home/jenkins/jenkins-slave/workspace/pulsar-master/pulsar-broker/src/test/java/org/apache/pulsar/compaction/CompactorTest.java:[37,36] org.apache.pulsar.client.api.MessageBuilder in org.apache.pulsar.client.api has been deprecated
[WARNING] /home/jenkins/jenkins-slave/workspace/pulsar-master/pulsar-broker/src/test/java/org/apache/pulsar/broker/service/ReplicatorTestBase.java:[38,36] org.apache.pulsar.client.api.MessageBuilder in org.apache.pulsar.client.api has been deprecated
[WARNING] /home/jenkins/jenkins-slave/workspace/pulsar-master/pulsar-broker/src/test/java/org/apache/pulsar/broker/service/ReplicatorTest.java:[54,36] org.apache.pulsar.client.api.MessageBuilder in org.apache.pulsar.client.api has been deprecated
[WARNING] /home/jenkins/jenkins-slave/workspace/pulsar-master/pulsar-broker/src/test/java/org/apache/pulsar/broker/service/PersistentTopicE2ETest.java:[54,36] org.apache.pulsar.client.api.MessageBuilder in org.apache.pulsar.client.api has been deprecated
[WARNING] /home/jenkins/jenkins-slave/workspace/pulsar-master/pulsar-broker/src/test/java/org/apache/pulsar/client/api/v1/V1_ProducerConsumerTest.java:[60,36] org.apache.pulsar.client.api.ConsumerConfiguration in org.apache.pulsar.client.api has been deprecated
[WARNING] /home/jenkins/jenkins-slave/workspace/pulsar-master/pulsar-broker/src/test/java/org/apache/pulsar/client/api/v1/V1_ProducerConsumerTest.java:[65,36] org.apache.pulsar.client.api.MessageBuilder in org.apache.pulsar.client.api has been deprecated
[WARNING] /home/jenkins/jenkins-slave/workspace/pulsar-master/pulsar-broker/src/test/java/org/apache/pulsar/client/api/v1/V1_ProducerConsumerTest.java:[68,36] org.apache.pulsar.client.api.ProducerConfiguration in org.apache.pulsar.client.api has been deprecated
[WARNING] /home/jenkins/jenkins-slave/workspace/pulsar-master/pulsar-broker/src/test/java/org/apache/pulsar/client/impl/MessageIdTest.java:[47,36] org.apache.pulsar.client.api.MessageBuilder in org.apache.pulsar.client.api has been deprecated
[WARNING] /home/jenkins/jenkins-slave/workspace/pulsar-master/pulsar-broker/src/test/java/org/apache/pulsar/broker/service/v1/V1_ReplicatorTest.java:[62,36] org.apache.pulsar.client.api.MessageBuilder in org.apache.pulsar.client.api has been deprecated
[WARNING] /home/jenkins/jenkins-slave/workspace/pulsar-master/pulsar-broker/src/test/java/org/apache/pulsar/broker/service/v1/V1_ReplicatorTestBase.java:[41,36] org.apache.pulsar.client.api.MessageBuilder in org.apache.pulsar.client.api has been deprecated
[WARNING] /home/jenkins/jenkins-slave/workspace/pulsar-master/pulsar-broker/src/test/java/org/apache/pulsar/broker/service/BatchMessageTest.java:[44,36] org.apache.pulsar.client.api.MessageBuilder in org.apache.pulsar.client.api has been deprecated
[WARNING] /home/jenkins/jenkins-slave/workspace/pulsar-master/pulsar-broker/src/test/java/org/apache/pulsar/compaction/CompactionTest.java:[52,36] org.apache.pulsar.client.api.MessageBuilder in org.apache.pulsar.client.api has been deprecated
[WARNING] /home/jenkins/jenkins-slave/workspace/pulsar-master/pulsar-broker/src/test/java/org/apache/pulsar/compaction/CompactorTest.java:[37,36] org.apache.pulsar.client.api.MessageBuilder in org.apache.pulsar.client.api has been deprecated
[WARNING] /home/jenkins/jenkins-slave/workspace/pulsar-master/pulsar-broker/src/test/java/org/apache/pulsar/broker/service/ReplicatorTestBase.java:[38,36] org.apache.pulsar.client.api.MessageBuilder in org.apache.pulsar.client.api has been deprecated
[WARNING] /home/jenkins/jenkins-slave/workspace/pulsar-master/pulsar-broker/src/test/java/org/apache/pulsar/broker/service/ReplicatorTest.java:[54,36] org.apache.pulsar.client.api.MessageBuilder in org.apache.pulsar.client.api has been deprecated
[WARNING] /home/jenkins/jenkins-slave/workspace/pulsar-master/pulsar-broker/src/test/java/org/apache/pulsar/broker/service/PersistentTopicE2ETest.java:[1171,32] org.apache.pulsar.client.api.MessageBuilder in org.apache.pulsar.client.api has been deprecated
[WARNING] /home/jenkins/jenkins-slave/workspace/pulsar-master/pulsar-broker/src/test/java/org/apache/pulsar/broker/service/PersistentTopicE2ETest.java:[1172,56] sendAsync(org.apache.pulsar.client.api.Message<T>) in org.apache.pulsar.client.api.Producer has been deprecated
[WARNING] /home/jenkins/jenkins-slave/workspace/pulsar-master/pulsar-broker/src/test/java/org/apache/pulsar/broker/service/PersistentTopicE2ETest.java:[1179,32] org.apache.pulsar.client.api.MessageBuilder in org.apache.pulsar.client.api has been deprecated
[WARNING] /home/jenkins/jenkins-slave/workspace/pulsar-master/pulsar-broker/src/test/java/org/apache/pulsar/broker/service/PersistentTopicE2ETest.java:[1180,56] sendAsync(org.apache.pulsar.client.api.Message<T>) in org.apache.pulsar.client.api.Producer has been deprecated
[WARNING] /home/jenkins/jenkins-slave/workspace/pulsar-master/pulsar-broker/src/test/java/org/apache/pulsar/client/impl/MessageIdTest.java:[319,32] org.apache.pulsar.client.api.MessageBuilder in org.apache.pulsar.client.api has been deprecated
[WARNING] /home/jenkins/jenkins-slave/workspace/pulsar-master/pulsar-broker/src/test/java/org/apache/pulsar/client/impl/MessageIdTest.java:[322,32] org.apache.pulsar.client.api.MessageBuilder in org.apache.pulsar.client.api has been deprecated
[WARNING] /home/jenkins/jenkins-slave/workspace/pulsar-master/pulsar-broker/src/test/java/org/apache/pulsar/client/impl/MessageIdTest.java:[387,32] org.apache.pulsar.client.api.MessageBuilder in org.apache.pulsar.client.api has been deprecated
[WARNING] /home/jenkins/jenkins-slave/workspace/pulsar-master/pulsar-broker/src/test/java/org/apache/pulsar/client/impl/MessageIdTest.java:[390,32] org.apache.pulsar.client.api.MessageBuilder in org.apache.pulsar.client.api has been deprecated
[WARNING] /home/jenkins/jenkins-slave/workspace/pulsar-master/pulsar-broker/src/test/java/org/apache/pulsar/client/impl/MessageIdTest.java:[459,31] org.apache.pulsar.client.api.MessageBuilder in org.apache.pulsar.client.api has been deprecated
[WARNING] /home/jenkins/jenkins-slave/workspace/pulsar-master/pulsar-broker/src/test/java/org/apache/pulsar/client/impl/MessageIdTest.java:[483,58] org.apache.pulsar.client.api.MessageBuilder in org.apache.pulsar.client.api has been deprecated
[WARNING] /home/jenkins/jenkins-slave/workspace/pulsar-master/pulsar-broker/src/test/java/org/apache/pulsar/client/impl/MessageIdTest.java:[503,58] org.apache.pulsar.client.api.MessageBuilder in org.apache.pulsar.client.api has been deprecated
[WARNING] /home/jenkins/jenkins-slave/workspace/pulsar-master/pulsar-broker/src/test/java/org/apache/pulsar/broker/admin/v1/V1_AdminApiTest.java:[614,40] getNamespaces(java.lang.String,java.lang.String) in org.apache.pulsar.client.admin.Namespaces has been deprecated
[WARNING] /home/jenkins/jenkins-slave/workspace/pulsar-master/pulsar-broker/src/test/java/org/apache/pulsar/broker/admin/v1/V1_AdminApiTest.java:[667,40] getNamespaces(java.lang.String,java.lang.String) in org.apache.pulsar.client.admin.Namespaces has been deprecated
[WARNING] /home/jenkins/jenkins-slave/workspace/pulsar-master/pulsar-broker/src/test/java/org/apache/pulsar/broker/admin/v1/V1_AdminApiTest.java:[921,40] getNamespaces(java.lang.String,java.lang.String) in org.apache.pulsar.client.admin.Namespaces has been deprecated
[WARNING] /home/jenkins/jenkins-slave/workspace/pulsar-master/pulsar-broker/src/test/java/org/apache/pulsar/broker/admin/v1/V1_AdminApiTest2.java:[243,51] nonPersistentTopics() in org.apache.pulsar.client.admin.PulsarAdmin has been deprecated
[WARNING] /home/jenkins/jenkins-slave/workspace/pulsar-master/pulsar-broker/src/test/java/org/apache/pulsar/broker/admin/v1/V1_AdminApiTest2.java:[248,59] nonPersistentTopics() in org.apache.pulsar.client.admin.PulsarAdmin has been deprecated
[WARNING] /home/jenkins/jenkins-slave/workspace/pulsar-master/pulsar-broker/src/test/java/org/apache/pulsar/broker/admin/v1/V1_AdminApiTest2.java:[254,27] nonPersistentTopics() in org.apache.pulsar.client.admin.PulsarAdmin has been deprecated
[WARNING] /home/jenkins/jenkins-slave/workspace/pulsar-master/pulsar-broker/src/test/java/org/apache/pulsar/broker/admin/v1/V1_AdminApiTest2.java:[260,27] nonPersistentTopics() in org.apache.pulsar.client.admin.PulsarAdmin has been deprecated
[WARNING] /home/jenkins/jenkins-slave/workspace/pulsar-master/pulsar-broker/src/test/java/org/apache/pulsar/broker/admin/v1/V1_AdminApiTest2.java:[261,14] nonPersistentTopics() in org.apache.pulsar.client.admin.PulsarAdmin has been deprecated
[WARNING] /home/jenkins/jenkins-slave/workspace/pulsar-master/pulsar-broker/src/test/java/org/apache/pulsar/broker/admin/v1/V1_AdminApiTest2.java:[262,27] nonPersistentTopics() in org.apache.pulsar.client.admin.PulsarAdmin has been deprecated
[WARNING] /home/jenkins/jenkins-slave/workspace/pulsar-master/pulsar-broker/src/test/java/org/apache/pulsar/broker/admin/v1/V1_AdminApiTest2.java:[407,18] nonPersistentTopics() in org.apache.pulsar.client.admin.PulsarAdmin has been deprecated
[WARNING] /home/jenkins/jenkins-slave/workspace/pulsar-master/pulsar-broker/src/test/java/org/apache/pulsar/broker/admin/v1/V1_AdminApiTest2.java:[738,55] nonPersistentTopics() in org.apache.pulsar.client.admin.PulsarAdmin has been deprecated
[WARNING] /home/jenkins/jenkins-slave/workspace/pulsar-master/pulsar-broker/src/test/java/org/apache/pulsar/client/api/AuthenticationTlsHostnameVerificationTest.java:[107,16] configure(java.util.Map<java.lang.String,java.lang.String>) in org.apache.pulsar.client.api.Authentication has been deprecated
[WARNING] /home/jenkins/jenkins-slave/workspace/pulsar-master/pulsar-broker/src/test/java/org/apache/pulsar/broker/admin/AdminTest.java:[212,38] getZkLedgersRootPath() in org.apache.bookkeeper.conf.AbstractConfiguration has been deprecated
[WARNING] /home/jenkins/jenkins-slave/workspace/pulsar-master/pulsar-broker/src/test/java/org/apache/pulsar/client/api/PartitionedProducerConsumerTest.java:[229,35] org.apache.pulsar.client.api.MessageBuilder in org.apache.pulsar.client.api has been deprecated
[WARNING] /home/jenkins/jenkins-slave/workspace/pulsar-master/pulsar-broker/src/test/java/org/apache/pulsar/client/api/AuthenticatedProducerConsumerTest.java:[168,16] configure(java.util.Map<java.lang.String,java.lang.String>) in org.apache.pulsar.client.api.Authentication has been deprecated
[WARNING] /home/jenkins/jenkins-slave/workspace/pulsar-master/pulsar-broker/src/test/java/org/apache/pulsar/client/api/AuthenticatedProducerConsumerTest.java:[220,16] configure(java.util.Map<java.lang.String,java.lang.String>) in org.apache.pulsar.client.api.Authentication has been deprecated
[WARNING] /home/jenkins/jenkins-slave/workspace/pulsar-master/pulsar-broker/src/test/java/org/apache/pulsar/client/api/AuthenticatedProducerConsumerTest.java:[268,16] configure(java.util.Map<java.lang.String,java.lang.String>) in org.apache.pulsar.client.api.Authentication has been deprecated
[WARNING] /home/jenkins/jenkins-slave/workspace/pulsar-master/pulsar-broker/src/test/java/org/apache/pulsar/client/api/AuthenticatedProducerConsumerTest.java:[299,16] configure(java.util.Map<java.lang.String,java.lang.String>) in org.apache.pulsar.client.api.Authentication has been deprecated
[WARNING] /home/jenkins/jenkins-slave/workspace/pulsar-master/pulsar-broker/src/test/java/org/apache/pulsar/broker/service/v1/V1_ReplicatorTestBase.java:[310,36] org.apache.pulsar.client.api.MessageBuilder in org.apache.pulsar.client.api has been deprecated
[WARNING] /home/jenkins/jenkins-slave/workspace/pulsar-master/pulsar-broker/src/test/java/org/apache/pulsar/broker/service/v1/V1_ReplicatorTestBase.java:[315,25] send(org.apache.pulsar.client.api.Message<T>) in org.apache.pulsar.client.api.Producer has been deprecated
[WARNING] /home/jenkins/jenkins-slave/workspace/pulsar-master/pulsar-broker/src/test/java/org/apache/pulsar/broker/service/v1/V1_ReplicatorTest.java:[420,42] org.apache.pulsar.client.api.MessageBuilder in org.apache.pulsar.client.api has been deprecated
[WARNING] /home/jenkins/jenkins-slave/workspace/pulsar-master/pulsar-broker/src/test/java/org/apache/pulsar/broker/service/v1/V1_ReplicatorTest.java:[424,29] org.apache.pulsar.client.api.MessageBuilder in org.apache.pulsar.client.api has been deprecated
[WARNING] /home/jenkins/jenkins-slave/workspace/pulsar-master/pulsar-broker/src/test/java/org/apache/pulsar/client/api/AuthorizationProducerConsumerTest.java:[270,21] configure(java.util.Map<java.lang.String,java.lang.String>) in org.apache.pulsar.client.api.Authentication has been deprecated
[WARNING] /home/jenkins/jenkins-slave/workspace/pulsar-master/pulsar-broker/src/test/java/org/apache/pulsar/compaction/CompactionTest.java:[614,38] org.apache.pulsar.client.api.MessageBuilder in org.apache.pulsar.client.api has been deprecated
[WARNING] /home/jenkins/jenkins-slave/workspace/pulsar-master/pulsar-broker/src/test/java/org/apache/pulsar/compaction/CompactionTest.java:[614,27] sendAsync(org.apache.pulsar.client.api.Message<T>) in org.apache.pulsar.client.api.Producer has been deprecated
[WARNING] /home/jenkins/jenkins-slave/workspace/pulsar-master/pulsar-broker/src/test/java/org/apache/pulsar/compaction/CompactionTest.java:[619,38] org.apache.pulsar.client.api.MessageBuilder in org.apache.pulsar.client.api has been deprecated
[WARNING] /home/jenkins/jenkins-slave/workspace/pulsar-master/pulsar-broker/src/test/java/org/apache/pulsar/compaction/CompactionTest.java:[619,27] sendAsync(org.apache.pulsar.client.api.Message<T>) in org.apache.pulsar.client.api.Producer has been deprecated
[WARNING] /home/jenkins/jenkins-slave/workspace/pulsar-master/pulsar-broker/src/test/java/org/apache/pulsar/compaction/CompactionTest.java:[623,38] org.apache.pulsar.client.api.MessageBuilder in org.apache.pulsar.client.api has been deprecated
[WARNING] /home/jenkins/jenkins-slave/workspace/pulsar-master/pulsar-broker/src/test/java/org/apache/pulsar/compaction/CompactionTest.java:[623,27] sendAsync(org.apache.pulsar.client.api.Message<T>) in org.apache.pulsar.client.api.Producer has been deprecated
[WARNING] /home/jenkins/jenkins-slave/workspace/pulsar-master/pulsar-broker/src/test/java/org/apache/pulsar/compaction/CompactionTest.java:[627,37] org.apache.pulsar.client.api.MessageBuilder in org.apache.pulsar.client.api has been deprecated
[WARNING] /home/jenkins/jenkins-slave/workspace/pulsar-master/pulsar-broker/src/test/java/org/apache/pulsar/compaction/CompactionTest.java:[627,26] sendAsync(org.apache.pulsar.client.api.Message<T>) in org.apache.pulsar.client.api.Producer has been deprecated
[WARNING] /home/jenkins/jenkins-slave/workspace/pulsar-master/pulsar-broker/src/test/java/org/apache/pulsar/compaction/CompactionTest.java:[630,37] org.apache.pulsar.client.api.MessageBuilder in org.apache.pulsar.client.api has been deprecated
[WARNING] /home/jenkins/jenkins-slave/workspace/pulsar-master/pulsar-broker/src/test/java/org/apache/pulsar/compaction/CompactionTest.java:[630,26] sendAsync(org.apache.pulsar.client.api.Message<T>) in org.apache.pulsar.client.api.Producer has been deprecated
[WARNING] /home/jenkins/jenkins-slave/workspace/pulsar-master/pulsar-broker/src/test/java/org/apache/pulsar/compaction/CompactionTest.java:[633,37] org.apache.pulsar.client.api.MessageBuilder in org.apache.pulsar.client.api has been deprecated
[WARNING] /home/jenkins/jenkins-slave/workspace/pulsar-master/pulsar-broker/src/test/java/org/apache/pulsar/compaction/CompactionTest.java:[633,26] sendAsync(org.apache.pulsar.client.api.Message<T>) in org.apache.pulsar.client.api.Producer has been deprecated
[WARNING] /home/jenkins/jenkins-slave/workspace/pulsar-master/pulsar-broker/src/test/java/org/apache/pulsar/compaction/CompactionTest.java:[637,37] org.apache.pulsar.client.api.MessageBuilder in org.apache.pulsar.client.api has been deprecated
[WARNING] /home/jenkins/jenkins-slave/workspace/pulsar-master/pulsar-broker/src/test/java/org/apache/pulsar/compaction/CompactionTest.java:[637,26] sendAsync(org.apache.pulsar.client.api.Message<T>) in org.apache.pulsar.client.api.Producer has been deprecated
[WARNING] /home/jenkins/jenkins-slave/workspace/pulsar-master/pulsar-broker/src/test/java/org/apache/pulsar/compaction/CompactionTest.java:[639,37] org.apache.pulsar.client.api.MessageBuilder in org.apache.pulsar.client.api has been deprecated
[WARNING] /home/jenkins/jenkins-slave/workspace/pulsar-master/pulsar-broker/src/test/java/org/apache/pulsar/compaction/CompactionTest.java:[639,26] sendAsync(org.apache.pulsar.client.api.Message<T>) in org.apache.pulsar.client.api.Producer has been deprecated
[WARNING] /home/jenkins/jenkins-slave/workspace/pulsar-master/pulsar-broker/src/test/java/org/apache/pulsar/compaction/CompactionTest.java:[642,37] org.apache.pulsar.client.api.MessageBuilder in org.apache.pulsar.client.api has been deprecated
[WARNING] /home/jenkins/jenkins-slave/workspace/pulsar-master/pulsar-broker/src/test/java/org/apache/pulsar/compaction/CompactionTest.java:[642,26] sendAsync(org.apache.pulsar.client.api.Message<T>) in org.apache.pulsar.client.api.Producer has been deprecated
[INFO] /home/jenkins/jenkins-slave/workspace/pulsar-master/pulsar-broker/src/test/java/org/apache/pulsar/compaction/CompactionTest.java: Some input files additionally use or override a deprecated API.
[INFO] /home/jenkins/jenkins-slave/workspace/pulsar-master/pulsar-broker/src/test/java/org/apache/pulsar/broker/cache/ResourceQuotaCacheTest.java: Some input files use unchecked or unsafe operations.
[INFO] /home/jenkins/jenkins-slave/workspace/pulsar-master/pulsar-broker/src/test/java/org/apache/pulsar/broker/cache/ResourceQuotaCacheTest.java: Recompile with -Xlint:unchecked for details.
[INFO]
[INFO] --- maven-surefire-plugin:2.21.0:test (default-test) @ pulsar-broker ---
[INFO]
[INFO] -------------------------------------------------------
[INFO] T E S T S
[INFO] -------------------------------------------------------
[INFO] Running org.apache.pulsar.broker.auth.AuthenticationServiceTest
[INFO] Tests run: 2, Failures: 0, Errors: 0, Skipped: 0, Time elapsed: 1.688 s - in org.apache.pulsar.broker.auth.AuthenticationServiceTest
[INFO] Running org.apache.pulsar.broker.auth.MockedPulsarServiceBaseTest
[INFO] Tests run: 0, Failures: 0, Errors: 0, Skipped: 0, Time elapsed: 0.519 s - in org.apache.pulsar.broker.auth.MockedPulsarServiceBaseTest
[INFO] Running org.apache.pulsar.broker.auth.AuthorizationTest
[INFO] Tests run: 1, Failures: 0, Errors: 0, Skipped: 0, Time elapsed: 10.904 s - in org.apache.pulsar.broker.auth.AuthorizationTest
[INFO] Running org.apache.pulsar.broker.namespace.OwnershipCacheTest
[INFO] Tests run: 7, Failures: 0, Errors: 0, Skipped: 0, Time elapsed: 6.414 s - in org.apache.pulsar.broker.namespace.OwnershipCacheTest
[INFO] Running org.apache.pulsar.broker.namespace.NamespaceServiceTest
[INFO] Tests run: 8, Failures: 0, Errors: 0, Skipped: 0, Time elapsed: 20.014 s - in org.apache.pulsar.broker.namespace.NamespaceServiceTest
[INFO] Running org.apache.pulsar.broker.namespace.NamespaceCreateBundlesTest
[INFO] Tests run: 1, Failures: 0, Errors: 0, Skipped: 0, Time elapsed: 9.557 s - in org.apache.pulsar.broker.namespace.NamespaceCreateBundlesTest
[INFO] Running org.apache.pulsar.broker.namespace.NamespaceUnloadingTest
[INFO] Tests run: 2, Failures: 0, Errors: 0, Skipped: 0, Time elapsed: 12.457 s - in org.apache.pulsar.broker.namespace.NamespaceUnloadingTest
[INFO] Running org.apache.pulsar.broker.stats.PrometheusMetricsTest
[INFO] Tests run: 2, Failures: 0, Errors: 0, Skipped: 0, Time elapsed: 11.677 s - in org.apache.pulsar.broker.stats.PrometheusMetricsTest
[INFO] Running org.apache.pulsar.broker.stats.BookieClientsStatsGeneratorTest
[INFO] Tests run: 2, Failures: 0, Errors: 0, Skipped: 0, Time elapsed: 9.676 s - in org.apache.pulsar.broker.stats.BookieClientsStatsGeneratorTest
[INFO] Running org.apache.pulsar.broker.stats.ManagedLedgerMetricsTest
[INFO] Tests run: 1, Failures: 0, Errors: 0, Skipped: 0, Time elapsed: 10.693 s - in org.apache.pulsar.broker.stats.ManagedLedgerMetricsTest
[INFO] Running org.apache.pulsar.broker.zookeeper.ZooKeeperClientAspectJTest
[INFO] Tests run: 1, Failures: 0, Errors: 0, Skipped: 0, Time elapsed: 2.13 s - in org.apache.pulsar.broker.zookeeper.ZooKeeperClientAspectJTest
[INFO] Running org.apache.pulsar.broker.zookeeper.ZooKeeperSessionExpireRecoveryTest
[INFO] Tests run: 1, Failures: 0, Errors: 0, Skipped: 0, Time elapsed: 9.784 s - in org.apache.pulsar.broker.zookeeper.ZooKeeperSessionExpireRecoveryTest
[INFO] Running org.apache.pulsar.broker.lookup.http.HttpTopicLookupv2Test
[INFO] Tests run: 4, Failures: 0, Errors: 0, Skipped: 0, Time elapsed: 2.735 s - in org.apache.pulsar.broker.lookup.http.HttpTopicLookupv2Test
[INFO] Running org.apache.pulsar.broker.cache.ResourceQuotaCacheTest
[INFO] Tests run: 2, Failures: 0, Errors: 0, Skipped: 0, Time elapsed: 3.087 s - in org.apache.pulsar.broker.cache.ResourceQuotaCacheTest
[INFO] Running org.apache.pulsar.broker.service.DistributedIdGeneratorTest
[INFO] Tests run: 3, Failures: 0, Errors: 0, Skipped: 0, Time elapsed: 1.64 s - in org.apache.pulsar.broker.service.DistributedIdGeneratorTest
[INFO] Running org.apache.pulsar.broker.service.PersistentQueueE2ETest
[INFO] Tests run: 6, Failures: 0, Errors: 0, Skipped: 0, Time elapsed: 73.577 s - in org.apache.pulsar.broker.service.PersistentQueueE2ETest
[INFO] Running org.apache.pulsar.broker.service.persistent.ChecksumTest
[INFO] Tests run: 2, Failures: 0, Errors: 0, Skipped: 0, Time elapsed: 11.269 s - in org.apache.pulsar.broker.service.persistent.ChecksumTest
[INFO] Running org.apache.pulsar.broker.service.v1.V1_ReplicatorTest
[INFO] Tests run: 15, Failures: 0, Errors: 0, Skipped: 0, Time elapsed: 85.526 s - in org.apache.pulsar.broker.service.v1.V1_ReplicatorTest
[INFO] Running org.apache.pulsar.broker.service.BatchMessageTest
[INFO] Tests run: 21, Failures: 0, Errors: 0, Skipped: 0, Time elapsed: 18.66 s - in org.apache.pulsar.broker.service.BatchMessageTest
[INFO] Running org.apache.pulsar.broker.service.PersistentTopicTest
[INFO] Tests run: 25, Failures: 0, Errors: 0, Skipped: 0, Time elapsed: 8.522 s - in org.apache.pulsar.broker.service.PersistentTopicTest
[INFO] Running org.apache.pulsar.broker.service.AddMissingPatchVersionTest
[INFO] Tests run: 1, Failures: 0, Errors: 0, Skipped: 0, Time elapsed: 1.402 s - in org.apache.pulsar.broker.service.AddMissingPatchVersionTest
[INFO] Running org.apache.pulsar.broker.service.BrokerServiceTest
[INFO] Tests run: 15, Failures: 0, Errors: 0, Skipped: 0, Time elapsed: 21.739 s - in org.apache.pulsar.broker.service.BrokerServiceTest
[INFO] Running org.apache.pulsar.broker.service.PartitionKeyTest
[INFO] Tests run: 1, Failures: 0, Errors: 0, Skipped: 0, Time elapsed: 11.065 s - in org.apache.pulsar.broker.service.PartitionKeyTest
[INFO] Running org.apache.pulsar.broker.service.ReplicatorTest
[INFO] Tests run: 15, Failures: 0, Errors: 0, Skipped: 0, Time elapsed: 81.167 s - in org.apache.pulsar.broker.service.ReplicatorTest
[INFO] Running org.apache.pulsar.broker.service.PersistentFailoverE2ETest
[INFO] Tests run: 3, Failures: 0, Errors: 0, Skipped: 0, Time elapsed: 28.961 s - in org.apache.pulsar.broker.service.PersistentFailoverE2ETest
[INFO] Running org.apache.pulsar.broker.service.ServerCnxTest
[INFO] Tests run: 38, Failures: 0, Errors: 0, Skipped: 0, Time elapsed: 29.849 s - in org.apache.pulsar.broker.service.ServerCnxTest
[INFO] Running org.apache.pulsar.broker.service.PersistentMessageFinderTest
[INFO] Tests run: 1, Failures: 0, Errors: 0, Skipped: 0, Time elapsed: 4.789 s - in org.apache.pulsar.broker.service.PersistentMessageFinderTest
[INFO] Running org.apache.pulsar.broker.service.schema.SchemaServiceTest
[INFO] Tests run: 9, Failures: 0, Errors: 0, Skipped: 0, Time elapsed: 21.471 s - in org.apache.pulsar.broker.service.schema.SchemaServiceTest
[INFO] Running org.apache.pulsar.broker.service.BrokerServiceThrottlingTest
[INFO] Tests run: 4, Failures: 0, Errors: 0, Skipped: 0, Time elapsed: 20.164 s - in org.apache.pulsar.broker.service.BrokerServiceThrottlingTest
[INFO] Running org.apache.pulsar.broker.service.ReplicatorGlobalNSTest
[INFO] Tests run: 2, Failures: 0, Errors: 0, Skipped: 0, Time elapsed: 36.88 s - in org.apache.pulsar.broker.service.ReplicatorGlobalNSTest
[INFO] Running org.apache.pulsar.broker.service.PersistentDispatcherFailoverConsumerTest
[INFO] Tests run: 6, Failures: 0, Errors: 0, Skipped: 0, Time elapsed: 7.073 s - in org.apache.pulsar.broker.service.PersistentDispatcherFailoverConsumerTest
[INFO] Running org.apache.pulsar.broker.service.PersistentTopicConcurrentTest
[INFO] Tests run: 0, Failures: 0, Errors: 0, Skipped: 0, Time elapsed: 1.343 s - in org.apache.pulsar.broker.service.PersistentTopicConcurrentTest
[INFO] Running org.apache.pulsar.broker.service.SubscriptionSeekTest
[INFO] Tests run: 2, Failures: 0, Errors: 0, Skipped: 0, Time elapsed: 13.199 s - in org.apache.pulsar.broker.service.SubscriptionSeekTest
[INFO] Running org.apache.pulsar.broker.service.ReplicatorTlsTest
[INFO] Tests run: 1, Failures: 0, Errors: 0, Skipped: 0, Time elapsed: 28.856 s - in org.apache.pulsar.broker.service.ReplicatorTlsTest
[INFO] Running org.apache.pulsar.broker.service.ResendRequestTest
[INFO] Tests run: 8, Failures: 0, Errors: 0, Skipped: 0, Time elapsed: 58.758 s - in org.apache.pulsar.broker.service.ResendRequestTest
[INFO] Running org.apache.pulsar.broker.service.TopicTerminationTest
[INFO] Tests run: 11, Failures: 0, Errors: 0, Skipped: 0, Time elapsed: 25.77 s - in org.apache.pulsar.broker.service.TopicTerminationTest
[INFO] Running org.apache.pulsar.broker.service.PeerReplicatorTest
[INFO] Tests run: 3, Failures: 0, Errors: 0, Skipped: 0, Time elapsed: 34.567 s - in org.apache.pulsar.broker.service.PeerReplicatorTest
[INFO] Running org.apache.pulsar.broker.service.PersistentTopicE2ETest
[INFO] Tests run: 29, Failures: 0, Errors: 0, Skipped: 0, Time elapsed: 69.392 s - in org.apache.pulsar.broker.service.PersistentTopicE2ETest
[INFO] Running org.apache.pulsar.broker.service.AdvertisedAddressTest
[INFO] Tests run: 1, Failures: 0, Errors: 0, Skipped: 0, Time elapsed: 13.103 s - in org.apache.pulsar.broker.service.AdvertisedAddressTest
[INFO] Running org.apache.pulsar.broker.service.BacklogQuotaManagerTest
[INFO] Tests run: 9, Failures: 0, Errors: 0, Skipped: 0, Time elapsed: 137.571 s - in org.apache.pulsar.broker.service.BacklogQuotaManagerTest
[INFO] Running org.apache.pulsar.broker.service.BrokerBkEnsemblesTests
[INFO] Tests run: 2, Failures: 0, Errors: 0, Skipped: 0, Time elapsed: 30.748 s - in org.apache.pulsar.broker.service.BrokerBkEnsemblesTests
[INFO] Running org.apache.pulsar.broker.admin.v1.V1_AdminApiTest
[INFO] Tests run: 45, Failures: 0, Errors: 0, Skipped: 0, Time elapsed: 134.534 s - in org.apache.pulsar.broker.admin.v1.V1_AdminApiTest
[INFO] Running org.apache.pulsar.broker.admin.NamespacesTest
[INFO] Tests run: 17, Failures: 0, Errors: 0, Skipped: 0, Time elapsed: 27.163 s - in org.apache.pulsar.broker.admin.NamespacesTest
[INFO] Running org.apache.pulsar.broker.admin.AdminApiOffloadTest
[WARNING] Tests run: 3, Failures: 0, Errors: 0, Skipped: 1, Time elapsed: 13.713 s - in org.apache.pulsar.broker.admin.AdminApiOffloadTest
[INFO] Running org.apache.pulsar.broker.admin.AdminTest
[INFO] Tests run: 8, Failures: 0, Errors: 0, Skipped: 0, Time elapsed: 18.252 s - in org.apache.pulsar.broker.admin.AdminTest
[INFO] Running org.apache.pulsar.broker.admin.AdminApiTest
[INFO] Tests run: 45, Failures: 0, Errors: 0, Skipped: 0, Time elapsed: 134.107 s - in org.apache.pulsar.broker.admin.AdminApiTest
[INFO] Running org.apache.pulsar.broker.admin.IncrementPartitionsTest
[INFO] Tests run: 2, Failures: 0, Errors: 0, Skipped: 0, Time elapsed: 24.241 s - in org.apache.pulsar.broker.admin.IncrementPartitionsTest
[INFO] Running org.apache.pulsar.broker.admin.CreateSubscriptionTest
ERROR: Build step failed with exception
java.lang.NullPointerException: no workspace from node hudson.slaves.DumbSlave[H30] which is computer hudson.slaves.SlaveComputer@3d03a7fb and has channel null
at hudson.tasks.CommandInterpreter.perform(CommandInterpreter.java:88)
at hudson.tasks.CommandInterpreter.perform(CommandInterpreter.java:66)
at hudson.tasks.BuildStepMonitor$1.perform(BuildStepMonitor.java:20)
at hudson.model.AbstractBuild$AbstractBuildExecution.perform(AbstractBuild.java:744)
at hudson.maven.MavenModuleSetBuild$MavenModuleSetBuildExecution.build(MavenModuleSetBuild.java:945)
at hudson.maven.MavenModuleSetBuild$MavenModuleSetBuildExecution.doRun(MavenModuleSetBuild.java:896)
at hudson.model.AbstractBuild$AbstractBuildExecution.run(AbstractBuild.java:504)
at hudson.model.Run.execute(Run.java:1724)
at hudson.maven.MavenModuleSetBuild.run(MavenModuleSetBuild.java:543)
at hudson.model.ResourceController.execute(ResourceController.java:97)
at hudson.model.Executor.run(Executor.java:429)
Build step 'Execute shell' marked build as failure
ERROR: Failed to parse POMs
java.io.IOException: Backing channel 'H30' is disconnected.
at hudson.remoting.RemoteInvocationHandler.channelOrFail(RemoteInvocationHandler.java:212)
at hudson.remoting.RemoteInvocationHandler.invoke(RemoteInvocationHandler.java:281)
at com.sun.proxy.$Proxy138.isAlive(Unknown Source)
at hudson.Launcher$RemoteLauncher$ProcImpl.isAlive(Launcher.java:1138)
at hudson.maven.ProcessCache$MavenProcess.call(ProcessCache.java:166)
at hudson.maven.MavenModuleSetBuild$MavenModuleSetBuildExecution.doRun(MavenModuleSetBuild.java:879)
at hudson.model.AbstractBuild$AbstractBuildExecution.run(AbstractBuild.java:504)
at hudson.model.Run.execute(Run.java:1724)
at hudson.maven.MavenModuleSetBuild.run(MavenModuleSetBuild.java:543)
at hudson.model.ResourceController.execute(ResourceController.java:97)
at hudson.model.Executor.run(Executor.java:429)
Caused by: java.io.IOException: Unexpected termination of the channel
at hudson.remoting.SynchronousCommandTransport$ReaderThread.run(SynchronousCommandTransport.java:77)
Caused by: java.io.EOFException
at java.io.ObjectInputStream$PeekInputStream.readFully(ObjectInputStream.java:2679)
at java.io.ObjectInputStream$BlockDataInputStream.readShort(ObjectInputStream.java:3154)
at java.io.ObjectInputStream.readStreamHeader(ObjectInputStream.java:862)
at java.io.ObjectInputStream.<init>(ObjectInputStream.java:358)
at hudson.remoting.ObjectInputStreamEx.<init>(ObjectInputStreamEx.java:48)
at hudson.remoting.AbstractSynchronousByteArrayCommandTransport.read(AbstractSynchronousByteArrayCommandTransport.java:35)
at hudson.remoting.SynchronousCommandTransport$ReaderThread.run(SynchronousCommandTransport.java:63)
ERROR: H30 is offline; cannot locate JDK 1.8 (latest)
ERROR: H30 is offline; cannot locate Maven 3.5.0
ERROR: H30 is offline; cannot locate JDK 1.8 (latest)
ERROR: H30 is offline; cannot locate Maven 3.5.0
ERROR: H30 is offline; cannot locate JDK 1.8 (latest)
ERROR: H30 is offline; cannot locate Maven 3.5.0