You are viewing a plain text version of this content. The canonical link for it is here.
Posted to dev@hbase.apache.org by Apache Jenkins Server <je...@builds.apache.org> on 2012/04/01 06:36:28 UTC
Build failed in Jenkins: hbase-0.90 #458
See <https://builds.apache.org/job/hbase-0.90/458/changes>
Changes:
[jmhsieh] HBASE-5213 "hbase master stop" does not bring down backup masters (Gregory)
------------------------------------------
[...truncated 895 lines...]
A src/main/xslt/configuration_to_docbook_section.xsl
A src/site
A src/site/site.xml
A src/site/site.vm
A src/site/resources
A src/site/resources/images
AU src/site/resources/images/replication_overview.png
AU src/site/resources/images/asf_logo_wide.png
AU src/site/resources/images/architecture.gif
AU src/site/resources/images/hadoop-logo.jpg
AU src/site/resources/images/hbase_logo_med.gif
AU src/site/resources/images/favicon.ico
AU src/site/resources/images/hbase_small.gif
A src/site/resources/css
A src/site/resources/css/freebsd_docbook.css
A src/site/resources/css/site.css
A src/site/xdoc
A src/site/xdoc/cygwin.xml
A src/site/xdoc/acid-semantics.xml
A src/site/xdoc/metrics.xml
A src/site/xdoc/index.xml
A src/site/xdoc/replication.xml
A src/site/xdoc/old_news.xml
A src/site/xdoc/bulk-loads.xml
A src/site/xdoc/pseudo-distributed.xml
A src/docbkx
A src/docbkx/upgrading.xml
A src/docbkx/performance.xml
A src/docbkx/developer.xml
A src/docbkx/preface.xml
A src/docbkx/configuration.xml
A src/docbkx/getting_started.xml
A src/docbkx/shell.xml
A src/docbkx/troubleshooting.xml
A src/docbkx/book.xml
A src/docbkx/build.xml
AU src/saveVersion.sh
A src/examples
A src/examples/thrift
A src/examples/thrift/DemoClient.java
A src/examples/thrift/DemoClient.cpp
A src/examples/thrift/DemoClient.rb
A src/examples/thrift/DemoClient.php
AU src/examples/thrift/DemoClient.py
A src/examples/thrift/README.txt
A src/examples/thrift/Makefile
A src/examples/mapreduce
A src/examples/mapreduce/org
A src/examples/mapreduce/org/apache
A src/examples/mapreduce/org/apache/hadoop
A src/examples/mapreduce/org/apache/hadoop/hbase
A src/examples/mapreduce/org/apache/hadoop/hbase/mapreduce
A src/examples/mapreduce/org/apache/hadoop/hbase/mapreduce/SampleUploader.java
A src/examples/mapreduce/org/apache/hadoop/hbase/mapreduce/IndexBuilder.java
A src/examples/mapreduce/index-builder-setup.rb
A src/examples/README.txt
A bin
AU bin/hbase-daemons.sh
A bin/rename_table.rb
AU bin/hbase
A bin/copy_table.rb
A bin/check_meta.rb
AU bin/start-hbase.sh
A bin/hirb.rb
A bin/set_meta_block_caching.rb
A bin/loadtable.rb
AU bin/hbase-daemon.sh
A bin/region_mover.rb
A bin/hbase-config.sh
A bin/local-regionservers.sh
AU bin/zookeepers.sh
A bin/local-master-backup.sh
A bin/add_table.rb
AU bin/rolling-restart.sh
AU bin/regionservers.sh
A bin/graceful_stop.sh
AU bin/master-backup.sh
A bin/set_meta_memstore_size.rb
A bin/replication
A bin/replication/copy_tables_desc.rb
AU bin/stop-hbase.sh
A pom.xml
A README.txt
U .
At revision 1308016
[locks-and-latches] Checking to see if we really have the locks
[locks-and-latches] Have all the locks, build can start
[hbase-0.90] $ /bin/bash -xe /tmp/hudson7879870775105697020.sh
+ hostname
hemera
+ ulimit -a
core file size (blocks, -c) 0
data seg size (kbytes, -d) unlimited
scheduling priority (-e) 0
file size (blocks, -f) unlimited
pending signals (-i) 193125
max locked memory (kbytes, -l) 64
max memory size (kbytes, -m) unlimited
open files (-n) 40000
pipe size (512 bytes, -p) 8
POSIX message queues (bytes, -q) 819200
real-time priority (-r) 0
stack size (kbytes, -s) 10240
cpu time (seconds, -t) unlimited
max user processes (-u) 193125
virtual memory (kbytes, -v) unlimited
file locks (-x) unlimited
+ jps
2066 surefirebooter496180626262524471.jar
10747 Jps
10535 surefirebooter3447648812129063688.jar
18825 surefirebooter6349514521539976099.jar
14174 surefirebooter4745974203586116286.jar
17425 Main
32263 surefirebooter1549448917691647749.jar
4230 jar
[trunk] $ /home/hudson/tools/maven/latest3/bin/mvn clean -Dmaven.test.redirectTestOutputToFile=true site assembly:assembly
[INFO] Scanning for projects...
[INFO]
[INFO] ------------------------------------------------------------------------
[INFO] Building HBase 0.90.7-SNAPSHOT
[INFO] ------------------------------------------------------------------------
[INFO]
[INFO] --- maven-clean-plugin:2.4.1:clean (default-clean) @ hbase ---
[INFO]
[INFO] --- xml-maven-plugin:1.0-beta-3:transform (default) @ hbase ---
[INFO] Transforming file: /x1/jenkins/jenkins-slave/workspace/hbase-0.90/trunk/src/main/resources/hbase-default.xml
[INFO] Transformed 1 file(s).
[INFO]
[INFO] --- docbkx-maven-plugin:2.0.11:generate-html (default) @ hbase ---
[INFO] Processing input file: upgrading.xml
[INFO] /x1/jenkins/jenkins-slave/workspace/hbase-0.90/trunk/target/site/upgrading.html has been generated.
[INFO] Processing input file: shell.xml
[INFO] /x1/jenkins/jenkins-slave/workspace/hbase-0.90/trunk/target/site/shell.html has been generated.
[INFO] Processing input file: configuration.xml
[INFO] /x1/jenkins/jenkins-slave/workspace/hbase-0.90/trunk/target/site/configuration.html has been generated.
[INFO] Processing input file: getting_started.xml
[INFO] /x1/jenkins/jenkins-slave/workspace/hbase-0.90/trunk/target/site/getting_started.html has been generated.
[INFO] Processing input file: troubleshooting.xml
[INFO] /x1/jenkins/jenkins-slave/workspace/hbase-0.90/trunk/target/site/troubleshooting.html has been generated.
[INFO] Processing input file: build.xml
[INFO] /x1/jenkins/jenkins-slave/workspace/hbase-0.90/trunk/target/site/build.html has been generated.
[INFO] Processing input file: performance.xml
[INFO] /x1/jenkins/jenkins-slave/workspace/hbase-0.90/trunk/target/site/performance.html has been generated.
[INFO] Processing input file: developer.xml
[INFO] /x1/jenkins/jenkins-slave/workspace/hbase-0.90/trunk/target/site/developer.html has been generated.
[INFO] Processing input file: book.xml
[INFO] /x1/jenkins/jenkins-slave/workspace/hbase-0.90/trunk/target/site/book.html has been generated.
[INFO] /x1/jenkins/jenkins-slave/workspace/hbase-0.90/trunk/target/site/preface.html is up to date.
[INFO]
[INFO] --- maven-site-plugin:2.0.1:site (default-site) @ hbase ---
[INFO] Unable to load parent project from a relative path: 1 problem was encountered while building the effective model
[FATAL] Non-readable POM /x1/jenkins/jenkins-slave/workspace/hbase-0.90/pom.xml: /x1/jenkins/jenkins-slave/workspace/hbase-0.90/pom.xml (No such file or directory) @
for project at /x1/jenkins/jenkins-slave/workspace/hbase-0.90/pom.xml for project at /x1/jenkins/jenkins-slave/workspace/hbase-0.90/pom.xml
[INFO] Parent project loaded from repository.
[INFO] Unable to load parent project from a relative path: 1 problem was encountered while building the effective model
[FATAL] Non-readable POM /x1/jenkins/jenkins-slave/workspace/hbase-0.90/pom.xml: /x1/jenkins/jenkins-slave/workspace/hbase-0.90/pom.xml (No such file or directory) @
for project at /x1/jenkins/jenkins-slave/workspace/hbase-0.90/pom.xml for project at /x1/jenkins/jenkins-slave/workspace/hbase-0.90/pom.xml
[INFO] Parent project loaded from repository.
Downloading: http://people.apache.org/~rawson/repo/org/apache/maven/skins/maven-stylus-skin/maven-metadata.xml
[INFO]
[INFO] ------------------------------------------------------------------------
[INFO] Building HBase 0.90.7-SNAPSHOT
[INFO] ------------------------------------------------------------------------
[INFO]
[INFO] >>> maven-assembly-plugin:2.2-beta-5:assembly (default-cli) @ hbase >>>
[INFO]
[INFO] --- maven-antrun-plugin:1.3:run (generate) @ hbase ---
[INFO] Executing tasks
[mkdir] Created dir: /x1/jenkins/jenkins-slave/workspace/hbase-0.90/trunk/target/hbase-webapps
[copy] Copying 4 files to /x1/jenkins/jenkins-slave/workspace/hbase-0.90/trunk/target/hbase-webapps
SLF4J: Failed to load class "org.slf4j.impl.StaticLoggerBinder".
SLF4J: See http://www.slf4j.org/codes.html#StaticLoggerBinder for further details.
2012-04-01 04:16:54.235:INFO::Logging to STDERR via org.mortbay.log.StdErrLog
[mkdir] Created dir: /x1/jenkins/jenkins-slave/workspace/hbase-0.90/trunk/target/hbase-webapps/master/WEB-INF
[mkdir] Created dir: /x1/jenkins/jenkins-slave/workspace/hbase-0.90/trunk/target/hbase-webapps/regionserver/WEB-INF
[INFO] Executed tasks
[INFO]
[INFO] --- build-helper-maven-plugin:1.5:add-source (add-jspc-source) @ hbase ---
[INFO] Source directory: /x1/jenkins/jenkins-slave/workspace/hbase-0.90/trunk/target/jspc added.
[INFO]
[INFO] --- build-helper-maven-plugin:1.5:add-source (add-package-info) @ hbase ---
[INFO] Source directory: /x1/jenkins/jenkins-slave/workspace/hbase-0.90/trunk/target/generated-sources added.
[INFO]
[INFO] --- maven-remote-resources-plugin:1.1:process (default) @ hbase ---
[INFO] Setting property: classpath.resource.loader.class => 'org.codehaus.plexus.velocity.ContextClassLoaderResourceLoader'.
[INFO] Setting property: velocimacro.messages.on => 'false'.
[INFO] Setting property: resource.loader => 'classpath'.
[INFO] Setting property: resource.manager.logwhenfound => 'false'.
[INFO]
[INFO] --- maven-resources-plugin:2.4:resources (default-resources) @ hbase ---
[INFO] Using 'UTF-8' encoding to copy filtered resources.
[INFO] Copying 1 resource
[INFO] Copying 6 resources
[INFO] Copying 3 resources
[INFO]
[INFO] --- maven-antrun-plugin:1.3:run (default) @ hbase ---
[INFO] Executing tasks
[INFO] Executed tasks
[INFO]
[INFO] --- maven-compiler-plugin:2.0.2:compile (default-compile) @ hbase ---
[INFO] Compiling 468 source files to /x1/jenkins/jenkins-slave/workspace/hbase-0.90/trunk/target/classes
[INFO]
[INFO] --- maven-resources-plugin:2.4:testResources (default-testResources) @ hbase ---
[INFO] Using 'UTF-8' encoding to copy filtered resources.
[INFO] Copying 4 resources
[INFO] Copying 3 resources
[INFO]
[INFO] --- maven-compiler-plugin:2.0.2:testCompile (default-testCompile) @ hbase ---
[INFO] Compiling 204 source files to /x1/jenkins/jenkins-slave/workspace/hbase-0.90/trunk/target/test-classes
[INFO]
[INFO] --- maven-surefire-plugin:2.4.3:test (default-test) @ hbase ---
[INFO] Surefire report directory: /x1/jenkins/jenkins-slave/workspace/hbase-0.90/trunk/target/surefire-reports
-------------------------------------------------------
T E S T S
-------------------------------------------------------
Running org.apache.hadoop.hbase.master.TestHMasterRPCException
Tests run: 1, Failures: 0, Errors: 0, Skipped: 0, Time elapsed: 0.347 sec
Running org.apache.hadoop.hbase.regionserver.TestColumnSeeking
Tests run: 2, Failures: 0, Errors: 0, Skipped: 0, Time elapsed: 3.135 sec
Running org.apache.hadoop.hbase.client.TestMultipleTimestamps
Tests run: 8, Failures: 0, Errors: 0, Skipped: 0, Time elapsed: 124.807 sec
Running org.apache.hadoop.hbase.regionserver.TestMemStoreLAB
Tests run: 3, Failures: 0, Errors: 0, Skipped: 0, Time elapsed: 1.011 sec
Running org.apache.hadoop.hbase.TestZooKeeper
Tests run: 5, Failures: 0, Errors: 0, Skipped: 0, Time elapsed: 117.184 sec
Running org.apache.hadoop.hbase.regionserver.wal.TestLogRolling
killed.
[INFO] ------------------------------------------------------------------------
[INFO] BUILD FAILURE
[INFO] ------------------------------------------------------------------------
[INFO] Total time: 19:46.893s
[INFO] Finished at: Sun Apr 01 04:36:25 UTC 2012
[INFO] Final Memory: 54M/1019M
[INFO] ------------------------------------------------------------------------
[ERROR] Failed to execute goal org.apache.maven.plugins:maven-surefire-plugin:2.4.3:test (default-test) on project hbase: Error while executing forked tests.; nested exception is org.apache.maven.surefire.booter.shade.org.codehaus.plexus.util.cli.CommandLineException: Error while executing external command, process killed. Process timeout out after 900 seconds -> [Help 1]
[ERROR]
[ERROR] To see the full stack trace of the errors, re-run Maven with the -e switch.
[ERROR] Re-run Maven using the -X switch to enable full debug logging.
[ERROR]
[ERROR] For more information about the errors and possible solutions, please read the following articles:
[ERROR] [Help 1] http://cwiki.apache.org/confluence/display/MAVEN/MojoExecutionException
Build step 'Invoke top-level Maven targets' marked build as failure
[locks-and-latches] Releasing all the locks
[locks-and-latches] All the locks released
Archiving artifacts
Recording test results
Jenkins build is back to normal : hbase-0.90 #466
Posted by Apache Jenkins Server <je...@builds.apache.org>.
See <https://builds.apache.org/job/hbase-0.90/466/changes>
Build failed in Jenkins: hbase-0.90 #465
Posted by Apache Jenkins Server <je...@builds.apache.org>.
See <https://builds.apache.org/job/hbase-0.90/465/changes>
Changes:
[jmhsieh] Revert 'HBASE-5213 "hbase master stop" does not bring down backup masters' due to hanging TestLogRolling
------------------------------------------
[...truncated 897 lines...]
A src/site/site.vm
A src/site/resources
A src/site/resources/images
AU src/site/resources/images/replication_overview.png
AU src/site/resources/images/asf_logo_wide.png
AU src/site/resources/images/architecture.gif
AU src/site/resources/images/hadoop-logo.jpg
AU src/site/resources/images/hbase_logo_med.gif
AU src/site/resources/images/favicon.ico
AU src/site/resources/images/hbase_small.gif
A src/site/resources/css
A src/site/resources/css/freebsd_docbook.css
A src/site/resources/css/site.css
A src/site/xdoc
A src/site/xdoc/cygwin.xml
A src/site/xdoc/acid-semantics.xml
A src/site/xdoc/metrics.xml
A src/site/xdoc/index.xml
A src/site/xdoc/replication.xml
A src/site/xdoc/old_news.xml
A src/site/xdoc/bulk-loads.xml
A src/site/xdoc/pseudo-distributed.xml
A src/docbkx
A src/docbkx/upgrading.xml
A src/docbkx/performance.xml
A src/docbkx/developer.xml
A src/docbkx/preface.xml
A src/docbkx/configuration.xml
A src/docbkx/getting_started.xml
A src/docbkx/shell.xml
A src/docbkx/troubleshooting.xml
A src/docbkx/book.xml
A src/docbkx/build.xml
AU src/saveVersion.sh
A src/examples
A src/examples/thrift
A src/examples/thrift/DemoClient.java
A src/examples/thrift/DemoClient.cpp
A src/examples/thrift/DemoClient.rb
A src/examples/thrift/DemoClient.php
AU src/examples/thrift/DemoClient.py
A src/examples/thrift/README.txt
A src/examples/thrift/Makefile
A src/examples/mapreduce
A src/examples/mapreduce/org
A src/examples/mapreduce/org/apache
A src/examples/mapreduce/org/apache/hadoop
A src/examples/mapreduce/org/apache/hadoop/hbase
A src/examples/mapreduce/org/apache/hadoop/hbase/mapreduce
A src/examples/mapreduce/org/apache/hadoop/hbase/mapreduce/SampleUploader.java
A src/examples/mapreduce/org/apache/hadoop/hbase/mapreduce/IndexBuilder.java
A src/examples/mapreduce/index-builder-setup.rb
A src/examples/README.txt
A bin
AU bin/hbase-daemons.sh
A bin/rename_table.rb
AU bin/hbase
A bin/copy_table.rb
A bin/check_meta.rb
AU bin/start-hbase.sh
A bin/hirb.rb
A bin/set_meta_block_caching.rb
A bin/loadtable.rb
AU bin/hbase-daemon.sh
A bin/region_mover.rb
A bin/hbase-config.sh
A bin/local-regionservers.sh
AU bin/zookeepers.sh
A bin/local-master-backup.sh
A bin/add_table.rb
AU bin/rolling-restart.sh
AU bin/regionservers.sh
A bin/graceful_stop.sh
AU bin/master-backup.sh
A bin/set_meta_memstore_size.rb
A bin/replication
A bin/replication/copy_tables_desc.rb
AU bin/stop-hbase.sh
A pom.xml
A README.txt
U .
At revision 1310488
[locks-and-latches] Checking to see if we really have the locks
[locks-and-latches] Have all the locks, build can start
[hbase-0.90] $ /bin/bash -xe /tmp/hudson4414401253999881935.sh
+ hostname
hemera
+ ulimit -a
core file size (blocks, -c) 0
data seg size (kbytes, -d) unlimited
scheduling priority (-e) 0
file size (blocks, -f) unlimited
pending signals (-i) 193125
max locked memory (kbytes, -l) 64
max memory size (kbytes, -m) unlimited
open files (-n) 40000
pipe size (512 bytes, -p) 8
POSIX message queues (bytes, -q) 819200
real-time priority (-r) 0
stack size (kbytes, -s) 10240
cpu time (seconds, -t) unlimited
max user processes (-u) 193125
virtual memory (kbytes, -v) unlimited
file locks (-x) unlimited
+ jps
2066 surefirebooter496180626262524471.jar
14174 surefirebooter4745974203586116286.jar
18825 surefirebooter6349514521539976099.jar
9724 surefirebooter4295819925728414467.jar
23128 jar
23309 JUnitTestRunner
1743 surefirebooter2943390046691315229.jar
3901 Jps
6314 surefirebooter1263901890052808665.jar
11399 Launcher
8754 surefirebooter7444888785771302972.jar
32263 surefirebooter1549448917691647749.jar
3820 RunJar
[trunk] $ /home/hudson/tools/maven/latest3/bin/mvn clean -Dmaven.test.redirectTestOutputToFile=true site assembly:assembly
[INFO] Scanning for projects...
[INFO]
[INFO] ------------------------------------------------------------------------
[INFO] Building HBase 0.90.7-SNAPSHOT
[INFO] ------------------------------------------------------------------------
[INFO]
[INFO] --- maven-clean-plugin:2.4.1:clean (default-clean) @ hbase ---
[INFO]
[INFO] --- xml-maven-plugin:1.0-beta-3:transform (default) @ hbase ---
[INFO] Transforming file: /x1/jenkins/jenkins-slave/workspace/hbase-0.90/trunk/src/main/resources/hbase-default.xml
[INFO] Transformed 1 file(s).
[INFO]
[INFO] --- docbkx-maven-plugin:2.0.11:generate-html (default) @ hbase ---
[INFO] Processing input file: upgrading.xml
[INFO] /x1/jenkins/jenkins-slave/workspace/hbase-0.90/trunk/target/site/upgrading.html has been generated.
[INFO] Processing input file: shell.xml
[INFO] /x1/jenkins/jenkins-slave/workspace/hbase-0.90/trunk/target/site/shell.html has been generated.
[INFO] Processing input file: configuration.xml
[INFO] /x1/jenkins/jenkins-slave/workspace/hbase-0.90/trunk/target/site/configuration.html has been generated.
[INFO] Processing input file: getting_started.xml
[INFO] /x1/jenkins/jenkins-slave/workspace/hbase-0.90/trunk/target/site/getting_started.html has been generated.
[INFO] Processing input file: troubleshooting.xml
[INFO] /x1/jenkins/jenkins-slave/workspace/hbase-0.90/trunk/target/site/troubleshooting.html has been generated.
[INFO] Processing input file: build.xml
[INFO] /x1/jenkins/jenkins-slave/workspace/hbase-0.90/trunk/target/site/build.html has been generated.
[INFO] Processing input file: performance.xml
[INFO] /x1/jenkins/jenkins-slave/workspace/hbase-0.90/trunk/target/site/performance.html has been generated.
[INFO] Processing input file: developer.xml
[INFO] /x1/jenkins/jenkins-slave/workspace/hbase-0.90/trunk/target/site/developer.html has been generated.
[INFO] Processing input file: book.xml
[INFO] /x1/jenkins/jenkins-slave/workspace/hbase-0.90/trunk/target/site/book.html has been generated.
[INFO] /x1/jenkins/jenkins-slave/workspace/hbase-0.90/trunk/target/site/preface.html is up to date.
[INFO]
[INFO] --- maven-site-plugin:2.0.1:site (default-site) @ hbase ---
[INFO] Unable to load parent project from a relative path: 1 problem was encountered while building the effective model
[FATAL] Non-readable POM /x1/jenkins/jenkins-slave/workspace/hbase-0.90/pom.xml: /x1/jenkins/jenkins-slave/workspace/hbase-0.90/pom.xml (No such file or directory) @
for project at /x1/jenkins/jenkins-slave/workspace/hbase-0.90/pom.xml for project at /x1/jenkins/jenkins-slave/workspace/hbase-0.90/pom.xml
[INFO] Parent project loaded from repository.
[INFO] Unable to load parent project from a relative path: 1 problem was encountered while building the effective model
[FATAL] Non-readable POM /x1/jenkins/jenkins-slave/workspace/hbase-0.90/pom.xml: /x1/jenkins/jenkins-slave/workspace/hbase-0.90/pom.xml (No such file or directory) @
for project at /x1/jenkins/jenkins-slave/workspace/hbase-0.90/pom.xml for project at /x1/jenkins/jenkins-slave/workspace/hbase-0.90/pom.xml
[INFO] Parent project loaded from repository.
[INFO]
[INFO] ------------------------------------------------------------------------
[INFO] Building HBase 0.90.7-SNAPSHOT
[INFO] ------------------------------------------------------------------------
[INFO]
[INFO] >>> maven-assembly-plugin:2.2-beta-5:assembly (default-cli) @ hbase >>>
[INFO]
[INFO] --- maven-antrun-plugin:1.3:run (generate) @ hbase ---
[INFO] Executing tasks
[mkdir] Created dir: /x1/jenkins/jenkins-slave/workspace/hbase-0.90/trunk/target/hbase-webapps
[copy] Copying 4 files to /x1/jenkins/jenkins-slave/workspace/hbase-0.90/trunk/target/hbase-webapps
SLF4J: Failed to load class "org.slf4j.impl.StaticLoggerBinder".
SLF4J: See http://www.slf4j.org/codes.html#StaticLoggerBinder for further details.
2012-04-06 17:17:11.229:INFO::Logging to STDERR via org.mortbay.log.StdErrLog
[mkdir] Created dir: /x1/jenkins/jenkins-slave/workspace/hbase-0.90/trunk/target/hbase-webapps/master/WEB-INF
[mkdir] Created dir: /x1/jenkins/jenkins-slave/workspace/hbase-0.90/trunk/target/hbase-webapps/regionserver/WEB-INF
[INFO] Executed tasks
[INFO]
[INFO] --- build-helper-maven-plugin:1.5:add-source (add-jspc-source) @ hbase ---
[INFO] Source directory: /x1/jenkins/jenkins-slave/workspace/hbase-0.90/trunk/target/jspc added.
[INFO]
[INFO] --- build-helper-maven-plugin:1.5:add-source (add-package-info) @ hbase ---
[INFO] Source directory: /x1/jenkins/jenkins-slave/workspace/hbase-0.90/trunk/target/generated-sources added.
[INFO]
[INFO] --- maven-remote-resources-plugin:1.1:process (default) @ hbase ---
[INFO] Setting property: classpath.resource.loader.class => 'org.codehaus.plexus.velocity.ContextClassLoaderResourceLoader'.
[INFO] Setting property: velocimacro.messages.on => 'false'.
[INFO] Setting property: resource.loader => 'classpath'.
[INFO] Setting property: resource.manager.logwhenfound => 'false'.
[INFO]
[INFO] --- maven-resources-plugin:2.4:resources (default-resources) @ hbase ---
[INFO] Using 'UTF-8' encoding to copy filtered resources.
[INFO] Copying 1 resource
[INFO] Copying 6 resources
[INFO] Copying 3 resources
[INFO]
[INFO] --- maven-antrun-plugin:1.3:run (default) @ hbase ---
[INFO] Executing tasks
[INFO] Executed tasks
[INFO]
[INFO] --- maven-compiler-plugin:2.0.2:compile (default-compile) @ hbase ---
[INFO] Compiling 468 source files to /x1/jenkins/jenkins-slave/workspace/hbase-0.90/trunk/target/classes
[INFO]
[INFO] --- maven-resources-plugin:2.4:testResources (default-testResources) @ hbase ---
[INFO] Using 'UTF-8' encoding to copy filtered resources.
[INFO] Copying 4 resources
[INFO] Copying 3 resources
[INFO]
[INFO] --- maven-compiler-plugin:2.0.2:testCompile (default-testCompile) @ hbase ---
[INFO] Compiling 203 source files to /x1/jenkins/jenkins-slave/workspace/hbase-0.90/trunk/target/test-classes
[INFO]
[INFO] --- maven-surefire-plugin:2.4.3:test (default-test) @ hbase ---
[INFO] Surefire report directory: /x1/jenkins/jenkins-slave/workspace/hbase-0.90/trunk/target/surefire-reports
-------------------------------------------------------
T E S T S
-------------------------------------------------------
Running org.apache.hadoop.hbase.master.TestHMasterRPCException
Tests run: 1, Failures: 0, Errors: 0, Skipped: 0, Time elapsed: 0.286 sec
Running org.apache.hadoop.hbase.regionserver.TestColumnSeeking
Tests run: 2, Failures: 0, Errors: 0, Skipped: 0, Time elapsed: 3.117 sec
Running org.apache.hadoop.hbase.client.TestMultipleTimestamps
Tests run: 8, Failures: 0, Errors: 0, Skipped: 0, Time elapsed: 51.093 sec
Running org.apache.hadoop.hbase.regionserver.TestMemStoreLAB
Tests run: 3, Failures: 0, Errors: 0, Skipped: 0, Time elapsed: 0.828 sec
Running org.apache.hadoop.hbase.TestZooKeeper
Tests run: 5, Failures: 0, Errors: 0, Skipped: 0, Time elapsed: 54.745 sec
Running org.apache.hadoop.hbase.regionserver.wal.TestLogRolling
killed.
[INFO] ------------------------------------------------------------------------
[INFO] BUILD FAILURE
[INFO] ------------------------------------------------------------------------
[INFO] Total time: 17:24.880s
[INFO] Finished at: Fri Apr 06 17:34:24 UTC 2012
[INFO] Final Memory: 53M/1052M
[INFO] ------------------------------------------------------------------------
[ERROR] Failed to execute goal org.apache.maven.plugins:maven-surefire-plugin:2.4.3:test (default-test) on project hbase: Error while executing forked tests.; nested exception is org.apache.maven.surefire.booter.shade.org.codehaus.plexus.util.cli.CommandLineException: Error while executing external command, process killed. Process timeout out after 900 seconds -> [Help 1]
[ERROR]
[ERROR] To see the full stack trace of the errors, re-run Maven with the -e switch.
[ERROR] Re-run Maven using the -X switch to enable full debug logging.
[ERROR]
[ERROR] For more information about the errors and possible solutions, please read the following articles:
[ERROR] [Help 1] http://cwiki.apache.org/confluence/display/MAVEN/MojoExecutionException
Build step 'Invoke top-level Maven targets' marked build as failure
[locks-and-latches] Releasing all the locks
[locks-and-latches] All the locks released
Archiving artifacts
Recording test results
Build failed in Jenkins: hbase-0.90 #464
Posted by Apache Jenkins Server <je...@builds.apache.org>.
See <https://builds.apache.org/job/hbase-0.90/464/changes>
Changes:
[jmhsieh] HBASE-5680 Improve compatibility warning about HBase with Hadoop 0.23.x
------------------------------------------
[...truncated 892 lines...]
A src/main/resources/org/apache/hadoop/hbase/rest/protobuf/VersionMessage.proto
A src/main/resources/org/apache/hadoop/hbase/rest/XMLSchema.xsd
A src/main/xslt
A src/main/xslt/configuration_to_docbook_section.xsl
A src/site
A src/site/site.xml
A src/site/site.vm
A src/site/resources
A src/site/resources/images
AU src/site/resources/images/replication_overview.png
AU src/site/resources/images/asf_logo_wide.png
AU src/site/resources/images/architecture.gif
AU src/site/resources/images/hadoop-logo.jpg
AU src/site/resources/images/hbase_logo_med.gif
AU src/site/resources/images/favicon.ico
AU src/site/resources/images/hbase_small.gif
A src/site/resources/css
A src/site/resources/css/freebsd_docbook.css
A src/site/resources/css/site.css
A src/site/xdoc
A src/site/xdoc/cygwin.xml
A src/site/xdoc/acid-semantics.xml
A src/site/xdoc/metrics.xml
A src/site/xdoc/index.xml
A src/site/xdoc/replication.xml
A src/site/xdoc/old_news.xml
A src/site/xdoc/bulk-loads.xml
A src/site/xdoc/pseudo-distributed.xml
A src/docbkx
A src/docbkx/upgrading.xml
A src/docbkx/performance.xml
A src/docbkx/developer.xml
A src/docbkx/preface.xml
A src/docbkx/configuration.xml
A src/docbkx/getting_started.xml
A src/docbkx/shell.xml
A src/docbkx/troubleshooting.xml
A src/docbkx/book.xml
A src/docbkx/build.xml
AU src/saveVersion.sh
A src/examples
A src/examples/thrift
A src/examples/thrift/DemoClient.java
A src/examples/thrift/DemoClient.cpp
A src/examples/thrift/DemoClient.rb
A src/examples/thrift/DemoClient.php
AU src/examples/thrift/DemoClient.py
A src/examples/thrift/README.txt
A src/examples/thrift/Makefile
A src/examples/mapreduce
A src/examples/mapreduce/org
A src/examples/mapreduce/org/apache
A src/examples/mapreduce/org/apache/hadoop
A src/examples/mapreduce/org/apache/hadoop/hbase
A src/examples/mapreduce/org/apache/hadoop/hbase/mapreduce
A src/examples/mapreduce/org/apache/hadoop/hbase/mapreduce/SampleUploader.java
A src/examples/mapreduce/org/apache/hadoop/hbase/mapreduce/IndexBuilder.java
A src/examples/mapreduce/index-builder-setup.rb
A src/examples/README.txt
A bin
AU bin/hbase-daemons.sh
A bin/rename_table.rb
AU bin/hbase
A bin/copy_table.rb
A bin/check_meta.rb
AU bin/start-hbase.sh
A bin/hirb.rb
A bin/set_meta_block_caching.rb
A bin/loadtable.rb
AU bin/hbase-daemon.sh
A bin/region_mover.rb
A bin/hbase-config.sh
A bin/local-regionservers.sh
AU bin/zookeepers.sh
A bin/local-master-backup.sh
A bin/add_table.rb
AU bin/rolling-restart.sh
AU bin/regionservers.sh
A bin/graceful_stop.sh
AU bin/master-backup.sh
A bin/set_meta_memstore_size.rb
A bin/replication
A bin/replication/copy_tables_desc.rb
AU bin/stop-hbase.sh
A pom.xml
A README.txt
U .
At revision 1310450
[locks-and-latches] Checking to see if we really have the locks
[locks-and-latches] Have all the locks, build can start
[hbase-0.90] $ /bin/bash -xe /tmp/hudson1993803245147795084.sh
+ hostname
janus
+ ulimit -a
core file size (blocks, -c) 0
data seg size (kbytes, -d) unlimited
scheduling priority (-e) 0
file size (blocks, -f) unlimited
pending signals (-i) 128588
max locked memory (kbytes, -l) 64
max memory size (kbytes, -m) unlimited
open files (-n) 40000
pipe size (512 bytes, -p) 8
POSIX message queues (bytes, -q) 819200
real-time priority (-r) 0
stack size (kbytes, -s) 10240
cpu time (seconds, -t) unlimited
max user processes (-u) 128588
virtual memory (kbytes, -v) unlimited
file locks (-x) unlimited
+ jps
13661 jar
14746 Jps
13693 Maven3Main
8067 Main
[trunk] $ /home/hudson/tools/maven/latest3/bin/mvn clean -Dmaven.test.redirectTestOutputToFile=true site assembly:assembly
[INFO] Scanning for projects...
[INFO]
[INFO] ------------------------------------------------------------------------
[INFO] Building HBase 0.90.7-SNAPSHOT
[INFO] ------------------------------------------------------------------------
[INFO]
[INFO] --- maven-clean-plugin:2.4.1:clean (default-clean) @ hbase ---
[INFO]
[INFO] --- xml-maven-plugin:1.0-beta-3:transform (default) @ hbase ---
[INFO] Transforming file: <https://builds.apache.org/job/hbase-0.90/ws/trunk/src/main/resources/hbase-default.xml>
[INFO] Transformed 1 file(s).
[INFO]
[INFO] --- docbkx-maven-plugin:2.0.11:generate-html (default) @ hbase ---
[INFO] Processing input file: build.xml
[INFO] <https://builds.apache.org/job/hbase-0.90/464/artifact/trunk/target/site/build.html> has been generated.
[INFO] Processing input file: developer.xml
[INFO] <https://builds.apache.org/job/hbase-0.90/464/artifact/trunk/target/site/developer.html> has been generated.
[INFO] Processing input file: preface.xml
[INFO] <https://builds.apache.org/job/hbase-0.90/464/artifact/trunk/target/site/preface.html> has been generated.
[INFO] Processing input file: performance.xml
[INFO] <https://builds.apache.org/job/hbase-0.90/464/artifact/trunk/target/site/performance.html> has been generated.
[INFO] Processing input file: upgrading.xml
[INFO] <https://builds.apache.org/job/hbase-0.90/464/artifact/trunk/target/site/upgrading.html> has been generated.
[INFO] Processing input file: configuration.xml
[INFO] <https://builds.apache.org/job/hbase-0.90/464/artifact/trunk/target/site/configuration.html> has been generated.
[INFO] Processing input file: getting_started.xml
[INFO] <https://builds.apache.org/job/hbase-0.90/464/artifact/trunk/target/site/getting_started.html> has been generated.
[INFO] Processing input file: shell.xml
[INFO] <https://builds.apache.org/job/hbase-0.90/464/artifact/trunk/target/site/shell.html> has been generated.
[INFO] Processing input file: book.xml
[INFO] <https://builds.apache.org/job/hbase-0.90/464/artifact/trunk/target/site/book.html> has been generated.
[INFO] Processing input file: troubleshooting.xml
[INFO] <https://builds.apache.org/job/hbase-0.90/464/artifact/trunk/target/site/troubleshooting.html> has been generated.
[INFO]
[INFO] --- maven-site-plugin:2.0.1:site (default-site) @ hbase ---
[INFO] Unable to load parent project from a relative path: 1 problem was encountered while building the effective model
[FATAL] Non-readable POM <https://builds.apache.org/job/hbase-0.90/ws/pom.xml>: <https://builds.apache.org/job/hbase-0.90/ws/pom.xml> (No such file or directory) @
for project at <https://builds.apache.org/job/hbase-0.90/ws/pom.xml> for project at <https://builds.apache.org/job/hbase-0.90/ws/pom.xml>
[INFO] Parent project loaded from repository.
[INFO] Unable to load parent project from a relative path: 1 problem was encountered while building the effective model
[FATAL] Non-readable POM <https://builds.apache.org/job/hbase-0.90/ws/pom.xml>: <https://builds.apache.org/job/hbase-0.90/ws/pom.xml> (No such file or directory) @
for project at <https://builds.apache.org/job/hbase-0.90/ws/pom.xml> for project at <https://builds.apache.org/job/hbase-0.90/ws/pom.xml>
[INFO] Parent project loaded from repository.
Downloading: http://people.apache.org/~rawson/repo/org/apache/maven/skins/maven-stylus-skin/maven-metadata.xml
[INFO]
[INFO] ------------------------------------------------------------------------
[INFO] Building HBase 0.90.7-SNAPSHOT
[INFO] ------------------------------------------------------------------------
[INFO]
[INFO] >>> maven-assembly-plugin:2.2-beta-5:assembly (default-cli) @ hbase >>>
[INFO]
[INFO] --- maven-antrun-plugin:1.3:run (generate) @ hbase ---
[INFO] Executing tasks
[mkdir] Created dir: <https://builds.apache.org/job/hbase-0.90/ws/trunk/target/hbase-webapps>
[copy] Copying 4 files to <https://builds.apache.org/job/hbase-0.90/ws/trunk/target/hbase-webapps>
SLF4J: Failed to load class "org.slf4j.impl.StaticLoggerBinder".
SLF4J: See http://www.slf4j.org/codes.html#StaticLoggerBinder for further details.
2012-04-06 16:31:40.865:INFO::Logging to STDERR via org.mortbay.log.StdErrLog
[mkdir] Created dir: <https://builds.apache.org/job/hbase-0.90/ws/trunk/target/hbase-webapps/master/WEB-INF>
[mkdir] Created dir: <https://builds.apache.org/job/hbase-0.90/ws/trunk/target/hbase-webapps/regionserver/WEB-INF>
[INFO] Executed tasks
[INFO]
[INFO] --- build-helper-maven-plugin:1.5:add-source (add-jspc-source) @ hbase ---
[INFO] Source directory: <https://builds.apache.org/job/hbase-0.90/ws/trunk/target/jspc> added.
[INFO]
[INFO] --- build-helper-maven-plugin:1.5:add-source (add-package-info) @ hbase ---
[INFO] Source directory: <https://builds.apache.org/job/hbase-0.90/ws/trunk/target/generated-sources> added.
[INFO]
[INFO] --- maven-remote-resources-plugin:1.1:process (default) @ hbase ---
[INFO] Setting property: classpath.resource.loader.class => 'org.codehaus.plexus.velocity.ContextClassLoaderResourceLoader'.
[INFO] Setting property: velocimacro.messages.on => 'false'.
[INFO] Setting property: resource.loader => 'classpath'.
[INFO] Setting property: resource.manager.logwhenfound => 'false'.
[INFO]
[INFO] --- maven-resources-plugin:2.4:resources (default-resources) @ hbase ---
[INFO] Using 'UTF-8' encoding to copy filtered resources.
[INFO] Copying 1 resource
[INFO] Copying 6 resources
[INFO] Copying 3 resources
[INFO]
[INFO] --- maven-antrun-plugin:1.3:run (default) @ hbase ---
[INFO] Executing tasks
[INFO] Executed tasks
[INFO]
[INFO] --- maven-compiler-plugin:2.0.2:compile (default-compile) @ hbase ---
[INFO] Compiling 468 source files to <https://builds.apache.org/job/hbase-0.90/ws/trunk/target/classes>
[INFO]
[INFO] --- maven-resources-plugin:2.4:testResources (default-testResources) @ hbase ---
[INFO] Using 'UTF-8' encoding to copy filtered resources.
[INFO] Copying 4 resources
[INFO] Copying 3 resources
[INFO]
[INFO] --- maven-compiler-plugin:2.0.2:testCompile (default-testCompile) @ hbase ---
[INFO] Compiling 204 source files to <https://builds.apache.org/job/hbase-0.90/ws/trunk/target/test-classes>
[INFO]
[INFO] --- maven-surefire-plugin:2.4.3:test (default-test) @ hbase ---
[INFO] Surefire report directory: <https://builds.apache.org/job/hbase-0.90/ws/trunk/target/surefire-reports>
-------------------------------------------------------
T E S T S
-------------------------------------------------------
Running org.apache.hadoop.hbase.master.TestHMasterRPCException
Tests run: 1, Failures: 0, Errors: 0, Skipped: 0, Time elapsed: 0.351 sec
Running org.apache.hadoop.hbase.regionserver.TestColumnSeeking
Tests run: 2, Failures: 0, Errors: 0, Skipped: 0, Time elapsed: 3.695 sec
Running org.apache.hadoop.hbase.client.TestMultipleTimestamps
Tests run: 8, Failures: 0, Errors: 0, Skipped: 0, Time elapsed: 53.661 sec
Running org.apache.hadoop.hbase.regionserver.TestMemStoreLAB
Tests run: 3, Failures: 0, Errors: 0, Skipped: 0, Time elapsed: 1.208 sec
Running org.apache.hadoop.hbase.TestZooKeeper
Tests run: 5, Failures: 0, Errors: 0, Skipped: 0, Time elapsed: 58.08 sec
Running org.apache.hadoop.hbase.regionserver.wal.TestLogRolling
killed.
[INFO] ------------------------------------------------------------------------
[INFO] BUILD FAILURE
[INFO] ------------------------------------------------------------------------
[INFO] Total time: 17:46.791s
[INFO] Finished at: Fri Apr 06 16:49:08 UTC 2012
[INFO] Final Memory: 47M/719M
[INFO] ------------------------------------------------------------------------
[ERROR] Failed to execute goal org.apache.maven.plugins:maven-surefire-plugin:2.4.3:test (default-test) on project hbase: Error while executing forked tests.; nested exception is org.apache.maven.surefire.booter.shade.org.codehaus.plexus.util.cli.CommandLineException: Error while executing external command, process killed. Process timeout out after 900 seconds -> [Help 1]
[ERROR]
[ERROR] To see the full stack trace of the errors, re-run Maven with the -e switch.
[ERROR] Re-run Maven using the -X switch to enable full debug logging.
[ERROR]
[ERROR] For more information about the errors and possible solutions, please read the following articles:
[ERROR] [Help 1] http://cwiki.apache.org/confluence/display/MAVEN/MojoExecutionException
Build step 'Invoke top-level Maven targets' marked build as failure
[locks-and-latches] Releasing all the locks
[locks-and-latches] All the locks released
Archiving artifacts
Recording test results
Build failed in Jenkins: hbase-0.90 #463
Posted by Apache Jenkins Server <je...@builds.apache.org>.
See <https://builds.apache.org/job/hbase-0.90/463/>
------------------------------------------
[...truncated 898 lines...]
A src/site/site.vm
A src/site/resources
A src/site/resources/images
AU src/site/resources/images/replication_overview.png
AU src/site/resources/images/asf_logo_wide.png
AU src/site/resources/images/architecture.gif
AU src/site/resources/images/hadoop-logo.jpg
AU src/site/resources/images/hbase_logo_med.gif
AU src/site/resources/images/favicon.ico
AU src/site/resources/images/hbase_small.gif
A src/site/resources/css
A src/site/resources/css/freebsd_docbook.css
A src/site/resources/css/site.css
A src/site/xdoc
A src/site/xdoc/cygwin.xml
A src/site/xdoc/acid-semantics.xml
A src/site/xdoc/metrics.xml
A src/site/xdoc/index.xml
A src/site/xdoc/replication.xml
A src/site/xdoc/old_news.xml
A src/site/xdoc/bulk-loads.xml
A src/site/xdoc/pseudo-distributed.xml
A src/docbkx
A src/docbkx/upgrading.xml
A src/docbkx/performance.xml
A src/docbkx/developer.xml
A src/docbkx/preface.xml
A src/docbkx/configuration.xml
A src/docbkx/getting_started.xml
A src/docbkx/shell.xml
A src/docbkx/troubleshooting.xml
A src/docbkx/book.xml
A src/docbkx/build.xml
AU src/saveVersion.sh
A src/examples
A src/examples/thrift
A src/examples/thrift/DemoClient.java
A src/examples/thrift/DemoClient.cpp
A src/examples/thrift/DemoClient.rb
A src/examples/thrift/DemoClient.php
AU src/examples/thrift/DemoClient.py
A src/examples/thrift/README.txt
A src/examples/thrift/Makefile
A src/examples/mapreduce
A src/examples/mapreduce/org
A src/examples/mapreduce/org/apache
A src/examples/mapreduce/org/apache/hadoop
A src/examples/mapreduce/org/apache/hadoop/hbase
A src/examples/mapreduce/org/apache/hadoop/hbase/mapreduce
A src/examples/mapreduce/org/apache/hadoop/hbase/mapreduce/SampleUploader.java
A src/examples/mapreduce/org/apache/hadoop/hbase/mapreduce/IndexBuilder.java
A src/examples/mapreduce/index-builder-setup.rb
A src/examples/README.txt
A bin
AU bin/hbase-daemons.sh
A bin/rename_table.rb
AU bin/hbase
A bin/copy_table.rb
A bin/check_meta.rb
AU bin/start-hbase.sh
A bin/hirb.rb
A bin/set_meta_block_caching.rb
A bin/loadtable.rb
AU bin/hbase-daemon.sh
A bin/region_mover.rb
A bin/hbase-config.sh
A bin/local-regionservers.sh
AU bin/zookeepers.sh
A bin/local-master-backup.sh
A bin/add_table.rb
AU bin/rolling-restart.sh
AU bin/regionservers.sh
A bin/graceful_stop.sh
AU bin/master-backup.sh
A bin/set_meta_memstore_size.rb
A bin/replication
A bin/replication/copy_tables_desc.rb
AU bin/stop-hbase.sh
A pom.xml
A README.txt
U .
At revision 1310153
no change for https://svn.apache.org/repos/asf/hbase/branches/0.90 since the previous build
[locks-and-latches] Checking to see if we really have the locks
[locks-and-latches] Have all the locks, build can start
[hbase-0.90] $ /bin/bash -xe /tmp/hudson5516298887066825719.sh
+ hostname
hemera
+ ulimit -a
core file size (blocks, -c) 0
data seg size (kbytes, -d) unlimited
scheduling priority (-e) 0
file size (blocks, -f) unlimited
pending signals (-i) 193125
max locked memory (kbytes, -l) 64
max memory size (kbytes, -m) unlimited
open files (-n) 40000
pipe size (512 bytes, -p) 8
POSIX message queues (bytes, -q) 819200
real-time priority (-r) 0
stack size (kbytes, -s) 10240
cpu time (seconds, -t) unlimited
max user processes (-u) 193125
virtual memory (kbytes, -v) unlimited
file locks (-x) unlimited
+ jps
8293 surefirebooter7827958516840497788.jar
21469 Launcher
2066 surefirebooter496180626262524471.jar
1832 surefirebooter1017458362181777269.jar
18825 surefirebooter6349514521539976099.jar
14174 surefirebooter4745974203586116286.jar
8754 surefirebooter7444888785771302972.jar
8963 Jps
21423 jar
9724 surefirebooter4295819925728414467.jar
32263 surefirebooter1549448917691647749.jar
1743 surefirebooter2943390046691315229.jar
[trunk] $ /home/hudson/tools/maven/latest3/bin/mvn clean -Dmaven.test.redirectTestOutputToFile=true site assembly:assembly
[INFO] Scanning for projects...
[INFO]
[INFO] ------------------------------------------------------------------------
[INFO] Building HBase 0.90.7-SNAPSHOT
[INFO] ------------------------------------------------------------------------
[INFO]
[INFO] --- maven-clean-plugin:2.4.1:clean (default-clean) @ hbase ---
[INFO]
[INFO] --- xml-maven-plugin:1.0-beta-3:transform (default) @ hbase ---
[INFO] Transforming file: /x1/jenkins/jenkins-slave/workspace/hbase-0.90/trunk/src/main/resources/hbase-default.xml
[INFO] Transformed 1 file(s).
[INFO]
[INFO] --- docbkx-maven-plugin:2.0.11:generate-html (default) @ hbase ---
[INFO] Processing input file: upgrading.xml
[INFO] /x1/jenkins/jenkins-slave/workspace/hbase-0.90/trunk/target/site/upgrading.html has been generated.
[INFO] Processing input file: shell.xml
[INFO] /x1/jenkins/jenkins-slave/workspace/hbase-0.90/trunk/target/site/shell.html has been generated.
[INFO] Processing input file: configuration.xml
[INFO] /x1/jenkins/jenkins-slave/workspace/hbase-0.90/trunk/target/site/configuration.html has been generated.
[INFO] Processing input file: getting_started.xml
[INFO] /x1/jenkins/jenkins-slave/workspace/hbase-0.90/trunk/target/site/getting_started.html has been generated.
[INFO] Processing input file: troubleshooting.xml
[INFO] /x1/jenkins/jenkins-slave/workspace/hbase-0.90/trunk/target/site/troubleshooting.html has been generated.
[INFO] Processing input file: build.xml
[INFO] /x1/jenkins/jenkins-slave/workspace/hbase-0.90/trunk/target/site/build.html has been generated.
[INFO] Processing input file: performance.xml
[INFO] /x1/jenkins/jenkins-slave/workspace/hbase-0.90/trunk/target/site/performance.html has been generated.
[INFO] Processing input file: developer.xml
[INFO] /x1/jenkins/jenkins-slave/workspace/hbase-0.90/trunk/target/site/developer.html has been generated.
[INFO] Processing input file: book.xml
[INFO] /x1/jenkins/jenkins-slave/workspace/hbase-0.90/trunk/target/site/book.html has been generated.
[INFO] /x1/jenkins/jenkins-slave/workspace/hbase-0.90/trunk/target/site/preface.html is up to date.
[INFO]
[INFO] --- maven-site-plugin:2.0.1:site (default-site) @ hbase ---
[INFO] Unable to load parent project from a relative path: 1 problem was encountered while building the effective model
[FATAL] Non-readable POM /x1/jenkins/jenkins-slave/workspace/hbase-0.90/pom.xml: /x1/jenkins/jenkins-slave/workspace/hbase-0.90/pom.xml (No such file or directory) @
for project at /x1/jenkins/jenkins-slave/workspace/hbase-0.90/pom.xml for project at /x1/jenkins/jenkins-slave/workspace/hbase-0.90/pom.xml
[INFO] Parent project loaded from repository.
[INFO] Unable to load parent project from a relative path: 1 problem was encountered while building the effective model
[FATAL] Non-readable POM /x1/jenkins/jenkins-slave/workspace/hbase-0.90/pom.xml: /x1/jenkins/jenkins-slave/workspace/hbase-0.90/pom.xml (No such file or directory) @
for project at /x1/jenkins/jenkins-slave/workspace/hbase-0.90/pom.xml for project at /x1/jenkins/jenkins-slave/workspace/hbase-0.90/pom.xml
[INFO] Parent project loaded from repository.
[INFO]
[INFO] ------------------------------------------------------------------------
[INFO] Building HBase 0.90.7-SNAPSHOT
[INFO] ------------------------------------------------------------------------
[INFO]
[INFO] >>> maven-assembly-plugin:2.2-beta-5:assembly (default-cli) @ hbase >>>
[INFO]
[INFO] --- maven-antrun-plugin:1.3:run (generate) @ hbase ---
[INFO] Executing tasks
[mkdir] Created dir: /x1/jenkins/jenkins-slave/workspace/hbase-0.90/trunk/target/hbase-webapps
[copy] Copying 4 files to /x1/jenkins/jenkins-slave/workspace/hbase-0.90/trunk/target/hbase-webapps
SLF4J: Failed to load class "org.slf4j.impl.StaticLoggerBinder".
SLF4J: See http://www.slf4j.org/codes.html#StaticLoggerBinder for further details.
2012-04-06 03:06:40.446:INFO::Logging to STDERR via org.mortbay.log.StdErrLog
[mkdir] Created dir: /x1/jenkins/jenkins-slave/workspace/hbase-0.90/trunk/target/hbase-webapps/master/WEB-INF
[mkdir] Created dir: /x1/jenkins/jenkins-slave/workspace/hbase-0.90/trunk/target/hbase-webapps/regionserver/WEB-INF
[INFO] Executed tasks
[INFO]
[INFO] --- build-helper-maven-plugin:1.5:add-source (add-jspc-source) @ hbase ---
[INFO] Source directory: /x1/jenkins/jenkins-slave/workspace/hbase-0.90/trunk/target/jspc added.
[INFO]
[INFO] --- build-helper-maven-plugin:1.5:add-source (add-package-info) @ hbase ---
[INFO] Source directory: /x1/jenkins/jenkins-slave/workspace/hbase-0.90/trunk/target/generated-sources added.
[INFO]
[INFO] --- maven-remote-resources-plugin:1.1:process (default) @ hbase ---
[INFO] Setting property: classpath.resource.loader.class => 'org.codehaus.plexus.velocity.ContextClassLoaderResourceLoader'.
[INFO] Setting property: velocimacro.messages.on => 'false'.
[INFO] Setting property: resource.loader => 'classpath'.
[INFO] Setting property: resource.manager.logwhenfound => 'false'.
[INFO]
[INFO] --- maven-resources-plugin:2.4:resources (default-resources) @ hbase ---
[INFO] Using 'UTF-8' encoding to copy filtered resources.
[INFO] Copying 1 resource
[INFO] Copying 6 resources
[INFO] Copying 3 resources
[INFO]
[INFO] --- maven-antrun-plugin:1.3:run (default) @ hbase ---
[INFO] Executing tasks
[INFO] Executed tasks
[INFO]
[INFO] --- maven-compiler-plugin:2.0.2:compile (default-compile) @ hbase ---
[INFO] Compiling 468 source files to /x1/jenkins/jenkins-slave/workspace/hbase-0.90/trunk/target/classes
[INFO]
[INFO] --- maven-resources-plugin:2.4:testResources (default-testResources) @ hbase ---
[INFO] Using 'UTF-8' encoding to copy filtered resources.
[INFO] Copying 4 resources
[INFO] Copying 3 resources
[INFO]
[INFO] --- maven-compiler-plugin:2.0.2:testCompile (default-testCompile) @ hbase ---
[INFO] Compiling 204 source files to /x1/jenkins/jenkins-slave/workspace/hbase-0.90/trunk/target/test-classes
[INFO]
[INFO] --- maven-surefire-plugin:2.4.3:test (default-test) @ hbase ---
[INFO] Surefire report directory: /x1/jenkins/jenkins-slave/workspace/hbase-0.90/trunk/target/surefire-reports
-------------------------------------------------------
T E S T S
-------------------------------------------------------
Running org.apache.hadoop.hbase.master.TestHMasterRPCException
Tests run: 1, Failures: 0, Errors: 0, Skipped: 0, Time elapsed: 0.233 sec
Running org.apache.hadoop.hbase.regionserver.TestColumnSeeking
Tests run: 2, Failures: 0, Errors: 0, Skipped: 0, Time elapsed: 3.369 sec
Running org.apache.hadoop.hbase.client.TestMultipleTimestamps
Tests run: 8, Failures: 0, Errors: 0, Skipped: 0, Time elapsed: 51.001 sec
Running org.apache.hadoop.hbase.regionserver.TestMemStoreLAB
Tests run: 3, Failures: 0, Errors: 0, Skipped: 0, Time elapsed: 1.074 sec
Running org.apache.hadoop.hbase.TestZooKeeper
Tests run: 5, Failures: 0, Errors: 0, Skipped: 0, Time elapsed: 54.685 sec
Running org.apache.hadoop.hbase.regionserver.wal.TestLogRolling
killed.
[INFO] ------------------------------------------------------------------------
[INFO] BUILD FAILURE
[INFO] ------------------------------------------------------------------------
[INFO] Total time: 17:23.062s
[INFO] Finished at: Fri Apr 06 03:23:53 UTC 2012
[INFO] Final Memory: 48M/726M
[INFO] ------------------------------------------------------------------------
[ERROR] Failed to execute goal org.apache.maven.plugins:maven-surefire-plugin:2.4.3:test (default-test) on project hbase: Error while executing forked tests.; nested exception is org.apache.maven.surefire.booter.shade.org.codehaus.plexus.util.cli.CommandLineException: Error while executing external command, process killed. Process timeout out after 900 seconds -> [Help 1]
[ERROR]
[ERROR] To see the full stack trace of the errors, re-run Maven with the -e switch.
[ERROR] Re-run Maven using the -X switch to enable full debug logging.
[ERROR]
[ERROR] For more information about the errors and possible solutions, please read the following articles:
[ERROR] [Help 1] http://cwiki.apache.org/confluence/display/MAVEN/MojoExecutionException
Build step 'Invoke top-level Maven targets' marked build as failure
[locks-and-latches] Releasing all the locks
[locks-and-latches] All the locks released
Archiving artifacts
Recording test results
Build failed in Jenkins: hbase-0.90 #462
Posted by Apache Jenkins Server <je...@builds.apache.org>.
See <https://builds.apache.org/job/hbase-0.90/462/>
------------------------------------------
[...truncated 897 lines...]
A src/site/site.xml
A src/site/site.vm
A src/site/resources
A src/site/resources/images
AU src/site/resources/images/replication_overview.png
AU src/site/resources/images/asf_logo_wide.png
AU src/site/resources/images/architecture.gif
AU src/site/resources/images/hadoop-logo.jpg
AU src/site/resources/images/hbase_logo_med.gif
AU src/site/resources/images/favicon.ico
AU src/site/resources/images/hbase_small.gif
A src/site/resources/css
A src/site/resources/css/freebsd_docbook.css
A src/site/resources/css/site.css
A src/site/xdoc
A src/site/xdoc/cygwin.xml
A src/site/xdoc/acid-semantics.xml
A src/site/xdoc/metrics.xml
A src/site/xdoc/index.xml
A src/site/xdoc/replication.xml
A src/site/xdoc/old_news.xml
A src/site/xdoc/bulk-loads.xml
A src/site/xdoc/pseudo-distributed.xml
A src/docbkx
A src/docbkx/upgrading.xml
A src/docbkx/performance.xml
A src/docbkx/developer.xml
A src/docbkx/preface.xml
A src/docbkx/configuration.xml
A src/docbkx/getting_started.xml
A src/docbkx/shell.xml
A src/docbkx/troubleshooting.xml
A src/docbkx/book.xml
A src/docbkx/build.xml
AU src/saveVersion.sh
A src/examples
A src/examples/thrift
A src/examples/thrift/DemoClient.java
A src/examples/thrift/DemoClient.cpp
A src/examples/thrift/DemoClient.rb
A src/examples/thrift/DemoClient.php
AU src/examples/thrift/DemoClient.py
A src/examples/thrift/README.txt
A src/examples/thrift/Makefile
A src/examples/mapreduce
A src/examples/mapreduce/org
A src/examples/mapreduce/org/apache
A src/examples/mapreduce/org/apache/hadoop
A src/examples/mapreduce/org/apache/hadoop/hbase
A src/examples/mapreduce/org/apache/hadoop/hbase/mapreduce
A src/examples/mapreduce/org/apache/hadoop/hbase/mapreduce/SampleUploader.java
A src/examples/mapreduce/org/apache/hadoop/hbase/mapreduce/IndexBuilder.java
A src/examples/mapreduce/index-builder-setup.rb
A src/examples/README.txt
A bin
AU bin/hbase-daemons.sh
A bin/rename_table.rb
AU bin/hbase
A bin/copy_table.rb
A bin/check_meta.rb
AU bin/start-hbase.sh
A bin/hirb.rb
A bin/set_meta_block_caching.rb
A bin/loadtable.rb
AU bin/hbase-daemon.sh
A bin/region_mover.rb
A bin/hbase-config.sh
A bin/local-regionservers.sh
AU bin/zookeepers.sh
A bin/local-master-backup.sh
A bin/add_table.rb
AU bin/rolling-restart.sh
AU bin/regionservers.sh
A bin/graceful_stop.sh
AU bin/master-backup.sh
A bin/set_meta_memstore_size.rb
A bin/replication
A bin/replication/copy_tables_desc.rb
AU bin/stop-hbase.sh
A pom.xml
A README.txt
U .
At revision 1310152
no change for https://svn.apache.org/repos/asf/hbase/branches/0.90 since the previous build
[locks-and-latches] Checking to see if we really have the locks
[locks-and-latches] Have all the locks, build can start
[hbase-0.90] $ /bin/bash -xe /tmp/hudson5914436851233045261.sh
+ hostname
hemera
+ ulimit -a
core file size (blocks, -c) 0
data seg size (kbytes, -d) unlimited
scheduling priority (-e) 0
file size (blocks, -f) unlimited
pending signals (-i) 193125
max locked memory (kbytes, -l) 64
max memory size (kbytes, -m) unlimited
open files (-n) 40000
pipe size (512 bytes, -p) 8
POSIX message queues (bytes, -q) 819200
real-time priority (-r) 0
stack size (kbytes, -s) 10240
cpu time (seconds, -t) unlimited
max user processes (-u) 193125
virtual memory (kbytes, -v) unlimited
file locks (-x) unlimited
+ jps
28544 surefirebooter4077001136382630933.jar
21469 Launcher
2066 surefirebooter496180626262524471.jar
18825 surefirebooter6349514521539976099.jar
14174 surefirebooter4745974203586116286.jar
8754 surefirebooter7444888785771302972.jar
21423 jar
9724 surefirebooter4295819925728414467.jar
32263 surefirebooter1549448917691647749.jar
28900 Jps
1743 surefirebooter2943390046691315229.jar
[trunk] $ /home/hudson/tools/maven/latest3/bin/mvn clean -Dmaven.test.redirectTestOutputToFile=true site assembly:assembly
[INFO] Scanning for projects...
[INFO]
[INFO] ------------------------------------------------------------------------
[INFO] Building HBase 0.90.7-SNAPSHOT
[INFO] ------------------------------------------------------------------------
[INFO]
[INFO] --- maven-clean-plugin:2.4.1:clean (default-clean) @ hbase ---
[INFO]
[INFO] --- xml-maven-plugin:1.0-beta-3:transform (default) @ hbase ---
[INFO] Transforming file: /x1/jenkins/jenkins-slave/workspace/hbase-0.90/trunk/src/main/resources/hbase-default.xml
[INFO] Transformed 1 file(s).
[INFO]
[INFO] --- docbkx-maven-plugin:2.0.11:generate-html (default) @ hbase ---
[INFO] Processing input file: upgrading.xml
[INFO] /x1/jenkins/jenkins-slave/workspace/hbase-0.90/trunk/target/site/upgrading.html has been generated.
[INFO] Processing input file: shell.xml
[INFO] /x1/jenkins/jenkins-slave/workspace/hbase-0.90/trunk/target/site/shell.html has been generated.
[INFO] Processing input file: configuration.xml
[INFO] /x1/jenkins/jenkins-slave/workspace/hbase-0.90/trunk/target/site/configuration.html has been generated.
[INFO] Processing input file: getting_started.xml
[INFO] /x1/jenkins/jenkins-slave/workspace/hbase-0.90/trunk/target/site/getting_started.html has been generated.
[INFO] Processing input file: troubleshooting.xml
[INFO] /x1/jenkins/jenkins-slave/workspace/hbase-0.90/trunk/target/site/troubleshooting.html has been generated.
[INFO] Processing input file: build.xml
[INFO] /x1/jenkins/jenkins-slave/workspace/hbase-0.90/trunk/target/site/build.html has been generated.
[INFO] Processing input file: performance.xml
[INFO] /x1/jenkins/jenkins-slave/workspace/hbase-0.90/trunk/target/site/performance.html has been generated.
[INFO] Processing input file: developer.xml
[INFO] /x1/jenkins/jenkins-slave/workspace/hbase-0.90/trunk/target/site/developer.html has been generated.
[INFO] Processing input file: book.xml
[INFO] /x1/jenkins/jenkins-slave/workspace/hbase-0.90/trunk/target/site/book.html has been generated.
[INFO] /x1/jenkins/jenkins-slave/workspace/hbase-0.90/trunk/target/site/preface.html is up to date.
[INFO]
[INFO] --- maven-site-plugin:2.0.1:site (default-site) @ hbase ---
[INFO] Unable to load parent project from a relative path: 1 problem was encountered while building the effective model
[FATAL] Non-readable POM /x1/jenkins/jenkins-slave/workspace/hbase-0.90/pom.xml: /x1/jenkins/jenkins-slave/workspace/hbase-0.90/pom.xml (No such file or directory) @
for project at /x1/jenkins/jenkins-slave/workspace/hbase-0.90/pom.xml for project at /x1/jenkins/jenkins-slave/workspace/hbase-0.90/pom.xml
[INFO] Parent project loaded from repository.
[INFO] Unable to load parent project from a relative path: 1 problem was encountered while building the effective model
[FATAL] Non-readable POM /x1/jenkins/jenkins-slave/workspace/hbase-0.90/pom.xml: /x1/jenkins/jenkins-slave/workspace/hbase-0.90/pom.xml (No such file or directory) @
for project at /x1/jenkins/jenkins-slave/workspace/hbase-0.90/pom.xml for project at /x1/jenkins/jenkins-slave/workspace/hbase-0.90/pom.xml
[INFO] Parent project loaded from repository.
[INFO]
[INFO] ------------------------------------------------------------------------
[INFO] Building HBase 0.90.7-SNAPSHOT
[INFO] ------------------------------------------------------------------------
[INFO]
[INFO] >>> maven-assembly-plugin:2.2-beta-5:assembly (default-cli) @ hbase >>>
[INFO]
[INFO] --- maven-antrun-plugin:1.3:run (generate) @ hbase ---
[INFO] Executing tasks
[mkdir] Created dir: /x1/jenkins/jenkins-slave/workspace/hbase-0.90/trunk/target/hbase-webapps
[copy] Copying 4 files to /x1/jenkins/jenkins-slave/workspace/hbase-0.90/trunk/target/hbase-webapps
SLF4J: Failed to load class "org.slf4j.impl.StaticLoggerBinder".
SLF4J: See http://www.slf4j.org/codes.html#StaticLoggerBinder for further details.
2012-04-06 02:47:17.612:INFO::Logging to STDERR via org.mortbay.log.StdErrLog
[mkdir] Created dir: /x1/jenkins/jenkins-slave/workspace/hbase-0.90/trunk/target/hbase-webapps/master/WEB-INF
[mkdir] Created dir: /x1/jenkins/jenkins-slave/workspace/hbase-0.90/trunk/target/hbase-webapps/regionserver/WEB-INF
[INFO] Executed tasks
[INFO]
[INFO] --- build-helper-maven-plugin:1.5:add-source (add-jspc-source) @ hbase ---
[INFO] Source directory: /x1/jenkins/jenkins-slave/workspace/hbase-0.90/trunk/target/jspc added.
[INFO]
[INFO] --- build-helper-maven-plugin:1.5:add-source (add-package-info) @ hbase ---
[INFO] Source directory: /x1/jenkins/jenkins-slave/workspace/hbase-0.90/trunk/target/generated-sources added.
[INFO]
[INFO] --- maven-remote-resources-plugin:1.1:process (default) @ hbase ---
[INFO] Setting property: classpath.resource.loader.class => 'org.codehaus.plexus.velocity.ContextClassLoaderResourceLoader'.
[INFO] Setting property: velocimacro.messages.on => 'false'.
[INFO] Setting property: resource.loader => 'classpath'.
[INFO] Setting property: resource.manager.logwhenfound => 'false'.
[INFO]
[INFO] --- maven-resources-plugin:2.4:resources (default-resources) @ hbase ---
[INFO] Using 'UTF-8' encoding to copy filtered resources.
[INFO] Copying 1 resource
[INFO] Copying 6 resources
[INFO] Copying 3 resources
[INFO]
[INFO] --- maven-antrun-plugin:1.3:run (default) @ hbase ---
[INFO] Executing tasks
[INFO] Executed tasks
[INFO]
[INFO] --- maven-compiler-plugin:2.0.2:compile (default-compile) @ hbase ---
[INFO] Compiling 468 source files to /x1/jenkins/jenkins-slave/workspace/hbase-0.90/trunk/target/classes
[INFO]
[INFO] --- maven-resources-plugin:2.4:testResources (default-testResources) @ hbase ---
[INFO] Using 'UTF-8' encoding to copy filtered resources.
[INFO] Copying 4 resources
[INFO] Copying 3 resources
[INFO]
[INFO] --- maven-compiler-plugin:2.0.2:testCompile (default-testCompile) @ hbase ---
[INFO] Compiling 204 source files to /x1/jenkins/jenkins-slave/workspace/hbase-0.90/trunk/target/test-classes
[INFO]
[INFO] --- maven-surefire-plugin:2.4.3:test (default-test) @ hbase ---
[INFO] Surefire report directory: /x1/jenkins/jenkins-slave/workspace/hbase-0.90/trunk/target/surefire-reports
-------------------------------------------------------
T E S T S
-------------------------------------------------------
Running org.apache.hadoop.hbase.master.TestHMasterRPCException
Tests run: 1, Failures: 0, Errors: 0, Skipped: 0, Time elapsed: 0.201 sec
Running org.apache.hadoop.hbase.regionserver.TestColumnSeeking
Tests run: 2, Failures: 0, Errors: 0, Skipped: 0, Time elapsed: 3.016 sec
Running org.apache.hadoop.hbase.client.TestMultipleTimestamps
Tests run: 8, Failures: 0, Errors: 0, Skipped: 0, Time elapsed: 53.06 sec
Running org.apache.hadoop.hbase.regionserver.TestMemStoreLAB
Tests run: 3, Failures: 0, Errors: 0, Skipped: 0, Time elapsed: 0.918 sec
Running org.apache.hadoop.hbase.TestZooKeeper
Tests run: 5, Failures: 0, Errors: 0, Skipped: 0, Time elapsed: 54.562 sec
Running org.apache.hadoop.hbase.regionserver.wal.TestLogRolling
killed.
[INFO] ------------------------------------------------------------------------
[INFO] BUILD FAILURE
[INFO] ------------------------------------------------------------------------
[INFO] Total time: 17:22.217s
[INFO] Finished at: Fri Apr 06 03:04:30 UTC 2012
[INFO] Final Memory: 53M/1033M
[INFO] ------------------------------------------------------------------------
[ERROR] Failed to execute goal org.apache.maven.plugins:maven-surefire-plugin:2.4.3:test (default-test) on project hbase: Error while executing forked tests.; nested exception is org.apache.maven.surefire.booter.shade.org.codehaus.plexus.util.cli.CommandLineException: Error while executing external command, process killed. Process timeout out after 900 seconds -> [Help 1]
[ERROR]
[ERROR] To see the full stack trace of the errors, re-run Maven with the -e switch.
[ERROR] Re-run Maven using the -X switch to enable full debug logging.
[ERROR]
[ERROR] For more information about the errors and possible solutions, please read the following articles:
[ERROR] [Help 1] http://cwiki.apache.org/confluence/display/MAVEN/MojoExecutionException
Build step 'Invoke top-level Maven targets' marked build as failure
[locks-and-latches] Releasing all the locks
[locks-and-latches] All the locks released
Archiving artifacts
Recording test results
Build failed in Jenkins: hbase-0.90 #461
Posted by Apache Jenkins Server <je...@builds.apache.org>.
See <https://builds.apache.org/job/hbase-0.90/461/>
------------------------------------------
[...truncated 906 lines...]
AU src/site/resources/images/favicon.ico
AU src/site/resources/images/hbase_small.gif
A src/site/resources/css
A src/site/resources/css/freebsd_docbook.css
A src/site/resources/css/site.css
A src/site/xdoc
A src/site/xdoc/cygwin.xml
A src/site/xdoc/acid-semantics.xml
A src/site/xdoc/metrics.xml
A src/site/xdoc/index.xml
A src/site/xdoc/replication.xml
A src/site/xdoc/old_news.xml
A src/site/xdoc/bulk-loads.xml
A src/site/xdoc/pseudo-distributed.xml
A src/docbkx
A src/docbkx/upgrading.xml
A src/docbkx/performance.xml
A src/docbkx/developer.xml
A src/docbkx/preface.xml
A src/docbkx/configuration.xml
A src/docbkx/getting_started.xml
A src/docbkx/shell.xml
A src/docbkx/troubleshooting.xml
A src/docbkx/book.xml
A src/docbkx/build.xml
AU src/saveVersion.sh
A src/examples
A src/examples/thrift
A src/examples/thrift/DemoClient.java
A src/examples/thrift/DemoClient.cpp
A src/examples/thrift/DemoClient.rb
A src/examples/thrift/DemoClient.php
AU src/examples/thrift/DemoClient.py
A src/examples/thrift/README.txt
A src/examples/thrift/Makefile
A src/examples/mapreduce
A src/examples/mapreduce/org
A src/examples/mapreduce/org/apache
A src/examples/mapreduce/org/apache/hadoop
A src/examples/mapreduce/org/apache/hadoop/hbase
A src/examples/mapreduce/org/apache/hadoop/hbase/mapreduce
A src/examples/mapreduce/org/apache/hadoop/hbase/mapreduce/SampleUploader.java
A src/examples/mapreduce/org/apache/hadoop/hbase/mapreduce/IndexBuilder.java
A src/examples/mapreduce/index-builder-setup.rb
A src/examples/README.txt
A bin
AU bin/hbase-daemons.sh
A bin/rename_table.rb
AU bin/hbase
A bin/copy_table.rb
A bin/check_meta.rb
AU bin/start-hbase.sh
A bin/hirb.rb
A bin/set_meta_block_caching.rb
A bin/loadtable.rb
AU bin/hbase-daemon.sh
A bin/region_mover.rb
A bin/hbase-config.sh
A bin/local-regionservers.sh
AU bin/zookeepers.sh
A bin/local-master-backup.sh
A bin/add_table.rb
AU bin/rolling-restart.sh
AU bin/regionservers.sh
A bin/graceful_stop.sh
AU bin/master-backup.sh
A bin/set_meta_memstore_size.rb
A bin/replication
A bin/replication/copy_tables_desc.rb
AU bin/stop-hbase.sh
A pom.xml
A README.txt
U .
At revision 1310147
no change for https://svn.apache.org/repos/asf/hbase/branches/0.90 since the previous build
[locks-and-latches] Checking to see if we really have the locks
[locks-and-latches] Have all the locks, build can start
[hbase-0.90] $ /bin/bash -xe /tmp/hudson1486885022394342287.sh
+ hostname
hemera
+ ulimit -a
core file size (blocks, -c) 0
data seg size (kbytes, -d) unlimited
scheduling priority (-e) 0
file size (blocks, -f) unlimited
pending signals (-i) 193125
max locked memory (kbytes, -l) 64
max memory size (kbytes, -m) unlimited
open files (-n) 40000
pipe size (512 bytes, -p) 8
POSIX message queues (bytes, -q) 819200
real-time priority (-r) 0
stack size (kbytes, -s) 10240
cpu time (seconds, -t) unlimited
max user processes (-u) 193125
virtual memory (kbytes, -v) unlimited
file locks (-x) unlimited
+ jps
28725 Jps
2066 surefirebooter496180626262524471.jar
18825 surefirebooter6349514521539976099.jar
14174 surefirebooter4745974203586116286.jar
8754 surefirebooter7444888785771302972.jar
20324 Maven3Main
9724 surefirebooter4295819925728414467.jar
24286 jar
32263 surefirebooter1549448917691647749.jar
1743 surefirebooter2943390046691315229.jar
[trunk] $ /home/hudson/tools/maven/latest3/bin/mvn clean -Dmaven.test.redirectTestOutputToFile=true site assembly:assembly
[INFO] Scanning for projects...
[INFO]
[INFO] ------------------------------------------------------------------------
[INFO] Building HBase 0.90.7-SNAPSHOT
[INFO] ------------------------------------------------------------------------
[INFO]
[INFO] --- maven-clean-plugin:2.4.1:clean (default-clean) @ hbase ---
[INFO]
[INFO] --- xml-maven-plugin:1.0-beta-3:transform (default) @ hbase ---
[INFO] Transforming file: /x1/jenkins/jenkins-slave/workspace/hbase-0.90/trunk/src/main/resources/hbase-default.xml
[INFO] Transformed 1 file(s).
[INFO]
[INFO] --- docbkx-maven-plugin:2.0.11:generate-html (default) @ hbase ---
[INFO] Processing input file: upgrading.xml
[INFO] /x1/jenkins/jenkins-slave/workspace/hbase-0.90/trunk/target/site/upgrading.html has been generated.
[INFO] Processing input file: shell.xml
[INFO] /x1/jenkins/jenkins-slave/workspace/hbase-0.90/trunk/target/site/shell.html has been generated.
[INFO] Processing input file: configuration.xml
[INFO] /x1/jenkins/jenkins-slave/workspace/hbase-0.90/trunk/target/site/configuration.html has been generated.
[INFO] Processing input file: getting_started.xml
[INFO] /x1/jenkins/jenkins-slave/workspace/hbase-0.90/trunk/target/site/getting_started.html has been generated.
[INFO] Processing input file: troubleshooting.xml
[INFO] /x1/jenkins/jenkins-slave/workspace/hbase-0.90/trunk/target/site/troubleshooting.html has been generated.
[INFO] Processing input file: build.xml
[INFO] /x1/jenkins/jenkins-slave/workspace/hbase-0.90/trunk/target/site/build.html has been generated.
[INFO] Processing input file: performance.xml
[INFO] /x1/jenkins/jenkins-slave/workspace/hbase-0.90/trunk/target/site/performance.html has been generated.
[INFO] Processing input file: developer.xml
[INFO] /x1/jenkins/jenkins-slave/workspace/hbase-0.90/trunk/target/site/developer.html has been generated.
[INFO] Processing input file: book.xml
[INFO] /x1/jenkins/jenkins-slave/workspace/hbase-0.90/trunk/target/site/book.html has been generated.
[INFO] /x1/jenkins/jenkins-slave/workspace/hbase-0.90/trunk/target/site/preface.html is up to date.
[INFO]
[INFO] --- maven-site-plugin:2.0.1:site (default-site) @ hbase ---
[INFO] Unable to load parent project from a relative path: 1 problem was encountered while building the effective model
[FATAL] Non-readable POM /x1/jenkins/jenkins-slave/workspace/hbase-0.90/pom.xml: /x1/jenkins/jenkins-slave/workspace/hbase-0.90/pom.xml (No such file or directory) @
for project at /x1/jenkins/jenkins-slave/workspace/hbase-0.90/pom.xml for project at /x1/jenkins/jenkins-slave/workspace/hbase-0.90/pom.xml
[INFO] Parent project loaded from repository.
[INFO] Unable to load parent project from a relative path: 1 problem was encountered while building the effective model
[FATAL] Non-readable POM /x1/jenkins/jenkins-slave/workspace/hbase-0.90/pom.xml: /x1/jenkins/jenkins-slave/workspace/hbase-0.90/pom.xml (No such file or directory) @
for project at /x1/jenkins/jenkins-slave/workspace/hbase-0.90/pom.xml for project at /x1/jenkins/jenkins-slave/workspace/hbase-0.90/pom.xml
[INFO] Parent project loaded from repository.
Downloading: http://repository.codehaus.org/org/apache/maven/skins/maven-stylus-skin/maven-metadata.xml
Downloading: http://people.apache.org/~rawson/repo/org/apache/maven/skins/maven-stylus-skin/maven-metadata.xml
Downloading: http://download.java.net/maven/2/org/apache/maven/skins/maven-stylus-skin/maven-metadata.xml
Downloading: http://repo1.maven.org/maven2/org/apache/maven/skins/maven-stylus-skin/maven-metadata.xml
487 B
Downloaded: http://repo1.maven.org/maven2/org/apache/maven/skins/maven-stylus-skin/maven-metadata.xml (487 B at 1.3 KB/sec)
[INFO]
[INFO] ------------------------------------------------------------------------
[INFO] Building HBase 0.90.7-SNAPSHOT
[INFO] ------------------------------------------------------------------------
[INFO]
[INFO] >>> maven-assembly-plugin:2.2-beta-5:assembly (default-cli) @ hbase >>>
[INFO]
[INFO] --- maven-antrun-plugin:1.3:run (generate) @ hbase ---
[INFO] Executing tasks
[mkdir] Created dir: /x1/jenkins/jenkins-slave/workspace/hbase-0.90/trunk/target/hbase-webapps
[copy] Copying 4 files to /x1/jenkins/jenkins-slave/workspace/hbase-0.90/trunk/target/hbase-webapps
SLF4J: Failed to load class "org.slf4j.impl.StaticLoggerBinder".
SLF4J: See http://www.slf4j.org/codes.html#StaticLoggerBinder for further details.
2012-04-06 01:31:10.308:INFO::Logging to STDERR via org.mortbay.log.StdErrLog
[mkdir] Created dir: /x1/jenkins/jenkins-slave/workspace/hbase-0.90/trunk/target/hbase-webapps/master/WEB-INF
[mkdir] Created dir: /x1/jenkins/jenkins-slave/workspace/hbase-0.90/trunk/target/hbase-webapps/regionserver/WEB-INF
[INFO] Executed tasks
[INFO]
[INFO] --- build-helper-maven-plugin:1.5:add-source (add-jspc-source) @ hbase ---
[INFO] Source directory: /x1/jenkins/jenkins-slave/workspace/hbase-0.90/trunk/target/jspc added.
[INFO]
[INFO] --- build-helper-maven-plugin:1.5:add-source (add-package-info) @ hbase ---
[INFO] Source directory: /x1/jenkins/jenkins-slave/workspace/hbase-0.90/trunk/target/generated-sources added.
[INFO]
[INFO] --- maven-remote-resources-plugin:1.1:process (default) @ hbase ---
[INFO] Setting property: classpath.resource.loader.class => 'org.codehaus.plexus.velocity.ContextClassLoaderResourceLoader'.
[INFO] Setting property: velocimacro.messages.on => 'false'.
[INFO] Setting property: resource.loader => 'classpath'.
[INFO] Setting property: resource.manager.logwhenfound => 'false'.
[INFO]
[INFO] --- maven-resources-plugin:2.4:resources (default-resources) @ hbase ---
[INFO] Using 'UTF-8' encoding to copy filtered resources.
[INFO] Copying 1 resource
[INFO] Copying 6 resources
[INFO] Copying 3 resources
[INFO]
[INFO] --- maven-antrun-plugin:1.3:run (default) @ hbase ---
[INFO] Executing tasks
[INFO] Executed tasks
[INFO]
[INFO] --- maven-compiler-plugin:2.0.2:compile (default-compile) @ hbase ---
[INFO] Compiling 468 source files to /x1/jenkins/jenkins-slave/workspace/hbase-0.90/trunk/target/classes
[INFO]
[INFO] --- maven-resources-plugin:2.4:testResources (default-testResources) @ hbase ---
[INFO] Using 'UTF-8' encoding to copy filtered resources.
[INFO] Copying 4 resources
[INFO] Copying 3 resources
[INFO]
[INFO] --- maven-compiler-plugin:2.0.2:testCompile (default-testCompile) @ hbase ---
[INFO] Compiling 204 source files to /x1/jenkins/jenkins-slave/workspace/hbase-0.90/trunk/target/test-classes
[INFO]
[INFO] --- maven-surefire-plugin:2.4.3:test (default-test) @ hbase ---
[INFO] Surefire report directory: /x1/jenkins/jenkins-slave/workspace/hbase-0.90/trunk/target/surefire-reports
-------------------------------------------------------
T E S T S
-------------------------------------------------------
Running org.apache.hadoop.hbase.master.TestHMasterRPCException
Tests run: 1, Failures: 0, Errors: 0, Skipped: 0, Time elapsed: 0.231 sec
Running org.apache.hadoop.hbase.regionserver.TestColumnSeeking
Tests run: 2, Failures: 0, Errors: 0, Skipped: 0, Time elapsed: 2.976 sec
Running org.apache.hadoop.hbase.client.TestMultipleTimestamps
Tests run: 8, Failures: 0, Errors: 0, Skipped: 0, Time elapsed: 67.703 sec
Running org.apache.hadoop.hbase.regionserver.TestMemStoreLAB
Tests run: 3, Failures: 0, Errors: 0, Skipped: 0, Time elapsed: 1.01 sec
Running org.apache.hadoop.hbase.TestZooKeeper
Tests run: 5, Failures: 0, Errors: 0, Skipped: 0, Time elapsed: 54.663 sec
Running org.apache.hadoop.hbase.regionserver.wal.TestLogRolling
killed.
[INFO] ------------------------------------------------------------------------
[INFO] BUILD FAILURE
[INFO] ------------------------------------------------------------------------
[INFO] Total time: 17:41.305s
[INFO] Finished at: Fri Apr 06 01:48:39 UTC 2012
[INFO] Final Memory: 51M/1028M
[INFO] ------------------------------------------------------------------------
[ERROR] Failed to execute goal org.apache.maven.plugins:maven-surefire-plugin:2.4.3:test (default-test) on project hbase: Error while executing forked tests.; nested exception is org.apache.maven.surefire.booter.shade.org.codehaus.plexus.util.cli.CommandLineException: Error while executing external command, process killed. Process timeout out after 900 seconds -> [Help 1]
[ERROR]
[ERROR] To see the full stack trace of the errors, re-run Maven with the -e switch.
[ERROR] Re-run Maven using the -X switch to enable full debug logging.
[ERROR]
[ERROR] For more information about the errors and possible solutions, please read the following articles:
[ERROR] [Help 1] http://cwiki.apache.org/confluence/display/MAVEN/MojoExecutionException
Build step 'Invoke top-level Maven targets' marked build as failure
[locks-and-latches] Releasing all the locks
[locks-and-latches] All the locks released
Archiving artifacts
Recording test results
Build failed in Jenkins: hbase-0.90 #460
Posted by Apache Jenkins Server <je...@builds.apache.org>.
See <https://builds.apache.org/job/hbase-0.90/460/changes>
Changes:
[stack] HBASE-5724 Row cache of KeyValue should be cleared in readFields() -- ADDENDUM.. MISSING IMPORT
------------------------------------------
[...truncated 1154 lines...]
Running org.apache.hadoop.hbase.regionserver.wal.TestHLogSplit
Tests run: 24, Failures: 0, Errors: 0, Skipped: 0, Time elapsed: 211.557 sec
Running org.apache.hadoop.hbase.thrift.TestThriftServer
Tests run: 1, Failures: 0, Errors: 0, Skipped: 0, Time elapsed: 36.201 sec
Running org.apache.hadoop.hbase.regionserver.TestRpcMetrics
Tests run: 1, Failures: 0, Errors: 0, Skipped: 0, Time elapsed: 1.187 sec
Running org.apache.hadoop.hbase.filter.TestColumnPrefixFilter
Tests run: 2, Failures: 0, Errors: 0, Skipped: 0, Time elapsed: 1.777 sec
Running org.apache.hadoop.hbase.master.TestZKBasedOpenCloseRegion
Tests run: 3, Failures: 0, Errors: 0, Skipped: 0, Time elapsed: 37.845 sec
Running org.apache.hadoop.hbase.TestCompare
Tests run: 1, Failures: 0, Errors: 0, Skipped: 0, Time elapsed: 0.016 sec
Running org.apache.hadoop.hbase.regionserver.TestExplicitColumnTracker
Tests run: 4, Failures: 0, Errors: 0, Skipped: 0, Time elapsed: 0.383 sec
Running org.apache.hadoop.hbase.util.hbck.TestOfflineMetaRebuildHole
Tests run: 1, Failures: 0, Errors: 0, Skipped: 0, Time elapsed: 32.197 sec
Running org.apache.hadoop.hbase.util.TestEnvironmentEdgeManager
Tests run: 2, Failures: 0, Errors: 0, Skipped: 0, Time elapsed: 0.151 sec
Running org.apache.hadoop.hbase.io.TestHalfStoreFileReader
Tests run: 1, Failures: 0, Errors: 0, Skipped: 0, Time elapsed: 0.183 sec
Running org.apache.hadoop.hbase.util.TestDefaultEnvironmentEdge
Tests run: 1, Failures: 0, Errors: 0, Skipped: 0, Time elapsed: 0.018 sec
Running org.apache.hadoop.hbase.util.TestFSUtils
Tests run: 1, Failures: 0, Errors: 0, Skipped: 0, Time elapsed: 3.542 sec
Running org.apache.hadoop.hbase.security.TestUser
Tests run: 3, Failures: 0, Errors: 0, Skipped: 0, Time elapsed: 0.055 sec
Running org.apache.hadoop.hbase.master.TestMasterTransitions
Tests run: 3, Failures: 0, Errors: 0, Skipped: 3, Time elapsed: 21.605 sec
Running org.apache.hadoop.hbase.regionserver.TestScanWildcardColumnTracker
Tests run: 2, Failures: 0, Errors: 0, Skipped: 0, Time elapsed: 0.058 sec
Running org.apache.hadoop.hbase.util.hbck.TestOfflineMetaRebuildOverlap
Tests run: 1, Failures: 0, Errors: 0, Skipped: 0, Time elapsed: 39.549 sec
Running org.apache.hadoop.hbase.regionserver.TestKeyValueSkipListSet
Tests run: 4, Failures: 0, Errors: 0, Skipped: 0, Time elapsed: 0.02 sec
Running org.apache.hadoop.hbase.filter.TestPageFilter
Tests run: 2, Failures: 0, Errors: 0, Skipped: 0, Time elapsed: 0.016 sec
Running org.apache.hadoop.hbase.io.hfile.TestSeekTo
Tests run: 3, Failures: 0, Errors: 0, Skipped: 0, Time elapsed: 0.117 sec
Running org.apache.hadoop.hbase.filter.TestColumnPaginationFilter
Tests run: 1, Failures: 0, Errors: 0, Skipped: 0, Time elapsed: 0.016 sec
Running org.apache.hadoop.hbase.rest.TestStatusResource
Tests run: 2, Failures: 0, Errors: 0, Skipped: 0, Time elapsed: 18.684 sec
Running org.apache.hadoop.hbase.executor.TestExecutorService
Tests run: 1, Failures: 0, Errors: 0, Skipped: 0, Time elapsed: 2.177 sec
Running org.apache.hadoop.hbase.client.TestFromClientSide
Tests run: 43, Failures: 0, Errors: 0, Skipped: 3, Time elapsed: 146.504 sec
Running org.apache.hadoop.hbase.replication.TestReplication
Tests run: 7, Failures: 0, Errors: 0, Skipped: 0, Time elapsed: 159.805 sec
Running org.apache.hadoop.hbase.util.hbck.TestOfflineMetaRebuildBase
Tests run: 1, Failures: 0, Errors: 0, Skipped: 0, Time elapsed: 32.624 sec
Running org.apache.hadoop.hbase.regionserver.TestCompaction
Tests run: 9, Failures: 0, Errors: 0, Skipped: 0, Time elapsed: 121.51 sec
Running org.apache.hadoop.hbase.filter.TestSingleColumnValueFilter
Tests run: 2, Failures: 0, Errors: 0, Skipped: 0, Time elapsed: 0.036 sec
Running org.apache.hadoop.hbase.mapreduce.TestTimeRangeMapRed
Tests run: 1, Failures: 0, Errors: 0, Skipped: 0, Time elapsed: 82.829 sec
Running org.apache.hadoop.hbase.zookeeper.TestZooKeeperMainServerArg
Tests run: 1, Failures: 0, Errors: 0, Skipped: 0, Time elapsed: 0.025 sec
Running org.apache.hadoop.hbase.mapreduce.TestSimpleTotalOrderPartitioner
Tests run: 1, Failures: 0, Errors: 0, Skipped: 0, Time elapsed: 0.066 sec
Running org.apache.hadoop.hbase.master.TestClockSkewDetection
Tests run: 1, Failures: 0, Errors: 0, Skipped: 0, Time elapsed: 0.084 sec
Running org.apache.hadoop.hbase.mapred.TestTableInputFormat
Tests run: 6, Failures: 0, Errors: 0, Skipped: 0, Time elapsed: 21.494 sec
Running org.apache.hadoop.hbase.mapreduce.TestHFileOutputFormat
Tests run: 6, Failures: 0, Errors: 0, Skipped: 0, Time elapsed: 123.105 sec
Running org.apache.hadoop.hbase.master.TestMasterRestartAfterDisablingTable
Tests run: 1, Failures: 0, Errors: 0, Skipped: 0, Time elapsed: 19.703 sec
Running org.apache.hadoop.hbase.regionserver.TestFSErrorsExposed
Tests run: 3, Failures: 0, Errors: 0, Skipped: 0, Time elapsed: 29.433 sec
Running org.apache.hadoop.hbase.client.replication.TestReplicationAdmin
Tests run: 1, Failures: 0, Errors: 0, Skipped: 0, Time elapsed: 0.421 sec
Running org.apache.hadoop.hbase.regionserver.TestScanDeleteTracker
Tests run: 6, Failures: 0, Errors: 0, Skipped: 0, Time elapsed: 0.085 sec
Running org.apache.hadoop.hbase.client.TestMetaScanner
Tests run: 1, Failures: 0, Errors: 0, Skipped: 0, Time elapsed: 16.11 sec
Running org.apache.hadoop.hbase.metrics.TestMetricsMBeanBase
Tests run: 2, Failures: 0, Errors: 0, Skipped: 0, Time elapsed: 0.034 sec
Running org.apache.hadoop.hbase.TestRegionRebalancing
Tests run: 1, Failures: 0, Errors: 0, Skipped: 0, Time elapsed: 69.666 sec
Running org.apache.hadoop.hbase.master.TestMasterShutdown
Tests run: 1, Failures: 0, Errors: 0, Skipped: 0, Time elapsed: 17.83 sec
Running org.apache.hadoop.hbase.filter.TestSingleColumnValueExcludeFilter
Tests run: 1, Failures: 0, Errors: 0, Skipped: 0, Time elapsed: 0.016 sec
Running org.apache.hadoop.hbase.filter.TestInclusiveStopFilter
Tests run: 2, Failures: 0, Errors: 0, Skipped: 0, Time elapsed: 0.017 sec
Running org.apache.hadoop.hbase.rest.TestTableResource
Tests run: 8, Failures: 0, Errors: 0, Skipped: 0, Time elapsed: 56.197 sec
Running org.apache.hadoop.hbase.mapreduce.TestTableSplit
Tests run: 1, Failures: 0, Errors: 0, Skipped: 0, Time elapsed: 0.017 sec
Running org.apache.hadoop.hbase.TestHBaseTestingUtility
Tests run: 5, Failures: 0, Errors: 0, Skipped: 0, Time elapsed: 57.202 sec
Running org.apache.hadoop.hbase.mapreduce.TestLoadIncrementalHFiles
Tests run: 5, Failures: 0, Errors: 0, Skipped: 0, Time elapsed: 70.529 sec
Running org.apache.hadoop.hbase.regionserver.wal.TestWALReplay
Tests run: 4, Failures: 0, Errors: 0, Skipped: 0, Time elapsed: 26.812 sec
Running org.apache.hadoop.hbase.rest.TestSchemaResource
Tests run: 2, Failures: 0, Errors: 0, Skipped: 0, Time elapsed: 60.045 sec
Running org.apache.hadoop.hbase.regionserver.TestKeyValueScanFixture
Tests run: 1, Failures: 0, Errors: 0, Skipped: 0, Time elapsed: 0.016 sec
Running org.apache.hadoop.hbase.rest.model.TestTableListModel
Tests run: 3, Failures: 0, Errors: 0, Skipped: 0, Time elapsed: 0.128 sec
Running org.apache.hadoop.hbase.rest.model.TestColumnSchemaModel
Tests run: 2, Failures: 0, Errors: 0, Skipped: 0, Time elapsed: 0.03 sec
Running org.apache.hadoop.hbase.regionserver.TestStoreFile
Tests run: 7, Failures: 0, Errors: 0, Skipped: 0, Time elapsed: 74.41 sec
Running org.apache.hadoop.hbase.zookeeper.TestZooKeeperNodeTracker
Tests run: 2, Failures: 0, Errors: 0, Skipped: 0, Time elapsed: 0.486 sec
Running org.apache.hadoop.hbase.regionserver.wal.TestHLogMethods
Tests run: 3, Failures: 0, Errors: 0, Skipped: 0, Time elapsed: 0.285 sec
Running org.apache.hadoop.hbase.rest.model.TestScannerModel
Tests run: 3, Failures: 0, Errors: 0, Skipped: 0, Time elapsed: 0.127 sec
Running org.apache.hadoop.hbase.regionserver.TestHRegionServerBulkLoad
Tests run: 1, Failures: 0, Errors: 0, Skipped: 0, Time elapsed: 89.366 sec
Running org.apache.hadoop.hbase.rest.TestVersionResource
Tests run: 7, Failures: 0, Errors: 0, Skipped: 0, Time elapsed: 18.303 sec
Running org.apache.hadoop.hbase.filter.TestFilter
Tests run: 18, Failures: 0, Errors: 0, Skipped: 0, Time elapsed: 1.404 sec
Running org.apache.hadoop.hbase.regionserver.TestWideScanner
Tests run: 1, Failures: 0, Errors: 0, Skipped: 0, Time elapsed: 16.068 sec
Running org.apache.hadoop.hbase.regionserver.TestSplitTransaction
Tests run: 6, Failures: 0, Errors: 0, Skipped: 0, Time elapsed: 2.661 sec
Running org.apache.hadoop.hbase.replication.regionserver.TestReplicationSink
Tests run: 5, Failures: 0, Errors: 0, Skipped: 0, Time elapsed: 26.162 sec
Running org.apache.hadoop.hbase.regionserver.TestGetClosestAtOrBefore
Tests run: 3, Failures: 0, Errors: 0, Skipped: 0, Time elapsed: 11.165 sec
Running org.apache.hadoop.hbase.regionserver.TestReadWriteConsistencyControl
Tests run: 1, Failures: 0, Errors: 0, Skipped: 0, Time elapsed: 10.027 sec
Running org.apache.hadoop.hbase.util.TestMergeTable
Tests run: 1, Failures: 0, Errors: 0, Skipped: 0, Time elapsed: 54.755 sec
Running org.apache.hadoop.hbase.rest.model.TestVersionModel
Tests run: 3, Failures: 0, Errors: 0, Skipped: 0, Time elapsed: 0.128 sec
Running org.apache.hadoop.hbase.rest.model.TestCellSetModel
Tests run: 3, Failures: 0, Errors: 0, Skipped: 0, Time elapsed: 0.135 sec
Running org.apache.hadoop.hbase.rest.client.TestRemoteTable
Tests run: 3, Failures: 0, Errors: 0, Skipped: 0, Time elapsed: 21.59 sec
Running org.apache.hadoop.hbase.rest.model.TestStorageClusterStatusModel
Tests run: 3, Failures: 0, Errors: 0, Skipped: 0, Time elapsed: 0.134 sec
Running org.apache.hadoop.hbase.avro.TestAvroServer
Tests run: 3, Failures: 0, Errors: 0, Skipped: 0, Time elapsed: 33.772 sec
Running org.apache.hadoop.hbase.TestFullLogReconstruction
Tests run: 1, Failures: 0, Errors: 0, Skipped: 0, Time elapsed: 57.489 sec
Running org.apache.hadoop.hbase.TestSerialization
Tests run: 19, Failures: 0, Errors: 0, Skipped: 0, Time elapsed: 0.06 sec
Running org.apache.hadoop.hbase.regionserver.TestKeyValueHeap
Tests run: 3, Failures: 0, Errors: 0, Skipped: 0, Time elapsed: 0.075 sec
Running org.apache.hadoop.hbase.regionserver.TestStoreScanner
Tests run: 14, Failures: 0, Errors: 0, Skipped: 0, Time elapsed: 0.034 sec
Running org.apache.hadoop.hbase.TestHMsg
Tests run: 2, Failures: 0, Errors: 0, Skipped: 0, Time elapsed: 0.022 sec
Running org.apache.hadoop.hbase.io.hfile.TestReseekTo
Tests run: 1, Failures: 0, Errors: 0, Skipped: 0, Time elapsed: 0.171 sec
Running org.apache.hadoop.hbase.mapreduce.TestLoadIncrementalHFilesSplitRecovery
Tests run: 4, Failures: 0, Errors: 0, Skipped: 0, Time elapsed: 33.363 sec
Running org.apache.hadoop.hbase.regionserver.TestHRegionInfo
Tests run: 3, Failures: 0, Errors: 0, Skipped: 0, Time elapsed: 0.019 sec
Running org.apache.hadoop.hbase.util.TestIncrementingEnvironmentEdge
Tests run: 1, Failures: 0, Errors: 0, Skipped: 0, Time elapsed: 0.016 sec
Running org.apache.hadoop.hbase.util.TestKeying
Tests run: 1, Failures: 0, Errors: 0, Skipped: 0, Time elapsed: 0.016 sec
Running org.apache.hadoop.hbase.regionserver.TestScanner
Tests run: 6, Failures: 0, Errors: 0, Skipped: 0, Time elapsed: 61.858 sec
Running org.apache.hadoop.hbase.util.TestHBaseFsck
Tests run: 13, Failures: 0, Errors: 0, Skipped: 0, Time elapsed: 173.065 sec
Running org.apache.hadoop.hbase.master.TestRestartCluster
Tests run: 2, Failures: 0, Errors: 0, Skipped: 0, Time elapsed: 49.493 sec
Running org.apache.hadoop.hbase.client.TestShell
Tests run: 1, Failures: 0, Errors: 0, Skipped: 0, Time elapsed: 43.26 sec
Running org.apache.hadoop.hbase.rest.model.TestTableInfoModel
Tests run: 3, Failures: 0, Errors: 0, Skipped: 0, Time elapsed: 0.13 sec
Running org.apache.hadoop.hbase.TestInfoServers
Tests run: 1, Failures: 0, Errors: 0, Skipped: 0, Time elapsed: 15.396 sec
Running org.apache.hadoop.hbase.master.TestLogsCleaner
Tests run: 1, Failures: 0, Errors: 0, Skipped: 0, Time elapsed: 1.43 sec
Running org.apache.hadoop.hbase.regionserver.TestMasterAddressManager
Tests run: 1, Failures: 0, Errors: 0, Skipped: 0, Time elapsed: 0.437 sec
Running org.apache.hadoop.hbase.catalog.TestCatalogTrackerOnCluster
Tests run: 1, Failures: 0, Errors: 0, Skipped: 0, Time elapsed: 205.98 sec
Running org.apache.hadoop.hbase.regionserver.TestQueryMatcher
Tests run: 4, Failures: 0, Errors: 0, Skipped: 0, Time elapsed: 0.078 sec
Running org.apache.hadoop.hbase.zookeeper.TestZKTable
Tests run: 1, Failures: 0, Errors: 0, Skipped: 0, Time elapsed: 0.291 sec
Running org.apache.hadoop.hbase.client.TestAdmin
Tests run: 24, Failures: 0, Errors: 0, Skipped: 0, Time elapsed: 352.934 sec
Running org.apache.hadoop.hbase.regionserver.TestPriorityCompactionQueue
Tests run: 1, Failures: 0, Errors: 0, Skipped: 0, Time elapsed: 1.072 sec
Running org.apache.hadoop.hbase.util.TestMergeTool
Tests run: 1, Failures: 0, Errors: 0, Skipped: 0, Time elapsed: 28.58 sec
Running org.apache.hadoop.hbase.TestAcidGuarantees
Tests run: 3, Failures: 0, Errors: 0, Skipped: 3, Time elapsed: 0.015 sec
Running org.apache.hadoop.hbase.util.TestBase64
Tests run: 1, Failures: 0, Errors: 0, Skipped: 0, Time elapsed: 0.018 sec
Running org.apache.hadoop.hbase.regionserver.TestMemStore
Tests run: 21, Failures: 0, Errors: 0, Skipped: 0, Time elapsed: 59.36 sec
Running org.apache.hadoop.hbase.rest.TestScannerResource
Tests run: 5, Failures: 0, Errors: 0, Skipped: 0, Time elapsed: 45.229 sec
Running org.apache.hadoop.hbase.io.hfile.TestLruBlockCache
Tests run: 7, Failures: 0, Errors: 0, Skipped: 0, Time elapsed: 1.052 sec
Running org.apache.hadoop.hbase.master.TestDeadServer
Tests run: 1, Failures: 0, Errors: 0, Skipped: 0, Time elapsed: 0.019 sec
Running org.apache.hadoop.hbase.rest.TestGzipFilter
Tests run: 3, Failures: 0, Errors: 0, Skipped: 0, Time elapsed: 19.688 sec
Running org.apache.hadoop.hbase.mapreduce.TestTableMapReduce
Tests run: 2, Failures: 0, Errors: 0, Skipped: 0, Time elapsed: 81.017 sec
Running org.apache.hadoop.hbase.TestKeyValue
Tests run: 13, Failures: 0, Errors: 0, Skipped: 0, Time elapsed: 0.028 sec
Running org.apache.hadoop.hbase.client.TestMultiParallel
Tests run: 10, Failures: 0, Errors: 0, Skipped: 0, Time elapsed: 34.475 sec
Running org.apache.hadoop.hbase.master.TestMaster
Tests run: 1, Failures: 0, Errors: 0, Skipped: 0, Time elapsed: 76.489 sec
Running org.apache.hadoop.hbase.master.TestRollingRestart
Tests run: 1, Failures: 0, Errors: 0, Skipped: 0, Time elapsed: 80.832 sec
Running org.apache.hadoop.hbase.client.TestResult
Tests run: 3, Failures: 0, Errors: 0, Skipped: 0, Time elapsed: 0.039 sec
Running org.apache.hadoop.hbase.client.TestHTablePool
Tests run: 5, Failures: 0, Errors: 0, Skipped: 0, Time elapsed: 22.075 sec
Running org.apache.hadoop.hbase.master.TestOpenedRegionHandler
Tests run: 2, Failures: 0, Errors: 0, Skipped: 0, Time elapsed: 20.55 sec
Running org.apache.hadoop.hbase.rest.model.TestTableSchemaModel
Tests run: 3, Failures: 0, Errors: 0, Skipped: 0, Time elapsed: 0.139 sec
Running org.apache.hadoop.hbase.util.TestByteBloomFilter
Tests run: 3, Failures: 0, Errors: 0, Skipped: 0, Time elapsed: 1.573 sec
Running org.apache.hadoop.hbase.filter.TestFilterList
Tests run: 4, Failures: 0, Errors: 0, Skipped: 0, Time elapsed: 0.042 sec
Running org.apache.hadoop.hbase.mapreduce.TestTableInputFormatScan
Tests run: 11, Failures: 0, Errors: 0, Skipped: 0, Time elapsed: 330.489 sec
Running org.apache.hadoop.hbase.regionserver.TestHRegion
Tests run: 54, Failures: 0, Errors: 0, Skipped: 0, Time elapsed: 20.741 sec
Running org.apache.hadoop.hbase.master.TestMasterFailover
killed.
[INFO] ------------------------------------------------------------------------
[INFO] BUILD FAILURE
[INFO] ------------------------------------------------------------------------
[INFO] Total time: 1:37:46.883s
[INFO] Finished at: Fri Apr 06 00:40:35 UTC 2012
[INFO] Final Memory: 35M/368M
[INFO] ------------------------------------------------------------------------
[ERROR] Failed to execute goal org.apache.maven.plugins:maven-surefire-plugin:2.4.3:test (default-test) on project hbase: Error while executing forked tests.; nested exception is org.apache.maven.surefire.booter.shade.org.codehaus.plexus.util.cli.CommandLineException: Error while executing external command, process killed. Process timeout out after 900 seconds -> [Help 1]
[ERROR]
[ERROR] To see the full stack trace of the errors, re-run Maven with the -e switch.
[ERROR] Re-run Maven using the -X switch to enable full debug logging.
[ERROR]
[ERROR] For more information about the errors and possible solutions, please read the following articles:
[ERROR] [Help 1] http://cwiki.apache.org/confluence/display/MAVEN/MojoExecutionException
Build step 'Invoke top-level Maven targets' marked build as failure
[locks-and-latches] Releasing all the locks
[locks-and-latches] All the locks released
Archiving artifacts
Recording test results
Build failed in Jenkins: hbase-0.90 #459
Posted by Apache Jenkins Server <je...@builds.apache.org>.
See <https://builds.apache.org/job/hbase-0.90/459/changes>
Changes:
[stack] HBASE-5724 Row cache of KeyValue should be cleared in readFields()
------------------------------------------
[...truncated 884 lines...]
A src/main/resources/org/apache/hadoop/hbase/rest/protobuf/TableSchemaMessage.proto
A src/main/resources/org/apache/hadoop/hbase/rest/protobuf/ScannerMessage.proto
A src/main/resources/org/apache/hadoop/hbase/rest/protobuf/StorageClusterStatusMessage.proto
A src/main/resources/org/apache/hadoop/hbase/rest/protobuf/CellSetMessage.proto
A src/main/resources/org/apache/hadoop/hbase/rest/protobuf/ColumnSchemaMessage.proto
A src/main/resources/org/apache/hadoop/hbase/rest/protobuf/CellMessage.proto
A src/main/resources/org/apache/hadoop/hbase/rest/protobuf/TableInfoMessage.proto
A src/main/resources/org/apache/hadoop/hbase/rest/protobuf/TableListMessage.proto
A src/main/resources/org/apache/hadoop/hbase/rest/protobuf/VersionMessage.proto
A src/main/resources/org/apache/hadoop/hbase/rest/XMLSchema.xsd
A src/main/xslt
A src/main/xslt/configuration_to_docbook_section.xsl
A src/site
A src/site/site.xml
A src/site/site.vm
A src/site/resources
A src/site/resources/images
AU src/site/resources/images/replication_overview.png
AU src/site/resources/images/asf_logo_wide.png
AU src/site/resources/images/architecture.gif
AU src/site/resources/images/hadoop-logo.jpg
AU src/site/resources/images/hbase_logo_med.gif
AU src/site/resources/images/favicon.ico
AU src/site/resources/images/hbase_small.gif
A src/site/resources/css
A src/site/resources/css/freebsd_docbook.css
A src/site/resources/css/site.css
A src/site/xdoc
A src/site/xdoc/cygwin.xml
A src/site/xdoc/acid-semantics.xml
A src/site/xdoc/metrics.xml
A src/site/xdoc/index.xml
A src/site/xdoc/replication.xml
A src/site/xdoc/old_news.xml
A src/site/xdoc/bulk-loads.xml
A src/site/xdoc/pseudo-distributed.xml
A src/docbkx
A src/docbkx/upgrading.xml
A src/docbkx/performance.xml
A src/docbkx/developer.xml
A src/docbkx/preface.xml
A src/docbkx/configuration.xml
A src/docbkx/getting_started.xml
A src/docbkx/shell.xml
A src/docbkx/troubleshooting.xml
A src/docbkx/book.xml
A src/docbkx/build.xml
AU src/saveVersion.sh
A src/examples
A src/examples/thrift
A src/examples/thrift/DemoClient.java
A src/examples/thrift/DemoClient.cpp
A src/examples/thrift/DemoClient.rb
A src/examples/thrift/DemoClient.php
AU src/examples/thrift/DemoClient.py
A src/examples/thrift/README.txt
A src/examples/thrift/Makefile
A src/examples/mapreduce
A src/examples/mapreduce/org
A src/examples/mapreduce/org/apache
A src/examples/mapreduce/org/apache/hadoop
A src/examples/mapreduce/org/apache/hadoop/hbase
A src/examples/mapreduce/org/apache/hadoop/hbase/mapreduce
A src/examples/mapreduce/org/apache/hadoop/hbase/mapreduce/SampleUploader.java
A src/examples/mapreduce/org/apache/hadoop/hbase/mapreduce/IndexBuilder.java
A src/examples/mapreduce/index-builder-setup.rb
A src/examples/README.txt
A bin
AU bin/hbase-daemons.sh
A bin/rename_table.rb
AU bin/hbase
A bin/copy_table.rb
A bin/check_meta.rb
AU bin/start-hbase.sh
A bin/hirb.rb
A bin/set_meta_block_caching.rb
A bin/loadtable.rb
AU bin/hbase-daemon.sh
A bin/region_mover.rb
A bin/hbase-config.sh
A bin/local-regionservers.sh
AU bin/zookeepers.sh
A bin/local-master-backup.sh
A bin/add_table.rb
AU bin/rolling-restart.sh
AU bin/regionservers.sh
A bin/graceful_stop.sh
AU bin/master-backup.sh
A bin/set_meta_memstore_size.rb
A bin/replication
A bin/replication/copy_tables_desc.rb
AU bin/stop-hbase.sh
A pom.xml
A README.txt
U .
At revision 1310080
[locks-and-latches] Checking to see if we really have the locks
[locks-and-latches] Have all the locks, build can start
[hbase-0.90] $ /bin/bash -xe /tmp/hudson1470979520795661902.sh
+ hostname
hemera
+ ulimit -a
core file size (blocks, -c) 0
data seg size (kbytes, -d) unlimited
scheduling priority (-e) 0
file size (blocks, -f) unlimited
pending signals (-i) 193125
max locked memory (kbytes, -l) 64
max memory size (kbytes, -m) unlimited
open files (-n) 40000
pipe size (512 bytes, -p) 8
POSIX message queues (bytes, -q) 819200
real-time priority (-r) 0
stack size (kbytes, -s) 10240
cpu time (seconds, -t) unlimited
max user processes (-u) 193125
virtual memory (kbytes, -v) unlimited
file locks (-x) unlimited
+ jps
2066 surefirebooter496180626262524471.jar
25094 Maven3Main
26626 surefirebooter4032410574942031711.jar
18825 surefirebooter6349514521539976099.jar
14174 surefirebooter4745974203586116286.jar
8754 surefirebooter7444888785771302972.jar
26659 Jps
24286 jar
32263 surefirebooter1549448917691647749.jar
25103 surefirebooter2130638401901254871.jar
1743 surefirebooter2943390046691315229.jar
26465 surefirebooter8377464702347929808.jar
[trunk] $ /home/hudson/tools/maven/latest3/bin/mvn clean -Dmaven.test.redirectTestOutputToFile=true site assembly:assembly
[INFO] Scanning for projects...
[INFO]
[INFO] ------------------------------------------------------------------------
[INFO] Building HBase 0.90.7-SNAPSHOT
[INFO] ------------------------------------------------------------------------
[INFO]
[INFO] --- maven-clean-plugin:2.4.1:clean (default-clean) @ hbase ---
[INFO]
[INFO] --- xml-maven-plugin:1.0-beta-3:transform (default) @ hbase ---
[INFO] Transforming file: /x1/jenkins/jenkins-slave/workspace/hbase-0.90/trunk/src/main/resources/hbase-default.xml
[INFO] Transformed 1 file(s).
[INFO]
[INFO] --- docbkx-maven-plugin:2.0.11:generate-html (default) @ hbase ---
[INFO] Processing input file: upgrading.xml
[INFO] /x1/jenkins/jenkins-slave/workspace/hbase-0.90/trunk/target/site/upgrading.html has been generated.
[INFO] Processing input file: shell.xml
[INFO] /x1/jenkins/jenkins-slave/workspace/hbase-0.90/trunk/target/site/shell.html has been generated.
[INFO] Processing input file: configuration.xml
[INFO] /x1/jenkins/jenkins-slave/workspace/hbase-0.90/trunk/target/site/configuration.html has been generated.
[INFO] Processing input file: getting_started.xml
[INFO] /x1/jenkins/jenkins-slave/workspace/hbase-0.90/trunk/target/site/getting_started.html has been generated.
[INFO] Processing input file: troubleshooting.xml
[INFO] /x1/jenkins/jenkins-slave/workspace/hbase-0.90/trunk/target/site/troubleshooting.html has been generated.
[INFO] Processing input file: build.xml
[INFO] /x1/jenkins/jenkins-slave/workspace/hbase-0.90/trunk/target/site/build.html has been generated.
[INFO] Processing input file: performance.xml
[INFO] /x1/jenkins/jenkins-slave/workspace/hbase-0.90/trunk/target/site/performance.html has been generated.
[INFO] Processing input file: developer.xml
[INFO] /x1/jenkins/jenkins-slave/workspace/hbase-0.90/trunk/target/site/developer.html has been generated.
[INFO] Processing input file: book.xml
[INFO] /x1/jenkins/jenkins-slave/workspace/hbase-0.90/trunk/target/site/book.html has been generated.
[INFO] /x1/jenkins/jenkins-slave/workspace/hbase-0.90/trunk/target/site/preface.html is up to date.
[INFO]
[INFO] --- maven-site-plugin:2.0.1:site (default-site) @ hbase ---
[INFO] Unable to load parent project from a relative path: 1 problem was encountered while building the effective model
[FATAL] Non-readable POM /x1/jenkins/jenkins-slave/workspace/hbase-0.90/pom.xml: /x1/jenkins/jenkins-slave/workspace/hbase-0.90/pom.xml (No such file or directory) @
for project at /x1/jenkins/jenkins-slave/workspace/hbase-0.90/pom.xml for project at /x1/jenkins/jenkins-slave/workspace/hbase-0.90/pom.xml
[INFO] Parent project loaded from repository.
[INFO] Unable to load parent project from a relative path: 1 problem was encountered while building the effective model
[FATAL] Non-readable POM /x1/jenkins/jenkins-slave/workspace/hbase-0.90/pom.xml: /x1/jenkins/jenkins-slave/workspace/hbase-0.90/pom.xml (No such file or directory) @
for project at /x1/jenkins/jenkins-slave/workspace/hbase-0.90/pom.xml for project at /x1/jenkins/jenkins-slave/workspace/hbase-0.90/pom.xml
[INFO] Parent project loaded from repository.
Downloading: http://people.apache.org/~rawson/repo/org/apache/maven/skins/maven-stylus-skin/maven-metadata.xml
[INFO]
[INFO] ------------------------------------------------------------------------
[INFO] Building HBase 0.90.7-SNAPSHOT
[INFO] ------------------------------------------------------------------------
[INFO]
[INFO] >>> maven-assembly-plugin:2.2-beta-5:assembly (default-cli) @ hbase >>>
[INFO]
[INFO] --- maven-antrun-plugin:1.3:run (generate) @ hbase ---
[INFO] Executing tasks
[mkdir] Created dir: /x1/jenkins/jenkins-slave/workspace/hbase-0.90/trunk/target/hbase-webapps
[copy] Copying 4 files to /x1/jenkins/jenkins-slave/workspace/hbase-0.90/trunk/target/hbase-webapps
SLF4J: Failed to load class "org.slf4j.impl.StaticLoggerBinder".
SLF4J: See http://www.slf4j.org/codes.html#StaticLoggerBinder for further details.
2012-04-05 21:38:28.640:INFO::Logging to STDERR via org.mortbay.log.StdErrLog
[mkdir] Created dir: /x1/jenkins/jenkins-slave/workspace/hbase-0.90/trunk/target/hbase-webapps/master/WEB-INF
[mkdir] Created dir: /x1/jenkins/jenkins-slave/workspace/hbase-0.90/trunk/target/hbase-webapps/regionserver/WEB-INF
[INFO] Executed tasks
[INFO]
[INFO] --- build-helper-maven-plugin:1.5:add-source (add-jspc-source) @ hbase ---
[INFO] Source directory: /x1/jenkins/jenkins-slave/workspace/hbase-0.90/trunk/target/jspc added.
[INFO]
[INFO] --- build-helper-maven-plugin:1.5:add-source (add-package-info) @ hbase ---
[INFO] Source directory: /x1/jenkins/jenkins-slave/workspace/hbase-0.90/trunk/target/generated-sources added.
[INFO]
[INFO] --- maven-remote-resources-plugin:1.1:process (default) @ hbase ---
[INFO] Setting property: classpath.resource.loader.class => 'org.codehaus.plexus.velocity.ContextClassLoaderResourceLoader'.
[INFO] Setting property: velocimacro.messages.on => 'false'.
[INFO] Setting property: resource.loader => 'classpath'.
[INFO] Setting property: resource.manager.logwhenfound => 'false'.
[INFO]
[INFO] --- maven-resources-plugin:2.4:resources (default-resources) @ hbase ---
[INFO] Using 'UTF-8' encoding to copy filtered resources.
[INFO] Copying 1 resource
[INFO] Copying 6 resources
[INFO] Copying 3 resources
[INFO]
[INFO] --- maven-antrun-plugin:1.3:run (default) @ hbase ---
[INFO] Executing tasks
[INFO] Executed tasks
[INFO]
[INFO] --- maven-compiler-plugin:2.0.2:compile (default-compile) @ hbase ---
[INFO] Compiling 468 source files to /x1/jenkins/jenkins-slave/workspace/hbase-0.90/trunk/target/classes
[INFO]
[INFO] --- maven-resources-plugin:2.4:testResources (default-testResources) @ hbase ---
[INFO] Using 'UTF-8' encoding to copy filtered resources.
[INFO] Copying 4 resources
[INFO] Copying 3 resources
[INFO]
[INFO] --- maven-compiler-plugin:2.0.2:testCompile (default-testCompile) @ hbase ---
[INFO] Compiling 204 source files to /x1/jenkins/jenkins-slave/workspace/hbase-0.90/trunk/target/test-classes
[INFO] ------------------------------------------------------------------------
[INFO] BUILD FAILURE
[INFO] ------------------------------------------------------------------------
[INFO] Total time: 27.123s
[INFO] Finished at: Thu Apr 05 21:38:41 UTC 2012
[INFO] Final Memory: 46M/676M
[INFO] ------------------------------------------------------------------------
[ERROR] Failed to execute goal org.apache.maven.plugins:maven-compiler-plugin:2.0.2:testCompile (default-testCompile) on project hbase: Compilation failure
[ERROR] /x1/jenkins/jenkins-slave/workspace/hbase-0.90/trunk/src/test/java/org/apache/hadoop/hbase/TestKeyValue.java:[404,64] cannot find symbol
[ERROR] symbol : variable WritableUtils
[ERROR] location: class org.apache.hadoop.hbase.TestKeyValue
[ERROR] -> [Help 1]
[ERROR]
[ERROR] To see the full stack trace of the errors, re-run Maven with the -e switch.
[ERROR] Re-run Maven using the -X switch to enable full debug logging.
[ERROR]
[ERROR] For more information about the errors and possible solutions, please read the following articles:
[ERROR] [Help 1] http://cwiki.apache.org/confluence/display/MAVEN/MojoFailureException
Build step 'Invoke top-level Maven targets' marked build as failure
[locks-and-latches] Releasing all the locks
[locks-and-latches] All the locks released
Archiving artifacts
Recording test results