You are viewing a plain text version of this content. The canonical link for it is here.
Posted to notifications@maven.apache.org by Hudson <Hu...@sonatype.org> on 2008/08/07 02:12:38 UTC
Build failed in Hudson: Archetype #41
See http://ci.sonatype.org/job/Archetype/41/changes
Changes:
[Arnaud HERITIER] Check that maven-parent 9 works with all projects
------------------------------------------
[...truncated 1755 lines...]
at java.lang.reflect.Method.invoke(Method.java:324)
at org.codehaus.cargo.container.jetty.internal.JettyExecutorThread.run(JettyExecutorThread.java:68)
Caused by: java.net.SocketException: Address already in use
at sun.nio.ch.Net.bind(Native Method)
at sun.nio.ch.ServerSocketChannelImpl.bind(ServerSocketChannelImpl.java:108)
at sun.nio.ch.ServerSocketAdaptor.bind(ServerSocketAdaptor.java:59)
at org.mortbay.jetty.nio.SelectChannelConnector.open(SelectChannelConnector.java:211)
at org.mortbay.jetty.nio.SelectChannelConnector.doStart(SelectChannelConnector.java:309)
at org.mortbay.component.AbstractLifeCycle.start(AbstractLifeCycle.java:40)
at org.mortbay.jetty.Server.doStart(Server.java:231)
at org.mortbay.component.AbstractLifeCycle.start(AbstractLifeCycle.java:40)
... 5 more
Tests run: 1, Failures: 0, Errors: 1, Skipped: 0, Time elapsed: 22.479 sec <<< FAILURE!
testArchetyper(org.apache.maven.archetype.test.RoundtripMultiModuleTest) Time elapsed: 22.473 sec <<< ERROR!
org.codehaus.cargo.container.ContainerException: Deployable [http://localhost:18881/repo/dummy] failed to finish deploying within the timeout period [20000]. The Deployable state is thus unknown.
at org.codehaus.cargo.container.spi.deployer.DeployerWatchdog.watch(DeployerWatchdog.java:111)
at org.codehaus.cargo.container.spi.deployer.DeployerWatchdog.watchForAvailability(DeployerWatchdog.java:78)
at org.codehaus.cargo.container.spi.deployer.AbstractDeployer.deploy(AbstractDeployer.java:63)
at org.apache.maven.archetype.test.RoundtripMultiModuleTest.setUp(RoundtripMultiModuleTest.java:240)
at junit.framework.TestCase.runBare(TestCase.java:128)
at junit.framework.TestResult$1.protect(TestResult.java:106)
at junit.framework.TestResult.runProtected(TestResult.java:124)
at junit.framework.TestResult.run(TestResult.java:109)
at junit.framework.TestCase.run(TestCase.java:120)
at junit.framework.TestSuite.runTest(TestSuite.java:230)
at junit.framework.TestSuite.run(TestSuite.java:225)
at sun.reflect.NativeMethodAccessorImpl.invoke0(Native Method)
at sun.reflect.NativeMethodAccessorImpl.invoke(NativeMethodAccessorImpl.java:39)
at sun.reflect.DelegatingMethodAccessorImpl.invoke(DelegatingMethodAccessorImpl.java:25)
at java.lang.reflect.Method.invoke(Method.java:324)
at org.apache.maven.surefire.junit.JUnitTestSet.execute(JUnitTestSet.java:213)
at org.apache.maven.surefire.suite.AbstractDirectoryTestSuite.executeTestSet(AbstractDirectoryTestSuite.java:138)
at org.apache.maven.surefire.suite.AbstractDirectoryTestSuite.execute(AbstractDirectoryTestSuite.java:125)
at org.apache.maven.surefire.Surefire.run(Surefire.java:132)
at sun.reflect.NativeMethodAccessorImpl.invoke0(Native Method)
at sun.reflect.NativeMethodAccessorImpl.invoke(NativeMethodAccessorImpl.java:39)
at sun.reflect.DelegatingMethodAccessorImpl.invoke(DelegatingMethodAccessorImpl.java:25)
at java.lang.reflect.Method.invoke(Method.java:324)
at org.apache.maven.surefire.booter.SurefireBooter.runSuitesInProcess(SurefireBooter.java:290)
at org.apache.maven.surefire.booter.SurefireBooter.main(SurefireBooter.java:818)
at org.apache.maven.surefire.booter.SurefireBooter.main(SurefireBooter.java:818)
Running org.apache.maven.archetype.test.ArchetyperRoundtripTest
2008-08-06 19:12:08.372::INFO: jetty-6.1.4
2008-08-06 19:12:08.377::INFO: Extract jar:http://ci.sonatype.org/job/Archetype/ws/trunk/archetype-common/target/repository-webapp/cargocpc.war!/ to /tmp/Jetty_0_0_0_0_18881_cargocpc.war__cargocpc__-40pz0h/webapp
2008-08-06 19:12:08.387::INFO: NO JSP Support for /cargocpc, did not find org.apache.jasper.servlet.JspServlet
2008-08-06 19:12:08.399::WARN: failed SelectChannelConnector@0.0.0.0:18881
java.net.SocketException: Address already in use
at sun.nio.ch.Net.bind(Native Method)
at sun.nio.ch.ServerSocketChannelImpl.bind(ServerSocketChannelImpl.java:108)
at sun.nio.ch.ServerSocketAdaptor.bind(ServerSocketAdaptor.java:59)
at org.mortbay.jetty.nio.SelectChannelConnector.open(SelectChannelConnector.java:211)
at org.mortbay.jetty.nio.SelectChannelConnector.doStart(SelectChannelConnector.java:309)
at org.mortbay.component.AbstractLifeCycle.start(AbstractLifeCycle.java:40)
at org.mortbay.jetty.Server.doStart(Server.java:231)
at org.mortbay.component.AbstractLifeCycle.start(AbstractLifeCycle.java:40)
at sun.reflect.NativeMethodAccessorImpl.invoke0(Native Method)
at sun.reflect.NativeMethodAccessorImpl.invoke(NativeMethodAccessorImpl.java:39)
at sun.reflect.DelegatingMethodAccessorImpl.invoke(DelegatingMethodAccessorImpl.java:25)
at java.lang.reflect.Method.invoke(Method.java:324)
at org.codehaus.cargo.container.jetty.internal.JettyExecutorThread.run(JettyExecutorThread.java:68)
2008-08-06 19:12:08.400::WARN: failed Server@c80e21
java.net.SocketException: Address already in use
at sun.nio.ch.Net.bind(Native Method)
at sun.nio.ch.ServerSocketChannelImpl.bind(ServerSocketChannelImpl.java:108)
at sun.nio.ch.ServerSocketAdaptor.bind(ServerSocketAdaptor.java:59)
at org.mortbay.jetty.nio.SelectChannelConnector.open(SelectChannelConnector.java:211)
at org.mortbay.jetty.nio.SelectChannelConnector.doStart(SelectChannelConnector.java:309)
at org.mortbay.component.AbstractLifeCycle.start(AbstractLifeCycle.java:40)
at org.mortbay.jetty.Server.doStart(Server.java:231)
at org.mortbay.component.AbstractLifeCycle.start(AbstractLifeCycle.java:40)
at sun.reflect.NativeMethodAccessorImpl.invoke0(Native Method)
at sun.reflect.NativeMethodAccessorImpl.invoke(NativeMethodAccessorImpl.java:39)
at sun.reflect.DelegatingMethodAccessorImpl.invoke(DelegatingMethodAccessorImpl.java:25)
at java.lang.reflect.Method.invoke(Method.java:324)
at org.codehaus.cargo.container.jetty.internal.JettyExecutorThread.run(JettyExecutorThread.java:68)
org.codehaus.cargo.container.ContainerException: Failed to start the Jetty container
at org.codehaus.cargo.container.jetty.internal.JettyExecutorThread.run(JettyExecutorThread.java:102)
Caused by: java.lang.reflect.InvocationTargetException
at sun.reflect.NativeMethodAccessorImpl.invoke0(Native Method)
at sun.reflect.NativeMethodAccessorImpl.invoke(NativeMethodAccessorImpl.java:39)
at sun.reflect.DelegatingMethodAccessorImpl.invoke(DelegatingMethodAccessorImpl.java:25)
at java.lang.reflect.Method.invoke(Method.java:324)
at org.codehaus.cargo.container.jetty.internal.JettyExecutorThread.run(JettyExecutorThread.java:68)
Caused by: java.net.SocketException: Address already in use
at sun.nio.ch.Net.bind(Native Method)
at sun.nio.ch.ServerSocketChannelImpl.bind(ServerSocketChannelImpl.java:108)
at sun.nio.ch.ServerSocketAdaptor.bind(ServerSocketAdaptor.java:59)
at org.mortbay.jetty.nio.SelectChannelConnector.open(SelectChannelConnector.java:211)
at org.mortbay.jetty.nio.SelectChannelConnector.doStart(SelectChannelConnector.java:309)
at org.mortbay.component.AbstractLifeCycle.start(AbstractLifeCycle.java:40)
at org.mortbay.jetty.Server.doStart(Server.java:231)
at org.mortbay.component.AbstractLifeCycle.start(AbstractLifeCycle.java:40)
... 5 more
java.lang.reflect.InvocationTargetException
at sun.reflect.NativeMethodAccessorImpl.invoke0(Native Method)
at sun.reflect.NativeMethodAccessorImpl.invoke(NativeMethodAccessorImpl.java:39)
at sun.reflect.DelegatingMethodAccessorImpl.invoke(DelegatingMethodAccessorImpl.java:25)
at java.lang.reflect.Method.invoke(Method.java:324)
at org.codehaus.cargo.container.jetty.internal.JettyExecutorThread.run(JettyExecutorThread.java:68)
Caused by: java.net.SocketException: Address already in use
at sun.nio.ch.Net.bind(Native Method)
at sun.nio.ch.ServerSocketChannelImpl.bind(ServerSocketChannelImpl.java:108)
at sun.nio.ch.ServerSocketAdaptor.bind(ServerSocketAdaptor.java:59)
at org.mortbay.jetty.nio.SelectChannelConnector.open(SelectChannelConnector.java:211)
at org.mortbay.jetty.nio.SelectChannelConnector.doStart(SelectChannelConnector.java:309)
at org.mortbay.component.AbstractLifeCycle.start(AbstractLifeCycle.java:40)
at org.mortbay.jetty.Server.doStart(Server.java:231)
at org.mortbay.component.AbstractLifeCycle.start(AbstractLifeCycle.java:40)
... 5 more
Tests run: 1, Failures: 0, Errors: 1, Skipped: 0, Time elapsed: 22.462 sec <<< FAILURE!
testArchetyper(org.apache.maven.archetype.test.ArchetyperRoundtripTest) Time elapsed: 22.459 sec <<< ERROR!
org.codehaus.cargo.container.ContainerException: Deployable [http://localhost:18881/repo/dummy] failed to finish deploying within the timeout period [20000]. The Deployable state is thus unknown.
at org.codehaus.cargo.container.spi.deployer.DeployerWatchdog.watch(DeployerWatchdog.java:111)
at org.codehaus.cargo.container.spi.deployer.DeployerWatchdog.watchForAvailability(DeployerWatchdog.java:78)
at org.codehaus.cargo.container.spi.deployer.AbstractDeployer.deploy(AbstractDeployer.java:63)
at org.apache.maven.archetype.test.ArchetyperRoundtripTest.setUp(ArchetyperRoundtripTest.java:235)
at junit.framework.TestCase.runBare(TestCase.java:128)
at junit.framework.TestResult$1.protect(TestResult.java:106)
at junit.framework.TestResult.runProtected(TestResult.java:124)
at junit.framework.TestResult.run(TestResult.java:109)
at junit.framework.TestCase.run(TestCase.java:120)
at junit.framework.TestSuite.runTest(TestSuite.java:230)
at junit.framework.TestSuite.run(TestSuite.java:225)
at sun.reflect.NativeMethodAccessorImpl.invoke0(Native Method)
at sun.reflect.NativeMethodAccessorImpl.invoke(NativeMethodAccessorImpl.java:39)
at sun.reflect.DelegatingMethodAccessorImpl.invoke(DelegatingMethodAccessorImpl.java:25)
at java.lang.reflect.Method.invoke(Method.java:324)
at org.apache.maven.surefire.junit.JUnitTestSet.execute(JUnitTestSet.java:213)
at org.apache.maven.surefire.suite.AbstractDirectoryTestSuite.executeTestSet(AbstractDirectoryTestSuite.java:138)
at org.apache.maven.surefire.suite.AbstractDirectoryTestSuite.execute(AbstractDirectoryTestSuite.java:125)
at org.apache.maven.surefire.Surefire.run(Surefire.java:132)
at sun.reflect.NativeMethodAccessorImpl.invoke0(Native Method)
at sun.reflect.NativeMethodAccessorImpl.invoke(NativeMethodAccessorImpl.java:39)
at sun.reflect.DelegatingMethodAccessorImpl.invoke(DelegatingMethodAccessorImpl.java:25)
at java.lang.reflect.Method.invoke(Method.java:324)
at org.apache.maven.surefire.booter.SurefireBooter.runSuitesInProcess(SurefireBooter.java:290)
at org.apache.maven.surefire.booter.SurefireBooter.main(SurefireBooter.java:818)
at org.apache.maven.surefire.booter.SurefireBooter.main(SurefireBooter.java:818)
Running org.apache.maven.archetype.repositorycrawler.DefaultRepositoryCrawlerTest
crawl
[INFO] Scanning http://ci.sonatype.org/job/Archetype/ws/trunk/archetype-common/target/test-classes/repositories/central/archetypes/basic/1.0/basic-1.0.jar
[INFO] Archetype [archetypes:basic:1.0] defined by repository path
[INFO] Scanning http://ci.sonatype.org/job/Archetype/ws/trunk/archetype-common/target/test-classes/repositories/central/archetypes/fileset/1.0/fileset-1.0.jar
[INFO] Archetype [archetypes:fileset:1.0] defined by repository path
[INFO] Scanning http://ci.sonatype.org/job/Archetype/ws/trunk/archetype-common/target/test-classes/repositories/central/archetypes/site/1.0/site-1.0.jar
[INFO] Archetype [archetypes:site:1.0] defined by repository path
[INFO] Scanning http://ci.sonatype.org/job/Archetype/ws/trunk/archetype-common/target/test-classes/repositories/central/archetypes/old/1.0/old-1.0.jar
[INFO] Archetype [archetypes:old:1.0] defined by repository path
[INFO] Scanning http://ci.sonatype.org/job/Archetype/ws/trunk/archetype-common/target/test-classes/repositories/central/archetypes/partial/1.0/partial-1.0.jar
[INFO] Archetype [archetypes:partial:1.0] defined by repository path
result = [[archetypes:basic:1.0], [archetypes:fileset:1.0], [archetypes:site:1.0], [archetypes:old:1.0], [archetypes:partial:1.0]]
Tests run: 1, Failures: 1, Errors: 0, Skipped: 0, Time elapsed: 0.091 sec <<< FAILURE!
testCrawl(org.apache.maven.archetype.repositorycrawler.DefaultRepositoryCrawlerTest) Time elapsed: 0.086 sec <<< FAILURE!
junit.framework.AssertionFailedError
at junit.framework.Assert.fail(Assert.java:47)
at junit.framework.Assert.assertTrue(Assert.java:20)
at junit.framework.Assert.assertTrue(Assert.java:27)
at org.apache.maven.archetype.repositorycrawler.DefaultRepositoryCrawlerTest.testCrawl(DefaultRepositoryCrawlerTest.java:47)
at org.apache.maven.archetype.repositorycrawler.DefaultRepositoryCrawlerTest.testCrawl(DefaultRepositoryCrawlerTest.java:47)
at sun.reflect.NativeMethodAccessorImpl.invoke0(Native Method)
at sun.reflect.NativeMethodAccessorImpl.invoke(NativeMethodAccessorImpl.java:39)
at sun.reflect.DelegatingMethodAccessorImpl.invoke(DelegatingMethodAccessorImpl.java:25)
at java.lang.reflect.Method.invoke(Method.java:324)
at junit.framework.TestCase.runTest(TestCase.java:164)
at junit.framework.TestCase.runBare(TestCase.java:130)
at junit.framework.TestResult$1.protect(TestResult.java:106)
at junit.framework.TestResult.runProtected(TestResult.java:124)
at junit.framework.TestResult.run(TestResult.java:109)
at junit.framework.TestCase.run(TestCase.java:120)
at junit.framework.TestSuite.runTest(TestSuite.java:230)
at junit.framework.TestSuite.run(TestSuite.java:225)
at sun.reflect.NativeMethodAccessorImpl.invoke0(Native Method)
at sun.reflect.NativeMethodAccessorImpl.invoke(NativeMethodAccessorImpl.java:39)
at sun.reflect.DelegatingMethodAccessorImpl.invoke(DelegatingMethodAccessorImpl.java:25)
at java.lang.reflect.Method.invoke(Method.java:324)
at org.apache.maven.surefire.junit.JUnitTestSet.execute(JUnitTestSet.java:213)
at org.apache.maven.surefire.suite.AbstractDirectoryTestSuite.executeTestSet(AbstractDirectoryTestSuite.java:138)
at org.apache.maven.surefire.suite.AbstractDirectoryTestSuite.execute(AbstractDirectoryTestSuite.java:125)
at org.apache.maven.surefire.Surefire.run(Surefire.java:132)
at sun.reflect.NativeMethodAccessorImpl.invoke0(Native Method)
at sun.reflect.NativeMethodAccessorImpl.invoke(NativeMethodAccessorImpl.java:39)
at sun.reflect.DelegatingMethodAccessorImpl.invoke(DelegatingMethodAccessorImpl.java:25)
at java.lang.reflect.Method.invoke(Method.java:324)
at org.apache.maven.surefire.booter.SurefireBooter.runSuitesInProcess(SurefireBooter.java:290)
at org.apache.maven.surefire.booter.SurefireBooter.main(SurefireBooter.java:818)
Running org.apache.maven.archetype.source.CatalogArchetypeDataSinkTest
Tests run: 2, Failures: 0, Errors: 0, Skipped: 0, Time elapsed: 0.127 sec
Running org.apache.maven.archetype.creator.DefaultArchetypeCreatorTest
testCreateFilesetArchetype
Tests run: 1, Failures: 0, Errors: 0, Skipped: 0, Time elapsed: 0.38 sec
Results :
Failed tests:
testCrawl(org.apache.maven.archetype.repositorycrawler.DefaultRepositoryCrawlerTest)
Tests in error:
testRemoteCatalog(org.apache.maven.archetype.ArchetypeCatalogsTest)
testLocalCatalog(org.apache.maven.archetype.ArchetypeCatalogsTest)
testArchetyper(org.apache.maven.archetype.test.ArchetyperRoundtripWithProxyTest)
testArchetyper(org.apache.maven.archetype.test.RoundtripMultiModuleTest)
testArchetyper(org.apache.maven.archetype.test.ArchetyperRoundtripTest)
Tests run: 32, Failures: 1, Errors: 5, Skipped: 0
2008-08-06 19:12:31.794::INFO: Shutdown hook executing
2008-08-06 19:12:31.796::INFO: Shutdown hook complete
2008-08-06 19:12:32.703::INFO: Shutdown hook complete
2008-08-06 19:12:33.812::INFO: Shutdown hook complete
2008-08-06 19:12:34.917::INFO: Shutdown hook complete
2008-08-06 19:12:35.920::INFO: Shutdown hook complete
2008-08-06 19:12:36.828::INFO: Shutdown hook complete
[INFO] ------------------------------------------------------------------------
[ERROR] BUILD FAILURE
[INFO] ------------------------------------------------------------------------
[INFO] There are test failures.
[INFO] ------------------------------------------------------------------------
[INFO] Trace
org.apache.maven.BuildFailureException: There are test failures.
at org.apache.maven.lifecycle.DefaultLifecycleExecutor.executeGoals(DefaultLifecycleExecutor.java:579)
at org.apache.maven.lifecycle.DefaultLifecycleExecutor.executeGoalWithLifecycle(DefaultLifecycleExecutor.java:499)
at org.apache.maven.lifecycle.DefaultLifecycleExecutor.executeGoal(DefaultLifecycleExecutor.java:478)
at org.apache.maven.lifecycle.DefaultLifecycleExecutor.executeGoalAndHandleFailures(DefaultLifecycleExecutor.java:330)
at org.apache.maven.lifecycle.DefaultLifecycleExecutor.executeTaskSegments(DefaultLifecycleExecutor.java:291)
at org.apache.maven.lifecycle.DefaultLifecycleExecutor.execute(DefaultLifecycleExecutor.java:142)
at org.apache.maven.DefaultMaven.doExecute(DefaultMaven.java:336)
at org.apache.maven.DefaultMaven.execute(DefaultMaven.java:129)
at org.apache.maven.cli.MavenCli.main(MavenCli.java:287)
at sun.reflect.NativeMethodAccessorImpl.invoke0(Native Method)
at sun.reflect.NativeMethodAccessorImpl.invoke(NativeMethodAccessorImpl.java:39)
at sun.reflect.DelegatingMethodAccessorImpl.invoke(DelegatingMethodAccessorImpl.java:25)
at java.lang.reflect.Method.invoke(Method.java:324)
at org.codehaus.classworlds.Launcher.launchEnhanced(Launcher.java:315)
at org.codehaus.classworlds.Launcher.launch(Launcher.java:255)
at org.codehaus.classworlds.Launcher.mainWithExitCode(Launcher.java:430)
at org.codehaus.classworlds.Launcher.main(Launcher.java:375)
Caused by: org.apache.maven.plugin.MojoFailureException: There are test failures.
at org.apache.maven.plugin.surefire.SurefirePlugin.execute(SurefirePlugin.java:425)
at org.apache.maven.plugin.DefaultPluginManager.executeMojo(DefaultPluginManager.java:451)
at org.apache.maven.lifecycle.DefaultLifecycleExecutor.executeGoals(DefaultLifecycleExecutor.java:558)
... 16 more
[INFO] ------------------------------------------------------------------------
[INFO] Total time: 8 minutes 58 seconds
[INFO] Finished at: Wed Aug 06 19:12:37 CDT 2008
[INFO] Final Memory: 48M/63M
[INFO] ------------------------------------------------------------------------
Hudson build is back to normal: Archetype #43
Posted by Hudson <Hu...@sonatype.org>.
See http://ci.sonatype.org/job/Archetype/43/changes
Build failed in Hudson: Archetype #42
Posted by Hudson <Hu...@sonatype.org>.
See http://ci.sonatype.org/job/Archetype/42/changes
------------------------------------------
started
ERROR: svn: timed out waiting for server
svn: OPTIONS request failed on '/repos/asf/maven/archetype/trunk'
org.tmatesoft.svn.core.SVNException: svn: timed out waiting for server
svn: OPTIONS request failed on '/repos/asf/maven/archetype/trunk'
at org.tmatesoft.svn.core.internal.wc.SVNErrorManager.error(SVNErrorManager.java:102)
at org.tmatesoft.svn.core.internal.wc.SVNErrorManager.error(SVNErrorManager.java:86)
at org.tmatesoft.svn.core.internal.io.dav.http.HTTPConnection.request(HTTPConnection.java:545)
at org.tmatesoft.svn.core.internal.io.dav.http.HTTPConnection.request(HTTPConnection.java:255)
at org.tmatesoft.svn.core.internal.io.dav.http.HTTPConnection.request(HTTPConnection.java:243)
at org.tmatesoft.svn.core.internal.io.dav.DAVConnection.exchangeCapabilities(DAVConnection.java:452)
at org.tmatesoft.svn.core.internal.io.dav.DAVConnection.open(DAVConnection.java:95)
at org.tmatesoft.svn.core.internal.io.dav.DAVRepository.openConnection(DAVRepository.java:642)
at org.tmatesoft.svn.core.internal.io.dav.DAVRepository.testConnection(DAVRepository.java:95)
at hudson.scm.SubversionSCM$DescriptorImpl.checkRepositoryPath(SubversionSCM.java:1308)
at hudson.scm.SubversionSCM.repositoryLocationsExist(SubversionSCM.java:1369)
at hudson.scm.SubversionSCM.checkout(SubversionSCM.java:357)
at hudson.scm.SubversionSCM.checkout(SubversionSCM.java:321)
at hudson.model.AbstractProject.checkout(AbstractProject.java:631)
at hudson.model.AbstractBuild$AbstractRunner.checkout(AbstractBuild.java:260)
at hudson.model.AbstractBuild$AbstractRunner.run(AbstractBuild.java:234)
at hudson.model.Run.run(Run.java:793)
at hudson.model.Build.run(Build.java:88)
at hudson.model.ResourceController.execute(ResourceController.java:70)
at hudson.model.Executor.run(Executor.java:88)
Caused by: java.net.SocketTimeoutException: connect timed out
at java.net.PlainSocketImpl.socketConnect(Native Method)
at java.net.PlainSocketImpl.doConnect(PlainSocketImpl.java:333)
at java.net.PlainSocketImpl.connectToAddress(PlainSocketImpl.java:195)
at java.net.PlainSocketImpl.connect(PlainSocketImpl.java:182)
at java.net.SocksSocketImpl.connect(SocksSocketImpl.java:366)
at java.net.Socket.connect(Socket.java:519)
at com.sun.net.ssl.internal.ssl.SSLSocketImpl.connect(SSLSocketImpl.java:550)
at org.tmatesoft.svn.core.internal.util.SVNSocketFactory.createSSLSocket(SVNSocketFactory.java:65)
at org.tmatesoft.svn.core.internal.io.dav.http.HTTPConnection.connect(HTTPConnection.java:165)
at org.tmatesoft.svn.core.internal.io.dav.http.HTTPConnection.request(HTTPConnection.java:302)
... 17 more