You are viewing a plain text version of this content. The canonical link for it is here.
Posted to builds@beam.apache.org by Apache Jenkins Server <je...@builds.apache.org> on 2021/10/21 00:38:44 UTC

Build failed in Jenkins: beam_PostCommit_Java_Nexmark_Spark #7594

See <https://ci-beam.apache.org/job/beam_PostCommit_Java_Nexmark_Spark/7594/display/redirect?page=changes>

Changes:

[noreply] [BEAM-11087] Add default WindowMappingFn from Main to Side Input


------------------------------------------
[...truncated 12.86 MB...]
21/10/21 00:38:39 DEBUG org.apache.beam.vendor.calcite.v1_26_0.org.apache.calcite.plan.RelOptPlanner: call#8843: Apply rule [BeamCalcMergeRule] to [rel#1227:BeamCalcRel.BEAM_LOGICAL(input=RelSubset#1216,expr#0..6={inputs},proj#0..3={exprs},4=$t6), rel#1676:BeamCalcRel.BEAM_LOGICAL(input=RelSubset#1216,expr#0..6={inputs},proj#0..6={exprs})]
21/10/21 00:38:39 DEBUG org.apache.beam.vendor.calcite.v1_26_0.org.apache.calcite.plan.RelOptPlanner: Transform to: rel#1684 via BeamCalcMergeRule
21/10/21 00:38:39 DEBUG org.apache.beam.vendor.calcite.v1_26_0.org.apache.calcite.plan.RelOptPlanner: call#8843 generated 1 successors: [rel#1684:BeamCalcRel.BEAM_LOGICAL(input=RelSubset#1216,expr#0..6={inputs},proj#0..3={exprs},4=$t6)]
21/10/21 00:38:39 DEBUG org.apache.beam.vendor.calcite.v1_26_0.org.apache.calcite.plan.RelOptPlanner: PLANNER = org.apache.beam.vendor.calcite.v1_26_0.org.apache.calcite.plan.volcano.IterativeRuleDriver@6d9f585b; COST = {3500.0 cpu, 0.0 cpuRate }
21/10/21 00:38:39 DEBUG org.apache.beam.vendor.calcite.v1_26_0.org.apache.calcite.plan.RelOptPlanner: Pop match: rule [BeamCalcMergeRule] rels [#1644,#1676]
21/10/21 00:38:39 DEBUG org.apache.beam.vendor.calcite.v1_26_0.org.apache.calcite.plan.RelOptPlanner: call#8844: Apply rule [BeamCalcMergeRule] to [rel#1644:BeamCalcRel.BEAM_LOGICAL(input=RelSubset#1216,expr#0..6={inputs},0=$t5,1=$t6,2=$t0,3=$t1,4=$t2,5=$t3,6=$t4), rel#1676:BeamCalcRel.BEAM_LOGICAL(input=RelSubset#1216,expr#0..6={inputs},proj#0..6={exprs})]
21/10/21 00:38:39 DEBUG org.apache.beam.vendor.calcite.v1_26_0.org.apache.calcite.plan.RelOptPlanner: Transform to: rel#1685 via BeamCalcMergeRule
21/10/21 00:38:39 DEBUG org.apache.beam.vendor.calcite.v1_26_0.org.apache.calcite.plan.RelOptPlanner: call#8844 generated 1 successors: [rel#1685:BeamCalcRel.BEAM_LOGICAL(input=RelSubset#1216,expr#0..6={inputs},0=$t5,1=$t6,2=$t0,3=$t1,4=$t2,5=$t3,6=$t4)]
21/10/21 00:38:39 DEBUG org.apache.beam.vendor.calcite.v1_26_0.org.apache.calcite.plan.RelOptPlanner: PLANNER = org.apache.beam.vendor.calcite.v1_26_0.org.apache.calcite.plan.volcano.IterativeRuleDriver@6d9f585b; COST = {3500.0 cpu, 0.0 cpuRate }
21/10/21 00:38:39 DEBUG org.apache.beam.vendor.calcite.v1_26_0.org.apache.calcite.plan.AbstractRelOptPlanner.rule_execution_summary: Rule Attempts Info for VolcanoPlanner
21/10/21 00:38:39 DEBUG org.apache.beam.vendor.calcite.v1_26_0.org.apache.calcite.plan.AbstractRelOptPlanner.rule_execution_summary: 
Rules                                                                   Attempts           Time (us)
BeamCalcMergeRule                                                            108              11,759
LogicalCalcMergeRule                                                         108              10,480
ProjectCalcMergeRule                                                          76              11,086
BeamEnumerableConverterRule(in:BEAM_LOGICAL,out:ENUMERABLE)                   47               3,014
BeamCalcRule(in:NONE,out:BEAM_LOGICAL)                                        41               8,724
ProjectMergeRule                                                              28               3,808
ProjectToCalcRule                                                             20               2,368
ProjectFilterTransposeRule                                                    12               3,958
BeamCoGBKJoinRule                                                              8              10,574
FilterCalcMergeRule                                                            8               1,258
JoinPushExpressionsRule                                                        8               1,109
JoinConditionPushRule                                                          8                 285
FilterProjectTransposeRule                                                     6               1,140
JoinCommuteRule                                                                4               1,754
FilterToCalcRule                                                               4                 634
FilterIntoJoinRule                                                             2                 742
BeamIOPushDownRule                                                             2                  55
* Total                                                                      490              72,748

21/10/21 00:38:39 DEBUG org.apache.beam.vendor.calcite.v1_26_0.org.apache.calcite.plan.RelOptPlanner: Cheapest plan:
BeamCalcRel(expr#0..7=[{inputs}], proj#0..3=[{exprs}], extra=[$t7]): rowcount = 1500.0, cumulative cost = {3500.0 cpu, 0.0 cpuRate }, id = 1688
  BeamCoGBKJoinRel(condition=[=($5, $6)], joinType=[inner]): rowcount = 1500.0, cumulative cost = {2000.0 cpu, 0.0 cpuRate }, id = 1687
    BeamCalcRel(expr#0..4=[{inputs}], expr#5=[500], expr#6=[MOD($t1, $t5)], expr#7=[CAST($t6):BIGINT NOT NULL], proj#0..4=[{exprs}], side_id=[$t7]): rowcount = 100.0, cumulative cost = {200.0 cpu, 0.0 cpuRate }, id = 1686
      BeamIOSourceRel(table=[[beam, bid]]): rowcount = 100.0, cumulative cost = {100.0 cpu, 0.0 cpuRate }, id = 1085
    BeamIOSourceRel(table=[[beam, side]]): rowcount = 100.0, cumulative cost = {100.0 cpu, 0.0 cpuRate }, id = 1087

21/10/21 00:38:39 DEBUG org.apache.beam.vendor.calcite.v1_26_0.org.apache.calcite.plan.RelOptPlanner: Provenance:
rel#1688:BeamCalcRel.BEAM_LOGICAL(input=BeamCoGBKJoinRel#1687,expr#0..7={inputs},proj#0..3={exprs},4=$t7)
  direct
    rel#1156:BeamCalcRel.BEAM_LOGICAL(input=RelSubset#1147,expr#0..7={inputs},proj#0..3={exprs},4=$t7)
      call#6130 rule [BeamCalcRule(in:NONE,out:BEAM_LOGICAL)]
        rel#1120:LogicalCalc.NONE(input=RelSubset#1098,expr#0..7={inputs},proj#0..3={exprs},4=$t7)
          call#5919 rule [ProjectToCalcRule]
            rel#1099:LogicalProject.NONE(input=RelSubset#1098,inputs=0..3,exprs=[$7])
              no parent
rel#1687:BeamCoGBKJoinRel.BEAM_LOGICAL(left=BeamCalcRel#1686,right=BeamIOSourceRel#1087,condition==($5, $6),joinType=inner)
  direct
    rel#1149:BeamCoGBKJoinRel.BEAM_LOGICAL(left=RelSubset#1110,right=RelSubset#1094,condition==($5, $6),joinType=inner)
      call#6102 rule [BeamCoGBKJoinRule]
        rel#1119:LogicalJoin.NONE(left=RelSubset#1093,right=RelSubset#1094,condition==($5, $6),joinType=inner)
          call#5896 rule [FilterIntoJoinRule]
            rel#1097:LogicalFilter.NONE(input=RelSubset#1096,condition==($5, $6))
              no parent
            rel#1095:LogicalJoin.NONE(left=RelSubset#1093,right=RelSubset#1094,condition=true,joinType=inner)
              no parent
        rel#1092:LogicalProject.NONE(input=RelSubset#1091,inputs=0..4,exprs=[CAST(MOD($1, 500)):BIGINT NOT NULL])
          no parent
        rel#1087:BeamIOSourceRel.BEAM_LOGICAL(table=[beam, side])
          no parent
rel#1686:BeamCalcRel.BEAM_LOGICAL(input=BeamIOSourceRel#1085,expr#0..4={inputs},expr#5=500,expr#6=MOD($t1, $t5),expr#7=CAST($t6):BIGINT NOT NULL,proj#0..4={exprs},5=$t7)
  direct
    rel#1128:BeamCalcRel.BEAM_LOGICAL(input=RelSubset#1091,expr#0..4={inputs},expr#5=500,expr#6=MOD($t1, $t5),expr#7=CAST($t6):BIGINT NOT NULL,proj#0..4={exprs},5=$t7)
      call#5960 rule [BeamCalcRule(in:NONE,out:BEAM_LOGICAL)]
        rel#1106:LogicalCalc.NONE(input=RelSubset#1091,expr#0..4={inputs},expr#5=500,expr#6=MOD($t1, $t5),expr#7=CAST($t6):BIGINT NOT NULL,proj#0..4={exprs},5=$t7)
          call#5820 rule [ProjectToCalcRule]
            rel#1092 (see above)
rel#1085:BeamIOSourceRel.BEAM_LOGICAL(table=[beam, bid])
  no parent
rel#1087 (see above)

21/10/21 00:38:40 ERROR org.apache.beam.sdk.metrics.MetricsEnvironment: Unable to update metrics on the current thread. Most likely caused by using metrics outside the managed work-execution thread.
2021-10-21T00:38:41.550Z Waiting for main pipeline to 'finish'
2021-10-21T00:38:41.550Z DONE SqlBoundedSideInputJoin
2021-10-21T00:38:41.551Z Running query:SESSION_SIDE_INPUT_JOIN; exportSummaryToBigQuery:true; streamTimeout:60
2021-10-21T00:38:41.551Z skipping since configuration is not implemented

==========================================================================================
Run started 2021-10-21T00:38:15.559Z and ran for PT25.992S

Default configuration:
{"debug":true,"query":null,"sourceType":"DIRECT","generateEventFilePathPrefix":null,"sinkType":"DEVNULL","exportSummaryToBigQuery":false,"pubSubMode":"COMBINED","pubsubMessageSerializationMethod":"CODER","sideInputType":"DIRECT","sideInputRowCount":500,"sideInputNumShards":3,"sideInputUrl":null,"sessionGap":600000,"numEvents":100000,"numEventGenerators":100,"rateShape":"SINE","firstEventRate":10000,"nextEventRate":10000,"rateUnit":"PER_SECOND","ratePeriodSec":600,"preloadSeconds":0,"streamTimeout":240,"isRateLimited":false,"useWallclockEventTime":false,"avgPersonByteSize":200,"avgAuctionByteSize":500,"avgBidByteSize":100,"hotAuctionRatio":2,"hotSellersRatio":4,"hotBiddersRatio":4,"windowSizeSec":10,"windowPeriodSec":5,"watermarkHoldbackSec":0,"numInFlightAuctions":100,"numActivePeople":1000,"coderStrategy":"HAND","cpuDelayMs":0,"diskBusyBytes":0,"auctionSkip":123,"fanout":5,"maxAuctionsWaitingTime":600,"occasionalDelaySec":3,"probDelayedEvent":0.1,"maxLogEvents":100000,"usePubsubPublishTime":false,"outOfOrderGroupSize":1,"numKeyBuckets":20000,"pardoCPUFactor":1.0}

Configurations:
  Conf  Description
  0000  query:PASSTHROUGH; exportSummaryToBigQuery:true; streamTimeout:60
  0001  query:CURRENCY_CONVERSION; exportSummaryToBigQuery:true; streamTimeout:60
  0002  query:SELECTION; exportSummaryToBigQuery:true; streamTimeout:60
  0003  query:LOCAL_ITEM_SUGGESTION; exportSummaryToBigQuery:true; streamTimeout:60
  0004  query:AVERAGE_PRICE_FOR_CATEGORY; exportSummaryToBigQuery:true; numEvents:10000; streamTimeout:60
  0005  query:HOT_ITEMS; exportSummaryToBigQuery:true; streamTimeout:60
  0006  query:AVERAGE_SELLING_PRICE_BY_SELLER; exportSummaryToBigQuery:true; numEvents:10000; streamTimeout:60
  0007  query:HIGHEST_BID; exportSummaryToBigQuery:true; streamTimeout:60
  0008  query:MONITOR_NEW_USERS; exportSummaryToBigQuery:true; streamTimeout:60
  0009  query:WINNING_BIDS; exportSummaryToBigQuery:true; numEvents:10000; streamTimeout:60
  0010  query:LOG_TO_SHARDED_FILES; exportSummaryToBigQuery:true; streamTimeout:60
  0011  query:USER_SESSIONS; exportSummaryToBigQuery:true; streamTimeout:60
  0012  query:PROCESSING_TIME_WINDOWS; exportSummaryToBigQuery:true; streamTimeout:60
  0013  query:PORTABILITY_BATCH; exportSummaryToBigQuery:true; streamTimeout:60
  0014  query:BOUNDED_SIDE_INPUT_JOIN; exportSummaryToBigQuery:true; streamTimeout:60
  0015  query:SESSION_SIDE_INPUT_JOIN; exportSummaryToBigQuery:true; streamTimeout:60

Performance:
  Conf  Runtime(sec)    (Baseline)  Events(/sec)    (Baseline)       Results    (Baseline)
  0000           1.7                     59312.0                       92000              
  0001           0.8                    125470.5                       92000              
  0002           0.7                    134589.5                         351              
  0003           2.2                     90538.7                         580              
  0004  *** not run ***
  0005  *** not run ***
  0006  *** not run ***
  0007           4.0                     50620.1                           1              
  0008  *** not run ***
  0009  *** not run ***
  0010  *** not run ***
  0011  *** not run ***
  0012  *** not run ***
  0013  *** not run ***
  0014           1.6                     61652.3                       92000              
  0015  *** not run ***
==========================================================================================

21/10/21 00:38:41 DEBUG org.apache.hadoop.fs.FsUrlStreamHandlerFactory: Creating handler for protocol http
21/10/21 00:38:41 DEBUG org.apache.hadoop.fs.FsUrlStreamHandlerFactory: Unknown protocol http, delegating to default implementation
21/10/21 00:38:41 DEBUG org.apache.hadoop.fs.FsUrlStreamHandlerFactory: Creating handler for protocol https
21/10/21 00:38:41 DEBUG org.apache.hadoop.fs.FsUrlStreamHandlerFactory: Unknown protocol https, delegating to default implementation

==========================================================================================
Run started 2021-10-21T00:38:15.559Z and ran for PT27.466S

Default configuration:
{"debug":true,"query":null,"sourceType":"DIRECT","generateEventFilePathPrefix":null,"sinkType":"DEVNULL","exportSummaryToBigQuery":false,"pubSubMode":"COMBINED","pubsubMessageSerializationMethod":"CODER","sideInputType":"DIRECT","sideInputRowCount":500,"sideInputNumShards":3,"sideInputUrl":null,"sessionGap":600000,"numEvents":100000,"numEventGenerators":100,"rateShape":"SINE","firstEventRate":10000,"nextEventRate":10000,"rateUnit":"PER_SECOND","ratePeriodSec":600,"preloadSeconds":0,"streamTimeout":240,"isRateLimited":false,"useWallclockEventTime":false,"avgPersonByteSize":200,"avgAuctionByteSize":500,"avgBidByteSize":100,"hotAuctionRatio":2,"hotSellersRatio":4,"hotBiddersRatio":4,"windowSizeSec":10,"windowPeriodSec":5,"watermarkHoldbackSec":0,"numInFlightAuctions":100,"numActivePeople":1000,"coderStrategy":"HAND","cpuDelayMs":0,"diskBusyBytes":0,"auctionSkip":123,"fanout":5,"maxAuctionsWaitingTime":600,"occasionalDelaySec":3,"probDelayedEvent":0.1,"maxLogEvents":100000,"usePubsubPublishTime":false,"outOfOrderGroupSize":1,"numKeyBuckets":20000,"pardoCPUFactor":1.0}

Configurations:
  Conf  Description
  0000  query:PASSTHROUGH; exportSummaryToBigQuery:true; streamTimeout:60
  0001  query:CURRENCY_CONVERSION; exportSummaryToBigQuery:true; streamTimeout:60
  0002  query:SELECTION; exportSummaryToBigQuery:true; streamTimeout:60
  0003  query:LOCAL_ITEM_SUGGESTION; exportSummaryToBigQuery:true; streamTimeout:60
  0004  query:AVERAGE_PRICE_FOR_CATEGORY; exportSummaryToBigQuery:true; numEvents:10000; streamTimeout:60
  0005  query:HOT_ITEMS; exportSummaryToBigQuery:true; streamTimeout:60
  0006  query:AVERAGE_SELLING_PRICE_BY_SELLER; exportSummaryToBigQuery:true; numEvents:10000; streamTimeout:60
  0007  query:HIGHEST_BID; exportSummaryToBigQuery:true; streamTimeout:60
  0008  query:MONITOR_NEW_USERS; exportSummaryToBigQuery:true; streamTimeout:60
  0009  query:WINNING_BIDS; exportSummaryToBigQuery:true; numEvents:10000; streamTimeout:60
  0010  query:LOG_TO_SHARDED_FILES; exportSummaryToBigQuery:true; streamTimeout:60
  0011  query:USER_SESSIONS; exportSummaryToBigQuery:true; streamTimeout:60
  0012  query:PROCESSING_TIME_WINDOWS; exportSummaryToBigQuery:true; streamTimeout:60
  0013  query:PORTABILITY_BATCH; exportSummaryToBigQuery:true; streamTimeout:60
  0014  query:BOUNDED_SIDE_INPUT_JOIN; exportSummaryToBigQuery:true; streamTimeout:60
  0015  query:SESSION_SIDE_INPUT_JOIN; exportSummaryToBigQuery:true; streamTimeout:60

Performance:
  Conf  Runtime(sec)    (Baseline)  Events(/sec)    (Baseline)       Results    (Baseline)
  0000           1.7                     59312.0                       92000              
  0001           0.8                    125470.5                       92000              
  0002           0.7                    134589.5                         351              
  0003           2.2                     90538.7                         580              
  0004  *** not run ***
  0005  *** not run ***
  0006  *** not run ***
  0007           4.0                     50620.1                           1              
  0008  *** not run ***
Exception in thread "main"   0009  *** not run ***
  0010  *** not run ***
  0011  *** not run ***
  0012  *** not run ***
  0013  *** not run ***
  0014           1.6                     61652.3                       92000              
  0015  *** not run ***
==========================================================================================

com.google.cloud.bigquery.BigQueryException: 502 Bad Gateway
POST https://www.googleapis.com/bigquery/v2/projects/apache-beam-testing/datasets/nexmark/tables/nexmark_3_sql_SparkStructuredStreamingRunner_batch/insertAll?prettyPrint=false
<!DOCTYPE html>
<html lang=en>
  <meta charset=utf-8>
  <meta name=viewport content="initial-scale=1, minimum-scale=1, width=device-width">
  <title>Error 502 (Server Error)!!1</title>
  <style>
    *{margin:0;padding:0}html,code{font:15px/22px arial,sans-serif}html{background:#fff;color:#222;padding:15px}body{margin:7% auto 0;max-width:390px;min-height:180px;padding:30px 0 15px}* > body{background:url(//www.google.com/images/errors/robot.png) 100% 5px no-repeat;padding-right:205px}p{margin:11px 0 22px;overflow:hidden}ins{color:#777;text-decoration:none}a img{border:0}@media screen and (max-width:772px){body{background:none;margin-top:0;max-width:none;padding-right:0}}#logo{background:url(//www.google.com/images/branding/googlelogo/1x/googlelogo_color_150x54dp.png) no-repeat;margin-left:-5px}@media only screen and (min-resolution:192dpi){#logo{background:url(//www.google.com/images/branding/googlelogo/2x/googlelogo_color_150x54dp.png) no-repeat 0% 0%/100% 100%;-moz-border-image:url(//www.google.com/images/branding/googlelogo/2x/googlelogo_color_150x54dp.png) 0}}@media only screen and (-webkit-min-device-pixel-ratio:2){#logo{background:url(//www.google.com/images/branding/googlelogo/2x/googlelogo_color_150x54dp.png) no-repeat;-webkit-background-size:100% 100%}}#logo{display:inline-block;height:54px;width:150px}
  </style>
  <a href=//www.google.com/><span id=logo aria-label=Google></span></a>
  <p><b>502.</b> <ins>That’s an error.</ins>
  <p>The server encountered a temporary error and could not complete your request.<p>Please try again in 30 seconds.  <ins>That’s all we know.</ins>

	at com.google.cloud.bigquery.spi.v2.HttpBigQueryRpc.translate(HttpBigQueryRpc.java:115)
	at com.google.cloud.bigquery.spi.v2.HttpBigQueryRpc.insertAll(HttpBigQueryRpc.java:494)
	at com.google.cloud.bigquery.BigQueryImpl.insertAll(BigQueryImpl.java:1065)
	at org.apache.beam.sdk.testutils.publishing.BigQueryClient.insertAll(BigQueryClient.java:123)
	at org.apache.beam.sdk.testutils.publishing.BigQueryClient.insertRow(BigQueryClient.java:98)
	at org.apache.beam.sdk.testutils.publishing.BigQueryClient.insertRow(BigQueryClient.java:89)
	at org.apache.beam.sdk.testutils.publishing.BigQueryResultsPublisher.publish(BigQueryResultsPublisher.java:47)
	at org.apache.beam.sdk.nexmark.Main.savePerfsToBigQuery(Main.java:203)
	at org.apache.beam.sdk.nexmark.Main.runAll(Main.java:164)
	at org.apache.beam.sdk.nexmark.Main.main(Main.java:495)
Caused by: com.google.api.client.googleapis.json.GoogleJsonResponseException: 502 Bad Gateway
POST https://www.googleapis.com/bigquery/v2/projects/apache-beam-testing/datasets/nexmark/tables/nexmark_3_sql_SparkStructuredStreamingRunner_batch/insertAll?prettyPrint=false
<!DOCTYPE html>
<html lang=en>
  <meta charset=utf-8>
  <meta name=viewport content="initial-scale=1, minimum-scale=1, width=device-width">
  <title>Error 502 (Server Error)!!1</title>
  <style>
    *{margin:0;padding:0}html,code{font:15px/22px arial,sans-serif}html{background:#fff;color:#222;padding:15px}body{margin:7% auto 0;max-width:390px;min-height:180px;padding:30px 0 15px}* > body{background:url(//www.google.com/images/errors/robot.png) 100% 5px no-repeat;padding-right:205px}p{margin:11px 0 22px;overflow:hidden}ins{color:#777;text-decoration:none}a img{border:0}@media screen and (max-width:772px){body{background:none;margin-top:0;max-width:none;padding-right:0}}#logo{background:url(//www.google.com/images/branding/googlelogo/1x/googlelogo_color_150x54dp.png) no-repeat;margin-left:-5px}@media only screen and (min-resolution:192dpi){#logo{background:url(//www.google.com/images/branding/googlelogo/2x/googlelogo_color_150x54dp.png) no-repeat 0% 0%/100% 100%;-moz-border-image:url(//www.google.com/images/branding/googlelogo/2x/googlelogo_color_150x54dp.png) 0}}@media only screen and (-webkit-min-device-pixel-ratio:2){#logo{background:url(//www.google.com/images/branding/googlelogo/2x/googlelogo_color_150x54dp.png) no-repeat;-webkit-background-size:100% 100%}}#logo{display:inline-block;height:54px;width:150px}
  </style>
  <a href=//www.google.com/><span id=logo aria-label=Google></span></a>
  <p><b>502.</b> <ins>That’s an error.</ins>
  <p>The server encountered a temporary error and could not complete your request.<p>Please try again in 30 seconds.  <ins>That’s all we know.</ins>

	at com.google.api.client.googleapis.json.GoogleJsonResponseException.from(GoogleJsonResponseException.java:146)
	at com.google.api.client.googleapis.services.json.AbstractGoogleJsonClientRequest.newExceptionOnError(AbstractGoogleJsonClientRequest.java:118)
	at com.google.api.client.googleapis.services.json.AbstractGoogleJsonClientRequest.newExceptionOnError(AbstractGoogleJsonClientRequest.java:37)
	at com.google.api.client.googleapis.services.AbstractGoogleClientRequest$1.interceptResponse(AbstractGoogleClientRequest.java:428)
	at com.google.api.client.http.HttpRequest.execute(HttpRequest.java:1111)
	at com.google.api.client.googleapis.services.AbstractGoogleClientRequest.executeUnparsed(AbstractGoogleClientRequest.java:514)
	at com.google.api.client.googleapis.services.AbstractGoogleClientRequest.executeUnparsed(AbstractGoogleClientRequest.java:455)
	at com.google.api.client.googleapis.services.AbstractGoogleClientRequest.execute(AbstractGoogleClientRequest.java:565)
	at com.google.cloud.bigquery.spi.v2.HttpBigQueryRpc.insertAll(HttpBigQueryRpc.java:492)
	... 8 more
21/10/21 00:38:43 DEBUG org.apache.hadoop.util.ShutdownHookManager: Completed shutdown in 0.007 seconds; Timeouts: 0
21/10/21 00:38:43 DEBUG org.apache.hadoop.util.ShutdownHookManager: ShutdownHookManger completed shutdown.

> Task :sdks:java:testing:nexmark:run FAILED

FAILURE: Build failed with an exception.

* What went wrong:
Execution failed for task ':sdks:java:testing:nexmark:run'.
> Process 'command '/usr/lib/jvm/java-8-openjdk-amd64/bin/java'' finished with non-zero exit value 1

* Try:
Run with --stacktrace option to get the stack trace. Run with --info or --debug option to get more log output. Run with --scan to get full insights.

* Get more help at https://help.gradle.org

Deprecated Gradle features were used in this build, making it incompatible with Gradle 7.0.
Use '--warning-mode all' to show the individual deprecation warnings.
See https://docs.gradle.org/6.9.1/userguide/command_line_interface.html#sec:command_line_warnings

BUILD FAILED in 32s
111 actionable tasks: 2 executed, 109 up-to-date

Publishing build scan...
https://gradle.com/s/cpdi5inffux5g

Build step 'Invoke Gradle script' changed build result to FAILURE
Build step 'Invoke Gradle script' marked build as failure

---------------------------------------------------------------------
To unsubscribe, e-mail: builds-unsubscribe@beam.apache.org
For additional commands, e-mail: builds-help@beam.apache.org


Jenkins build is back to normal : beam_PostCommit_Java_Nexmark_Spark #7595

Posted by Apache Jenkins Server <je...@builds.apache.org>.
See <https://ci-beam.apache.org/job/beam_PostCommit_Java_Nexmark_Spark/7595/display/redirect?page=changes>


---------------------------------------------------------------------
To unsubscribe, e-mail: builds-unsubscribe@beam.apache.org
For additional commands, e-mail: builds-help@beam.apache.org