You are viewing a plain text version of this content. The canonical link for it is here.
Posted to notifications@maven.apache.org by Apache Jenkins Server <je...@builds.apache.org> on 2019/04/23 19:42:01 UTC

Build failed in Jenkins: Maven TLP » maven-dist-tool » master #68

See https://builds.apache.org/job/maven-box/job/maven-dist-tool/job/master/68/

No changes.

All tests passed

Build log:
[...truncated 4869 lines...]
[2019-04-23T19:42:00.484Z] IOException try 3 while reading http://www.apache.org/dist/maven/maven-3/3.6.1/sources: class org.jsoup.HttpStatusException HTTP error fetching URL
[2019-04-23T19:42:00.484Z] [INFO] ------------------------------------------------------------------------
[2019-04-23T19:42:00.484Z] [INFO] BUILD FAILURE
[2019-04-23T19:42:00.484Z] [INFO] ------------------------------------------------------------------------
[2019-04-23T19:42:00.484Z] [INFO] Total time:  02:26 min
[2019-04-23T19:42:00.484Z] [INFO] Finished at: 2019-04-23T19:42:00Z
[2019-04-23T19:42:00.484Z] [INFO] ------------------------------------------------------------------------
[2019-04-23T19:42:00.484Z] [WARNING] The requested profile "apache.snapshots" could not be activated because it does not exist.
[2019-04-23T19:42:00.484Z] [INFO] [jenkins-event-spy] Generated /home/jenkins/jenkins-slave/workspace/maven-box_maven-dist-tool_master@tmp/withMavena1adfc06/maven-spy-20190423-193933-7658534968882507794254.log
[2019-04-23T19:42:00.484Z] [ERROR] Failed to execute goal org.apache.maven.plugins:maven-site-plugin:3.7.1:site (default-site) on project dist-tool-plugin: Error generating dist-tool-plugin:1.0-SNAPSHOT:check-source-release report: IOException while reading http://www.apache.org/dist/maven/maven-3/3.6.1/sources: HTTP error fetching URL -> [Help 1]
[2019-04-23T19:42:00.485Z] org.apache.maven.lifecycle.LifecycleExecutionException: Failed to execute goal org.apache.maven.plugins:maven-site-plugin:3.7.1:site (default-site) on project dist-tool-plugin: Error generating dist-tool-plugin:1.0-SNAPSHOT:check-source-release report
[2019-04-23T19:42:00.485Z]     at org.apache.maven.lifecycle.internal.MojoExecutor.execute (MojoExecutor.java:215)
[2019-04-23T19:42:00.485Z]     at org.apache.maven.lifecycle.internal.MojoExecutor.execute (MojoExecutor.java:156)
[2019-04-23T19:42:00.485Z]     at org.apache.maven.lifecycle.internal.MojoExecutor.execute (MojoExecutor.java:148)
[2019-04-23T19:42:00.485Z]     at org.apache.maven.lifecycle.internal.LifecycleModuleBuilder.buildProject (LifecycleModuleBuilder.java:117)
[2019-04-23T19:42:00.485Z]     at org.apache.maven.lifecycle.internal.LifecycleModuleBuilder.buildProject (LifecycleModuleBuilder.java:81)
[2019-04-23T19:42:00.485Z]     at org.apache.maven.lifecycle.internal.builder.singlethreaded.SingleThreadedBuilder.build (SingleThreadedBuilder.java:56)
[2019-04-23T19:42:00.485Z]     at org.apache.maven.lifecycle.internal.LifecycleStarter.execute (LifecycleStarter.java:128)
[2019-04-23T19:42:00.485Z]     at org.apache.maven.DefaultMaven.doExecute (DefaultMaven.java:305)
[2019-04-23T19:42:00.485Z]     at org.apache.maven.DefaultMaven.doExecute (DefaultMaven.java:192)
[2019-04-23T19:42:00.485Z]     at org.apache.maven.DefaultMaven.execute (DefaultMaven.java:105)
[2019-04-23T19:42:00.485Z]     at org.apache.maven.cli.MavenCli.execute (MavenCli.java:956)
[2019-04-23T19:42:00.485Z]     at org.apache.maven.cli.MavenCli.doMain (MavenCli.java:288)
[2019-04-23T19:42:00.485Z]     at org.apache.maven.cli.MavenCli.main (MavenCli.java:192)
[2019-04-23T19:42:00.485Z]     at sun.reflect.NativeMethodAccessorImpl.invoke0 (Native Method)
[2019-04-23T19:42:00.485Z]     at sun.reflect.NativeMethodAccessorImpl.invoke (NativeMethodAccessorImpl.java:62)
[2019-04-23T19:42:00.485Z]     at sun.reflect.DelegatingMethodAccessorImpl.invoke (DelegatingMethodAccessorImpl.java:43)
[2019-04-23T19:42:00.485Z]     at java.lang.reflect.Method.invoke (Method.java:498)
[2019-04-23T19:42:00.485Z]     at org.codehaus.plexus.classworlds.launcher.Launcher.launchEnhanced (Launcher.java:289)
[2019-04-23T19:42:00.485Z]     at org.codehaus.plexus.classworlds.launcher.Launcher.launch (Launcher.java:229)
[2019-04-23T19:42:00.485Z]     at org.codehaus.plexus.classworlds.launcher.Launcher.mainWithExitCode (Launcher.java:415)
[2019-04-23T19:42:00.485Z]     at org.codehaus.plexus.classworlds.launcher.Launcher.main (Launcher.java:356)
[2019-04-23T19:42:00.485Z] Caused by: org.apache.maven.plugin.MojoExecutionException: Error generating dist-tool-plugin:1.0-SNAPSHOT:check-source-release report
[2019-04-23T19:42:00.485Z]     at org.apache.maven.plugins.site.render.SiteMojo.execute (SiteMojo.java:155)
[2019-04-23T19:42:00.485Z]     at org.apache.maven.plugin.DefaultBuildPluginManager.executeMojo (DefaultBuildPluginManager.java:137)
[2019-04-23T19:42:00.485Z]     at org.apache.maven.lifecycle.internal.MojoExecutor.execute (MojoExecutor.java:210)
[2019-04-23T19:42:00.485Z]     at org.apache.maven.lifecycle.internal.MojoExecutor.execute (MojoExecutor.java:156)
[2019-04-23T19:42:00.485Z]     at org.apache.maven.lifecycle.internal.MojoExecutor.execute (MojoExecutor.java:148)
[2019-04-23T19:42:00.485Z]     at org.apache.maven.lifecycle.internal.LifecycleModuleBuilder.buildProject (LifecycleModuleBuilder.java:117)
[2019-04-23T19:42:00.485Z]     at org.apache.maven.lifecycle.internal.LifecycleModuleBuilder.buildProject (LifecycleModuleBuilder.java:81)
[2019-04-23T19:42:00.485Z]     at org.apache.maven.lifecycle.internal.builder.singlethreaded.SingleThreadedBuilder.build (SingleThreadedBuilder.java:56)
[2019-04-23T19:42:00.485Z]     at org.apache.maven.lifecycle.internal.LifecycleStarter.execute (LifecycleStarter.java:128)
[2019-04-23T19:42:00.485Z]     at org.apache.maven.DefaultMaven.doExecute (DefaultMaven.java:305)
[2019-04-23T19:42:00.485Z]     at org.apache.maven.DefaultMaven.doExecute (DefaultMaven.java:192)
[2019-04-23T19:42:00.486Z]     at org.apache.maven.DefaultMaven.execute (DefaultMaven.java:105)
[2019-04-23T19:42:00.486Z]     at org.apache.maven.cli.MavenCli.execute (MavenCli.java:956)
[2019-04-23T19:42:00.486Z]     at org.apache.maven.cli.MavenCli.doMain (MavenCli.java:288)
[2019-04-23T19:42:00.486Z]     at org.apache.maven.cli.MavenCli.main (MavenCli.java:192)
[2019-04-23T19:42:00.486Z]     at sun.reflect.NativeMethodAccessorImpl.invoke0 (Native Method)
[2019-04-23T19:42:00.486Z]     at sun.reflect.NativeMethodAccessorImpl.invoke (NativeMethodAccessorImpl.java:62)
[2019-04-23T19:42:00.486Z]     at sun.reflect.DelegatingMethodAccessorImpl.invoke (DelegatingMethodAccessorImpl.java:43)
[2019-04-23T19:42:00.486Z]     at java.lang.reflect.Method.invoke (Method.java:498)
[2019-04-23T19:42:00.486Z]     at org.codehaus.plexus.classworlds.launcher.Launcher.launchEnhanced (Launcher.java:289)
[2019-04-23T19:42:00.486Z]     at org.codehaus.plexus.classworlds.launcher.Launcher.launch (Launcher.java:229)
[2019-04-23T19:42:00.486Z]     at org.codehaus.plexus.classworlds.launcher.Launcher.mainWithExitCode (Launcher.java:415)
[2019-04-23T19:42:00.486Z]     at org.codehaus.plexus.classworlds.launcher.Launcher.main (Launcher.java:356)
[2019-04-23T19:42:00.486Z] Caused by: org.apache.maven.reporting.MavenReportException: IOException while reading http://www.apache.org/dist/maven/maven-3/3.6.1/sources
[2019-04-23T19:42:00.486Z]     at org.apache.maven.dist.tools.source.DistCheckSourceReleaseMojo.executeReport (DistCheckSourceReleaseMojo.java:267)
[2019-04-23T19:42:00.486Z]     at org.apache.maven.reporting.AbstractMavenReport.generate (AbstractMavenReport.java:251)
[2019-04-23T19:42:00.486Z]     at org.apache.maven.plugins.site.render.ReportDocumentRenderer.renderDocument (ReportDocumentRenderer.java:230)
[2019-04-23T19:42:00.486Z]     at org.apache.maven.doxia.siterenderer.DefaultSiteRenderer.render (DefaultSiteRenderer.java:349)
[2019-04-23T19:42:00.486Z]     at org.apache.maven.plugins.site.render.SiteMojo.renderLocale (SiteMojo.java:198)
[2019-04-23T19:42:00.486Z]     at org.apache.maven.plugins.site.render.SiteMojo.execute (SiteMojo.java:147)
[2019-04-23T19:42:00.486Z]     at org.apache.maven.plugin.DefaultBuildPluginManager.executeMojo (DefaultBuildPluginManager.java:137)
[2019-04-23T19:42:00.486Z]     at org.apache.maven.lifecycle.internal.MojoExecutor.execute (MojoExecutor.java:210)
[2019-04-23T19:42:00.486Z]     at org.apache.maven.lifecycle.internal.MojoExecutor.execute (MojoExecutor.java:156)
[2019-04-23T19:42:00.486Z]     at org.apache.maven.lifecycle.internal.MojoExecutor.execute (MojoExecutor.java:148)
[2019-04-23T19:42:00.486Z]     at org.apache.maven.lifecycle.internal.LifecycleModuleBuilder.buildProject (LifecycleModuleBuilder.java:117)
[2019-04-23T19:42:00.486Z]     at org.apache.maven.lifecycle.internal.LifecycleModuleBuilder.buildProject (LifecycleModuleBuilder.java:81)
[2019-04-23T19:42:00.486Z]     at org.apache.maven.lifecycle.internal.builder.singlethreaded.SingleThreadedBuilder.build (SingleThreadedBuilder.java:56)
[2019-04-23T19:42:00.486Z]     at org.apache.maven.lifecycle.internal.LifecycleStarter.execute (LifecycleStarter.java:128)
[2019-04-23T19:42:00.486Z]     at org.apache.maven.DefaultMaven.doExecute (DefaultMaven.java:305)
[2019-04-23T19:42:00.486Z]     at org.apache.maven.DefaultMaven.doExecute (DefaultMaven.java:192)
[2019-04-23T19:42:00.486Z]     at org.apache.maven.DefaultMaven.execute (DefaultMaven.java:105)
[2019-04-23T19:42:00.486Z]     at org.apache.maven.cli.MavenCli.execute (MavenCli.java:956)
[2019-04-23T19:42:00.486Z]     at org.apache.maven.cli.MavenCli.doMain (MavenCli.java:288)
[2019-04-23T19:42:00.486Z]     at org.apache.maven.cli.MavenCli.main (MavenCli.java:192)
[2019-04-23T19:42:00.486Z]     at sun.reflect.NativeMethodAccessorImpl.invoke0 (Native Method)
[2019-04-23T19:42:00.487Z]     at sun.reflect.NativeMethodAccessorImpl.invoke (NativeMethodAccessorImpl.java:62)
[2019-04-23T19:42:00.487Z]     at sun.reflect.DelegatingMethodAccessorImpl.invoke (DelegatingMethodAccessorImpl.java:43)
[2019-04-23T19:42:00.487Z]     at java.lang.reflect.Method.invoke (Method.java:498)
[2019-04-23T19:42:00.487Z]     at org.codehaus.plexus.classworlds.launcher.Launcher.launchEnhanced (Launcher.java:289)
[2019-04-23T19:42:00.487Z]     at org.codehaus.plexus.classworlds.launcher.Launcher.launch (Launcher.java:229)
[2019-04-23T19:42:00.487Z]     at org.codehaus.plexus.classworlds.launcher.Launcher.mainWithExitCode (Launcher.java:415)
[2019-04-23T19:42:00.487Z]     at org.codehaus.plexus.classworlds.launcher.Launcher.main (Launcher.java:356)
[2019-04-23T19:42:00.487Z] Caused by: org.apache.maven.plugin.MojoExecutionException: IOException while reading http://www.apache.org/dist/maven/maven-3/3.6.1/sources
[2019-04-23T19:42:00.487Z]     at org.apache.maven.dist.tools.source.DistCheckSourceReleaseMojo.checkArtifact (DistCheckSourceReleaseMojo.java:562)
[2019-04-23T19:42:00.487Z]     at org.apache.maven.dist.tools.AbstractDistCheckMojo.execute (AbstractDistCheckMojo.java:268)
[2019-04-23T19:42:00.487Z]     at org.apache.maven.dist.tools.source.DistCheckSourceReleaseMojo.executeReport (DistCheckSourceReleaseMojo.java:263)
[2019-04-23T19:42:00.487Z]     at org.apache.maven.reporting.AbstractMavenReport.generate (AbstractMavenReport.java:251)
[2019-04-23T19:42:00.487Z]     at org.apache.maven.plugins.site.render.ReportDocumentRenderer.renderDocument (ReportDocumentRenderer.java:230)
[2019-04-23T19:42:00.487Z]     at org.apache.maven.doxia.siterenderer.DefaultSiteRenderer.render (DefaultSiteRenderer.java:349)
[2019-04-23T19:42:00.487Z]     at org.apache.maven.plugins.site.render.SiteMojo.renderLocale (SiteMojo.java:198)
[2019-04-23T19:42:00.487Z]     at org.apache.maven.plugins.site.render.SiteMojo.execute (SiteMojo.java:147)
[2019-04-23T19:42:00.487Z]     at org.apache.maven.plugin.DefaultBuildPluginManager.executeMojo (DefaultBuildPluginManager.java:137)
[2019-04-23T19:42:00.487Z]     at org.apache.maven.lifecycle.internal.MojoExecutor.execute (MojoExecutor.java:210)
[2019-04-23T19:42:00.487Z]     at org.apache.maven.lifecycle.internal.MojoExecutor.execute (MojoExecutor.java:156)
[2019-04-23T19:42:00.487Z]     at org.apache.maven.lifecycle.internal.MojoExecutor.execute (MojoExecutor.java:148)
[2019-04-23T19:42:00.487Z]     at org.apache.maven.lifecycle.internal.LifecycleModuleBuilder.buildProject (LifecycleModuleBuilder.java:117)
[2019-04-23T19:42:00.487Z]     at org.apache.maven.lifecycle.internal.LifecycleModuleBuilder.buildProject (LifecycleModuleBuilder.java:81)
[2019-04-23T19:42:00.487Z]     at org.apache.maven.lifecycle.internal.builder.singlethreaded.SingleThreadedBuilder.build (SingleThreadedBuilder.java:56)
[2019-04-23T19:42:00.487Z]     at org.apache.maven.lifecycle.internal.LifecycleStarter.execute (LifecycleStarter.java:128)
[2019-04-23T19:42:00.487Z]     at org.apache.maven.DefaultMaven.doExecute (DefaultMaven.java:305)
[2019-04-23T19:42:00.487Z]     at org.apache.maven.DefaultMaven.doExecute (DefaultMaven.java:192)
[2019-04-23T19:42:00.487Z]     at org.apache.maven.DefaultMaven.execute (DefaultMaven.java:105)
[2019-04-23T19:42:00.487Z]     at org.apache.maven.cli.MavenCli.execute (MavenCli.java:956)
[2019-04-23T19:42:00.487Z]     at org.apache.maven.cli.MavenCli.doMain (MavenCli.java:288)
[2019-04-23T19:42:00.487Z]     at org.apache.maven.cli.MavenCli.main (MavenCli.java:192)
[2019-04-23T19:42:00.487Z]     at sun.reflect.NativeMethodAccessorImpl.invoke0 (Native Method)
[2019-04-23T19:42:00.487Z]     at sun.reflect.NativeMethodAccessorImpl.invoke (NativeMethodAccessorImpl.java:62)
[2019-04-23T19:42:00.487Z]     at sun.reflect.DelegatingMethodAccessorImpl.invoke (DelegatingMethodAccessorImpl.java:43)
[2019-04-23T19:42:00.487Z]     at java.lang.reflect.Method.invoke (Method.java:498)
[2019-04-23T19:42:00.488Z]     at org.codehaus.plexus.classworlds.launcher.Launcher.launchEnhanced (Launcher.java:289)
[2019-04-23T19:42:00.488Z]     at org.codehaus.plexus.classworlds.launcher.Launcher.launch (Launcher.java:229)
[2019-04-23T19:42:00.488Z]     at org.codehaus.plexus.classworlds.launcher.Launcher.mainWithExitCode (Launcher.java:415)
[2019-04-23T19:42:00.488Z]     at org.codehaus.plexus.classworlds.launcher.Launcher.main (Launcher.java:356)
[2019-04-23T19:42:00.488Z] Caused by: java.io.IOException: IOException while reading http://www.apache.org/dist/maven/maven-3/3.6.1/sources
[2019-04-23T19:42:00.488Z]     at org.apache.maven.dist.tools.source.DistCheckSourceReleaseMojo.selectLinks (DistCheckSourceReleaseMojo.java:444)
[2019-04-23T19:42:00.488Z]     at org.apache.maven.dist.tools.source.DistCheckSourceReleaseMojo.checkDirectoryIndex (DistCheckSourceReleaseMojo.java:496)
[2019-04-23T19:42:00.488Z]     at org.apache.maven.dist.tools.source.DistCheckSourceReleaseMojo.checkArtifact (DistCheckSourceReleaseMojo.java:557)
[2019-04-23T19:42:00.488Z]     at org.apache.maven.dist.tools.AbstractDistCheckMojo.execute (AbstractDistCheckMojo.java:268)
[2019-04-23T19:42:00.488Z]     at org.apache.maven.dist.tools.source.DistCheckSourceReleaseMojo.executeReport (DistCheckSourceReleaseMojo.java:263)
[2019-04-23T19:42:00.488Z]     at org.apache.maven.reporting.AbstractMavenReport.generate (AbstractMavenReport.java:251)
[2019-04-23T19:42:00.488Z]     at org.apache.maven.plugins.site.render.ReportDocumentRenderer.renderDocument (ReportDocumentRenderer.java:230)
[2019-04-23T19:42:00.488Z]     at org.apache.maven.doxia.siterenderer.DefaultSiteRenderer.render (DefaultSiteRenderer.java:349)
[2019-04-23T19:42:00.488Z]     at org.apache.maven.plugins.site.render.SiteMojo.renderLocale (SiteMojo.java:198)
[2019-04-23T19:42:00.488Z]     at org.apache.maven.plugins.site.render.SiteMojo.execute (SiteMojo.java:147)
[2019-04-23T19:42:00.488Z]     at org.apache.maven.plugin.DefaultBuildPluginManager.executeMojo (DefaultBuildPluginManager.java:137)
[2019-04-23T19:42:00.488Z]     at org.apache.maven.lifecycle.internal.MojoExecutor.execute (MojoExecutor.java:210)
[2019-04-23T19:42:00.488Z]     at org.apache.maven.lifecycle.internal.MojoExecutor.execute (MojoExecutor.java:156)
[2019-04-23T19:42:00.488Z]     at org.apache.maven.lifecycle.internal.MojoExecutor.execute (MojoExecutor.java:148)
[2019-04-23T19:42:00.488Z]     at org.apache.maven.lifecycle.internal.LifecycleModuleBuilder.buildProject (LifecycleModuleBuilder.java:117)
[2019-04-23T19:42:00.488Z]     at org.apache.maven.lifecycle.internal.LifecycleModuleBuilder.buildProject (LifecycleModuleBuilder.java:81)
[2019-04-23T19:42:00.489Z]     at org.apache.maven.lifecycle.internal.builder.singlethreaded.SingleThreadedBuilder.build (SingleThreadedBuilder.java:56)
[2019-04-23T19:42:00.489Z]     at org.apache.maven.lifecycle.internal.LifecycleStarter.execute (LifecycleStarter.java:128)
[2019-04-23T19:42:00.489Z]     at org.apache.maven.DefaultMaven.doExecute (DefaultMaven.java:305)
[2019-04-23T19:42:00.489Z]     at org.apache.maven.DefaultMaven.doExecute (DefaultMaven.java:192)
[2019-04-23T19:42:00.489Z]     at org.apache.maven.DefaultMaven.execute (DefaultMaven.java:105)
[2019-04-23T19:42:00.489Z]     at org.apache.maven.cli.MavenCli.execute (MavenCli.java:956)
[2019-04-23T19:42:00.489Z]     at org.apache.maven.cli.MavenCli.doMain (MavenCli.java:288)
[2019-04-23T19:42:00.489Z]     at org.apache.maven.cli.MavenCli.main (MavenCli.java:192)
[2019-04-23T19:42:00.489Z]     at sun.reflect.NativeMethodAccessorImpl.invoke0 (Native Method)
[2019-04-23T19:42:00.489Z]     at sun.reflect.NativeMethodAccessorImpl.invoke (NativeMethodAccessorImpl.java:62)
[2019-04-23T19:42:00.489Z]     at sun.reflect.DelegatingMethodAccessorImpl.invoke (DelegatingMethodAccessorImpl.java:43)
[2019-04-23T19:42:00.489Z]     at java.lang.reflect.Method.invoke (Method.java:498)
[2019-04-23T19:42:00.489Z]     at org.codehaus.plexus.classworlds.launcher.Launcher.launchEnhanced (Launcher.java:289)
[2019-04-23T19:42:00.489Z]     at org.codehaus.plexus.classworlds.launcher.Launcher.launch (Launcher.java:229)
[2019-04-23T19:42:00.489Z]     at org.codehaus.plexus.classworlds.launcher.Launcher.mainWithExitCode (Launcher.java:415)
[2019-04-23T19:42:00.489Z]     at org.codehaus.plexus.classworlds.launcher.Launcher.main (Launcher.java:356)
[2019-04-23T19:42:00.489Z] Caused by: java.io.IOException: IOException while reading http://www.apache.org/dist/maven/maven-3/3.6.1/sources
[2019-04-23T19:42:00.489Z]     at org.apache.maven.dist.tools.JsoupRetry.get (JsoupRetry.java:52)
[2019-04-23T19:42:00.489Z]     at org.apache.maven.dist.tools.source.DistCheckSourceReleaseMojo.read (DistCheckSourceReleaseMojo.java:425)
[2019-04-23T19:42:00.489Z]     at org.apache.maven.dist.tools.source.DistCheckSourceReleaseMojo.selectLinks (DistCheckSourceReleaseMojo.java:440)
[2019-04-23T19:42:00.489Z]     at org.apache.maven.dist.tools.source.DistCheckSourceReleaseMojo.checkDirectoryIndex (DistCheckSourceReleaseMojo.java:496)
[2019-04-23T19:42:00.489Z]     at org.apache.maven.dist.tools.source.DistCheckSourceReleaseMojo.checkArtifact (DistCheckSourceReleaseMojo.java:557)
[2019-04-23T19:42:00.489Z]     at org.apache.maven.dist.tools.AbstractDistCheckMojo.execute (AbstractDistCheckMojo.java:268)
[2019-04-23T19:42:00.489Z]     at org.apache.maven.dist.tools.source.DistCheckSourceReleaseMojo.executeReport (DistCheckSourceReleaseMojo.java:263)
[2019-04-23T19:42:00.489Z]     at org.apache.maven.reporting.AbstractMavenReport.generate (AbstractMavenReport.java:251)
[2019-04-23T19:42:00.490Z]     at org.apache.maven.plugins.site.render.ReportDocumentRenderer.renderDocument (ReportDocumentRenderer.java:230)
[2019-04-23T19:42:00.490Z]     at org.apache.maven.doxia.siterenderer.DefaultSiteRenderer.render (DefaultSiteRenderer.java:349)
[2019-04-23T19:42:00.490Z]     at org.apache.maven.plugins.site.render.SiteMojo.renderLocale (SiteMojo.java:198)
[2019-04-23T19:42:00.490Z]     at org.apache.maven.plugins.site.render.SiteMojo.execute (SiteMojo.java:147)
[2019-04-23T19:42:00.490Z]     at org.apache.maven.plugin.DefaultBuildPluginManager.executeMojo (DefaultBuildPluginManager.java:137)
[2019-04-23T19:42:00.490Z]     at org.apache.maven.lifecycle.internal.MojoExecutor.execute (MojoExecutor.java:210)
[2019-04-23T19:42:00.490Z]     at org.apache.maven.lifecycle.internal.MojoExecutor.execute (MojoExecutor.java:156)
[2019-04-23T19:42:00.490Z]     at org.apache.maven.lifecycle.internal.MojoExecutor.execute (MojoExecutor.java:148)
[2019-04-23T19:42:00.490Z]     at org.apache.maven.lifecycle.internal.LifecycleModuleBuilder.buildProject (LifecycleModuleBuilder.java:117)
[2019-04-23T19:42:00.490Z]     at org.apache.maven.lifecycle.internal.LifecycleModuleBuilder.buildProject (LifecycleModuleBuilder.java:81)
[2019-04-23T19:42:00.490Z]     at org.apache.maven.lifecycle.internal.builder.singlethreaded.SingleThreadedBuilder.build (SingleThreadedBuilder.java:56)
[2019-04-23T19:42:00.490Z]     at org.apache.maven.lifecycle.internal.LifecycleStarter.execute (LifecycleStarter.java:128)
[2019-04-23T19:42:00.490Z]     at org.apache.maven.DefaultMaven.doExecute (DefaultMaven.java:305)
[2019-04-23T19:42:00.490Z]     at org.apache.maven.DefaultMaven.doExecute (DefaultMaven.java:192)
[2019-04-23T19:42:00.490Z]     at org.apache.maven.DefaultMaven.execute (DefaultMaven.java:105)
[2019-04-23T19:42:00.490Z]     at org.apache.maven.cli.MavenCli.execute (MavenCli.java:956)
[2019-04-23T19:42:00.490Z]     at org.apache.maven.cli.MavenCli.doMain (MavenCli.java:288)
[2019-04-23T19:42:00.490Z]     at org.apache.maven.cli.MavenCli.main (MavenCli.java:192)
[2019-04-23T19:42:00.490Z]     at sun.reflect.NativeMethodAccessorImpl.invoke0 (Native Method)
[2019-04-23T19:42:00.490Z]     at sun.reflect.NativeMethodAccessorImpl.invoke (NativeMethodAccessorImpl.java:62)
[2019-04-23T19:42:00.490Z]     at sun.reflect.DelegatingMethodAccessorImpl.invoke (DelegatingMethodAccessorImpl.java:43)
[2019-04-23T19:42:00.490Z]     at java.lang.reflect.Method.invoke (Method.java:498)
[2019-04-23T19:42:00.490Z]     at org.codehaus.plexus.classworlds.launcher.Launcher.launchEnhanced (Launcher.java:289)
[2019-04-23T19:42:00.490Z]     at org.codehaus.plexus.classworlds.launcher.Launcher.launch (Launcher.java:229)
[2019-04-23T19:42:00.490Z]     at org.codehaus.plexus.classworlds.launcher.Launcher.mainWithExitCode (Launcher.java:415)
[2019-04-23T19:42:00.490Z]     at org.codehaus.plexus.classworlds.launcher.Launcher.main (Launcher.java:356)
[2019-04-23T19:42:00.490Z] Caused by: org.jsoup.HttpStatusException: HTTP error fetching URL
[2019-04-23T19:42:00.490Z]     at org.jsoup.helper.HttpConnection$Response.execute (HttpConnection.java:435)
[2019-04-23T19:42:00.490Z]     at org.jsoup.helper.HttpConnection$Response.execute (HttpConnection.java:410)
[2019-04-23T19:42:00.490Z]     at org.jsoup.helper.HttpConnection.execute (HttpConnection.java:164)
[2019-04-23T19:42:00.490Z]     at org.jsoup.helper.HttpConnection.get (HttpConnection.java:153)
[2019-04-23T19:42:00.490Z]     at org.apache.maven.dist.tools.JsoupRetry.get (JsoupRetry.java:43)
[2019-04-23T19:42:00.490Z]     at org.apache.maven.dist.tools.source.DistCheckSourceReleaseMojo.read (DistCheckSourceReleaseMojo.java:425)
[2019-04-23T19:42:00.490Z]     at org.apache.maven.dist.tools.source.DistCheckSourceReleaseMojo.selectLinks (DistCheckSourceReleaseMojo.java:440)
[2019-04-23T19:42:00.490Z]     at org.apache.maven.dist.tools.source.DistCheckSourceReleaseMojo.checkDirectoryIndex (DistCheckSourceReleaseMojo.java:496)
[2019-04-23T19:42:00.491Z]     at org.apache.maven.dist.tools.source.DistCheckSourceReleaseMojo.checkArtifact (DistCheckSourceReleaseMojo.java:557)
[2019-04-23T19:42:00.491Z]     at org.apache.maven.dist.tools.AbstractDistCheckMojo.execute (AbstractDistCheckMojo.java:268)
[2019-04-23T19:42:00.491Z]     at org.apache.maven.dist.tools.source.DistCheckSourceReleaseMojo.executeReport (DistCheckSourceReleaseMojo.java:263)
[2019-04-23T19:42:00.491Z]     at org.apache.maven.reporting.AbstractMavenReport.generate (AbstractMavenReport.java:251)
[2019-04-23T19:42:00.491Z]     at org.apache.maven.plugins.site.render.ReportDocumentRenderer.renderDocument (ReportDocumentRenderer.java:230)
[2019-04-23T19:42:00.491Z]     at org.apache.maven.doxia.siterenderer.DefaultSiteRenderer.render (DefaultSiteRenderer.java:349)
[2019-04-23T19:42:00.491Z]     at org.apache.maven.plugins.site.render.SiteMojo.renderLocale (SiteMojo.java:198)
[2019-04-23T19:42:00.491Z]     at org.apache.maven.plugins.site.render.SiteMojo.execute (SiteMojo.java:147)
[2019-04-23T19:42:00.491Z]     at org.apache.maven.plugin.DefaultBuildPluginManager.executeMojo (DefaultBuildPluginManager.java:137)
[2019-04-23T19:42:00.491Z]     at org.apache.maven.lifecycle.internal.MojoExecutor.execute (MojoExecutor.java:210)
[2019-04-23T19:42:00.491Z]     at org.apache.maven.lifecycle.internal.MojoExecutor.execute (MojoExecutor.java:156)
[2019-04-23T19:42:00.491Z]     at org.apache.maven.lifecycle.internal.MojoExecutor.execute (MojoExecutor.java:148)
[2019-04-23T19:42:00.491Z]     at org.apache.maven.lifecycle.internal.LifecycleModuleBuilder.buildProject (LifecycleModuleBuilder.java:117)
[2019-04-23T19:42:00.491Z]     at org.apache.maven.lifecycle.internal.LifecycleModuleBuilder.buildProject (LifecycleModuleBuilder.java:81)
[2019-04-23T19:42:00.491Z]     at org.apache.maven.lifecycle.internal.builder.singlethreaded.SingleThreadedBuilder.build (SingleThreadedBuilder.java:56)
[2019-04-23T19:42:00.491Z]     at org.apache.maven.lifecycle.internal.LifecycleStarter.execute (LifecycleStarter.java:128)
[2019-04-23T19:42:00.491Z]     at org.apache.maven.DefaultMaven.doExecute (DefaultMaven.java:305)
[2019-04-23T19:42:00.491Z]     at org.apache.maven.DefaultMaven.doExecute (DefaultMaven.java:192)
[2019-04-23T19:42:00.491Z]     at org.apache.maven.DefaultMaven.execute (DefaultMaven.java:105)
[2019-04-23T19:42:00.491Z]     at org.apache.maven.cli.MavenCli.execute (MavenCli.java:956)
[2019-04-23T19:42:00.491Z]     at org.apache.maven.cli.MavenCli.doMain (MavenCli.java:288)
[2019-04-23T19:42:00.491Z]     at org.apache.maven.cli.MavenCli.main (MavenCli.java:192)
[2019-04-23T19:42:00.491Z]     at sun.reflect.NativeMethodAccessorImpl.invoke0 (Native Method)
[2019-04-23T19:42:00.491Z]     at sun.reflect.NativeMethodAccessorImpl.invoke (NativeMethodAccessorImpl.java:62)
[2019-04-23T19:42:00.491Z]     at sun.reflect.DelegatingMethodAccessorImpl.invoke (DelegatingMethodAccessorImpl.java:43)
[2019-04-23T19:42:00.491Z]     at java.lang.reflect.Method.invoke (Method.java:498)
[2019-04-23T19:42:00.491Z]     at org.codehaus.plexus.classworlds.launcher.Launcher.launchEnhanced (Launcher.java:289)
[2019-04-23T19:42:00.491Z]     at org.codehaus.plexus.classworlds.launcher.Launcher.launch (Launcher.java:229)
[2019-04-23T19:42:00.491Z]     at org.codehaus.plexus.classworlds.launcher.Launcher.mainWithExitCode (Launcher.java:415)
[2019-04-23T19:42:00.491Z]     at org.codehaus.plexus.classworlds.launcher.Launcher.main (Launcher.java:356)
[2019-04-23T19:42:00.491Z] [ERROR] 
[2019-04-23T19:42:00.491Z] [ERROR] Re-run Maven using the -X switch to enable full debug logging.
[2019-04-23T19:42:00.491Z] [ERROR] 
[2019-04-23T19:42:00.491Z] [ERROR] For more information about the errors and possible solutions, please read the following articles:
[2019-04-23T19:42:00.491Z] [ERROR] [Help 1] http://cwiki.apache.org/confluence/display/MAVEN/MojoExecutionException
[Pipeline] }
[2019-04-23T19:42:00.697Z] [withMaven] junitPublisher - Archive test results for Maven artifact org.apache.maven.dist.tools:dist-tool-plugin:maven-plugin:1.0-SNAPSHOT generated by maven-surefire-plugin:test (default-test): target/surefire-reports/*.xml
[2019-04-23T19:42:00.697Z] Recording test results
[2019-04-23T19:42:00.766Z] [withMaven] junitPublisher - Archive test results for Maven artifact org.apache.maven.dist.tools:dist-tool-plugin:maven-plugin:1.0-SNAPSHOT generated by maven-surefire-plugin:test (default-test): target/surefire-reports/*.xml
[2019-04-23T19:42:00.766Z] Recording test results
[2019-04-23T19:42:00.980Z] [withMaven] openTasksPublisher - Scan Tasks for Maven artifact org.apache.maven.dist.tools:dist-tool-plugin:maven-plugin:1.0-SNAPSHOT in source directory src/main/java
[2019-04-23T19:42:01.064Z] [TASKS] Scanning folder '/home/jenkins/jenkins-slave/workspace/maven-box_maven-dist-tool_master' for files matching the pattern 'src/main/java/**/*' - excludes: null
[2019-04-23T19:42:01.064Z] [TASKS] Found 22 files to scan for tasks
[2019-04-23T19:42:01.064Z] [TASKS] Found 2 open tasks.
[2019-04-23T19:42:01.064Z] Skipping warnings blame since pipelines do not have an SCM link.%n
[2019-04-23T19:42:01.102Z] [TASKS] Computing warning deltas based on reference build #66
[2019-04-23T19:42:01.118Z] [withMaven] Publishers: Pipeline Graph Publisher: 3 ms, Junit Publisher: 150 ms, Dependencies Fingerprint Publisher: 1 ms, JGiven Publisher: 1 ms, Open Task Scanner Publisher: 151 ms
[Pipeline] // withMaven
[Pipeline] }
[Pipeline] // stage
[Pipeline] stage
[Pipeline] { (Declarative: Post Actions)
[Pipeline] echo
[2019-04-23T19:42:01.339Z] Build result: FAILURE
[Pipeline] jiraIssueSelector
[Pipeline] emailext

Build succeeded in Jenkins: Maven TLP » maven-dist-tool » master #69

Posted by Apache Jenkins Server <je...@builds.apache.org>.
See https://builds.apache.org/job/maven-box/job/maven-dist-tool/job/master/69/

Changes:

* Revert "Maven 3.6.1 sources ended up in different directory. Only

All tests passed