You are viewing a plain text version of this content. The canonical link for it is here.
Posted to notifications@maven.apache.org by "Continuum@maven.zones.apache.org" <co...@maven.zones.apache.org> on 2007/09/19 18:24:10 UTC

[continuum] BUILD FAILURE: Continuum XMLRPC :: Server

Online report : http://maven.zones.apache.org/continuum/buildResult.action?buildId=23144&projectId=306

Build statistics:
  State: Failed
  Previous State: Error
  Started at: Wed 19 Sep 2007 16:24:04 +0000
  Finished at: Wed 19 Sep 2007 16:24:07 +0000
  Total time: 3s
  Build Trigger: Schedule
  Build Number: 126
  Exit code: 1
  Building machine hostname: maven.zones.apache.org
  Operating system : SunOS(unknown)
  Java Home version : 
          java version "1.5.0_12"
          Java(TM) 2 Runtime Environment, Standard Edition (build 1.5.0_12-b04)
          Java HotSpot(TM) Server VM (build 1.5.0_12-b04, mixed mode)
        
  Builder version :
          Maven version: 2.0.7
          Java version: 1.5.0_12
          OS name: "sunos" version: "5.10" arch: "x86"
    
****************************************************************************
SCM Changes:
****************************************************************************
No files changed

****************************************************************************
Dependencies Changes:
****************************************************************************
org.apache.maven.continuum:continuum-security:1.1-beta-3-SNAPSHOT

****************************************************************************
Test Summary:
****************************************************************************
Tests: 0
Failures: 0
Total time: 0

****************************************************************************
Output:
****************************************************************************
[INFO] Scanning for projects...
[INFO] ------------------------------------------------------------------------
[ERROR] FATAL ERROR
[INFO] ------------------------------------------------------------------------
[INFO] Failed to resolve artifact.

GroupId: org.apache.maven.continuum
ArtifactId: continuum-xmlrpc
Version: 1.1-beta-4-SNAPSHOT

Reason: Unable to download the artifact from any repository

  org.apache.maven.continuum:continuum-xmlrpc:pom:1.1-beta-4-SNAPSHOT

from the specified remote repositories:
  central (http://repo1.maven.org/maven2)


[INFO] ------------------------------------------------------------------------
[INFO] Trace
org.apache.maven.reactor.MavenExecutionException: Cannot find parent: org.apache.maven.continuum:continuum-xmlrpc for project: null:continuum-xmlrpc-server:jar:null for project null:continuum-xmlrpc-server:jar:null
	at org.apache.maven.DefaultMaven.getProjects(DefaultMaven.java:378)
	at org.apache.maven.DefaultMaven.doExecute(DefaultMaven.java:290)
	at org.apache.maven.DefaultMaven.execute(DefaultMaven.java:125)
	at org.apache.maven.cli.MavenCli.main(MavenCli.java:280)
	at sun.reflect.NativeMethodAccessorImpl.invoke0(Native Method)
	at sun.reflect.NativeMethodAccessorImpl.invoke(NativeMethodAccessorImpl.java:39)
	at sun.reflect.DelegatingMethodAccessorImpl.invoke(DelegatingMethodAccessorImpl.java:25)
	at java.lang.reflect.Method.invoke(Method.java:585)
	at org.codehaus.classworlds.Launcher.launchEnhanced(Launcher.java:315)
	at org.codehaus.classworlds.Launcher.launch(Launcher.java:255)
	at org.codehaus.classworlds.Launcher.mainWithExitCode(Launcher.java:430)
	at org.codehaus.classworlds.Launcher.main(Launcher.java:375)
Caused by: org.apache.maven.project.ProjectBuildingException: Cannot find parent: org.apache.maven.continuum:continuum-xmlrpc for project: null:continuum-xmlrpc-server:jar:null for project null:continuum-xmlrpc-server:jar:null
	at org.apache.maven.project.DefaultMavenProjectBuilder.assembleLineage(DefaultMavenProjectBuilder.java:1261)
	at org.apache.maven.project.DefaultMavenProjectBuilder.buildInternal(DefaultMavenProjectBuilder.java:747)
	at org.apache.maven.project.DefaultMavenProjectBuilder.buildFromSourceFileInternal(DefaultMavenProjectBuilder.java:479)
	at org.apache.maven.project.DefaultMavenProjectBuilder.build(DefaultMavenProjectBuilder.java:200)
	at org.apache.maven.DefaultMaven.getProject(DefaultMaven.java:553)
	at org.apache.maven.DefaultMaven.collectProjects(DefaultMaven.java:467)
	at org.apache.maven.DefaultMaven.getProjects(DefaultMaven.java:364)
	... 11 more
Caused by: org.apache.maven.project.ProjectBuildingException: POM 'org.apache.maven.continuum:continuum-xmlrpc' not found in repository: Unable to download the artifact from any repository

  org.apache.maven.continuum:continuum-xmlrpc:pom:1.1-beta-4-SNAPSHOT

from the specified remote repositories:
  central (http://repo1.maven.org/maven2)
 for project org.apache.maven.continuum:continuum-xmlrpc
	at org.apache.maven.project.DefaultMavenProjectBuilder.findModelFromRepository(DefaultMavenProjectBuilder.java:573)
	at org.apache.maven.project.DefaultMavenProjectBuilder.assembleLineage(DefaultMavenProjectBuilder.java:1257)
	... 17 more
Caused by: org.apache.maven.artifact.resolver.ArtifactNotFoundException: Unable to download the artifact from any repository

  org.apache.maven.continuum:continuum-xmlrpc:pom:1.1-beta-4-SNAPSHOT

from the specified remote repositories:
  central (http://repo1.maven.org/maven2)

	at org.apache.maven.artifact.resolver.DefaultArtifactResolver.resolve(DefaultArtifactResolver.java:197)
	at org.apache.maven.artifact.resolver.DefaultArtifactResolver.resolve(DefaultArtifactResolver.java:73)
	at org.apache.maven.project.DefaultMavenProjectBuilder.findModelFromRepository(DefaultMavenProjectBuilder.java:526)
	... 18 more
Caused by: org.apache.maven.wagon.ResourceDoesNotExistException: Unable to download the artifact from any repository
	at org.apache.maven.artifact.manager.DefaultWagonManager.getArtifact(DefaultWagonManager.java:324)
	at org.apache.maven.artifact.resolver.DefaultArtifactResolver.resolve(DefaultArtifactResolver.java:185)
	... 20 more
[INFO] ------------------------------------------------------------------------
[INFO] Total time: < 1 second
[INFO] Finished at: Wed Sep 19 16:24:07 GMT+00:00 2007
[INFO] Final Memory: 1M/254M
[INFO] ------------------------------------------------------------------------

****************************************************************************