You are viewing a plain text version of this content. The canonical link for it is here.
Posted to yarn-dev@hadoop.apache.org by Apache Jenkins Server <je...@builds.apache.org> on 2015/04/10 19:20:29 UTC

Failed: YARN-3134 PreCommit Build #7298

Jira: https://issues.apache.org/jira/browse/YARN-3134
Build: https://builds.apache.org/job/PreCommit-YARN-Build/7298/

###################################################################################
########################## LAST 60 LINES OF THE CONSOLE ###########################
[...truncated 20 lines...]
[PreCommit-YARN-Build] $ /bin/bash /tmp/hudson5985134195084030166.sh
Running in Jenkins mode


======================================================================
======================================================================
    Testing patch for YARN-3134.
======================================================================
======================================================================


HEAD is now at 577d755 YARN-3348. Add a 'yarn top' tool to help understand cluster usage. Contributed by Varun Vasudev
Switched to branch 'trunk'
Your branch is up-to-date with 'origin/trunk'.
Current branch trunk is up to date.
YARN-3134 patch is being downloaded at Fri Apr 10 17:20:24 UTC 2015 from
http://issues.apache.org/jira/secure/attachment/12724348/YARN-3134-040915_poc.patch
cp: cannot stat '/home/jenkins/buildSupport/lib/*': No such file or directory
The patch does not appear to apply with p0 to p2
PATCH APPLICATION FAILED




{color:red}-1 overall{color}.  Here are the results of testing the latest attachment 
  http://issues.apache.org/jira/secure/attachment/12724348/YARN-3134-040915_poc.patch
  against trunk revision 577d755.

    {color:red}-1 patch{color}.  The patch command could not apply the patch.

Console output: https://builds.apache.org/job/PreCommit-YARN-Build/7298//console

This message is automatically generated.


======================================================================
======================================================================
    Adding comment to Jira.
======================================================================
======================================================================


Comment added.
6efd98512f04beb7a6462f5a1ffe17eed2379d39 logged out


======================================================================
======================================================================
    Finished build.
======================================================================
======================================================================


Build step 'Execute shell' marked build as failure
Archiving artifacts
[description-setter] Could not determine description.
Recording test results
Email was triggered for: Failure
Sending email for trigger: Failure



###################################################################################
############################## FAILED TESTS (if any) ##############################
No tests ran.

Success: YARN-3410 PreCommit Build #7302

Posted by Apache Jenkins Server <je...@builds.apache.org>.
Jira: https://issues.apache.org/jira/browse/YARN-3410
Build: https://builds.apache.org/job/PreCommit-YARN-Build/7302/

###################################################################################
########################## LAST 60 LINES OF THE CONSOLE ###########################
[...truncated 3562 lines...]




{color:green}+1 overall{color}.  Here are the results of testing the latest attachment 
  http://issues.apache.org/jira/secure/attachment/12724617/0002-YARN-3410.patch
  against trunk revision e516706.

    {color:green}+1 @author{color}.  The patch does not contain any @author tags.

    {color:green}+1 tests included{color}.  The patch appears to include 4 new or modified test files.

    {color:green}+1 javac{color}.  The applied patch does not increase the total number of javac compiler warnings.

    {color:green}+1 javadoc{color}.  There were no new javadoc warning messages.

    {color:green}+1 eclipse:eclipse{color}.  The patch built with eclipse:eclipse.

    {color:green}+1 findbugs{color}.  The patch does not introduce any new Findbugs (version 2.0.3) warnings.

    {color:green}+1 release audit{color}.  The applied patch does not increase the total number of release audit warnings.

    {color:green}+1 core tests{color}.  The patch passed unit tests in hadoop-yarn-project/hadoop-yarn/hadoop-yarn-server/hadoop-yarn-server-resourcemanager.

Test results: https://builds.apache.org/job/PreCommit-YARN-Build/7302//testReport/
Console output: https://builds.apache.org/job/PreCommit-YARN-Build/7302//console

This message is automatically generated.


======================================================================
======================================================================
    Adding comment to Jira.
======================================================================
======================================================================


Comment added.
46ac82a20f13f9ea8a49846ce2c1c5728e1de0ea logged out


======================================================================
======================================================================
    Finished build.
======================================================================
======================================================================


Archiving artifacts
Sending artifact delta relative to PreCommit-YARN-Build #7293
Archived 15 artifacts
Archive block size is 32768
Received 48 blocks and 7577581 bytes
Compression is 17.2%
Took 3 sec
Description set: YARN-3410
Recording test results
Email was triggered for: Success
Sending email for trigger: Success



###################################################################################
############################## FAILED TESTS (if any) ##############################
All tests passed

Failed: YARN-3361 PreCommit Build #7301

Posted by Apache Jenkins Server <je...@builds.apache.org>.
Jira: https://issues.apache.org/jira/browse/YARN-3361
Build: https://builds.apache.org/job/PreCommit-YARN-Build/7301/

###################################################################################
########################## LAST 60 LINES OF THE CONSOLE ###########################
[...truncated 3413 lines...]
{color:red}-1 overall{color}.  Here are the results of testing the latest attachment 
  http://issues.apache.org/jira/secure/attachment/12724609/YARN-3361.8.patch
  against trunk revision 577d755.

    {color:green}+1 @author{color}.  The patch does not contain any @author tags.

    {color:green}+1 tests included{color}.  The patch appears to include 12 new or modified test files.

    {color:green}+1 javac{color}.  The applied patch does not increase the total number of javac compiler warnings.

    {color:green}+1 javadoc{color}.  There were no new javadoc warning messages.

    {color:green}+1 eclipse:eclipse{color}.  The patch built with eclipse:eclipse.

    {color:green}+1 findbugs{color}.  The patch does not introduce any new Findbugs (version 2.0.3) warnings.

    {color:green}+1 release audit{color}.  The applied patch does not increase the total number of release audit warnings.

    {color:red}-1 core tests{color}.  The patch failed these unit tests in hadoop-yarn-project/hadoop-yarn/hadoop-yarn-server/hadoop-yarn-server-common hadoop-yarn-project/hadoop-yarn/hadoop-yarn-server/hadoop-yarn-server-resourcemanager:

                  org.apache.hadoop.yarn.server.resourcemanager.scheduler.fair.TestAllocationFileLoaderService
                  org.apache.hadoop.yarn.server.resourcemanager.applicationsmanager.TestAMRestart

Test results: https://builds.apache.org/job/PreCommit-YARN-Build/7301//testReport/
Console output: https://builds.apache.org/job/PreCommit-YARN-Build/7301//console

This message is automatically generated.


======================================================================
======================================================================
    Adding comment to Jira.
======================================================================
======================================================================


Comment added.
fe3e1d861e9c1e4a663ca10a336335f35df1f3e9 logged out


======================================================================
======================================================================
    Finished build.
======================================================================
======================================================================


Build step 'Execute shell' marked build as failure
Archiving artifacts
Sending artifact delta relative to PreCommit-YARN-Build #7293
Archived 44 artifacts
Archive block size is 32768
Received 0 blocks and 2689054 bytes
Compression is 0.0%
Took 1.1 sec
[description-setter] Could not determine description.
Recording test results
Email was triggered for: Failure
Sending email for trigger: Failure



###################################################################################
############################## FAILED TESTS (if any) ##############################
2 tests failed.
REGRESSION:  org.apache.hadoop.yarn.server.resourcemanager.applicationsmanager.TestAMRestart.testShouldNotCountFailureToMaxAttemptRetry

Error Message:
AppAttempt state is not correct (timedout) expected:<ALLOCATED> but was:<SCHEDULED>

Stack Trace:
java.lang.AssertionError: AppAttempt state is not correct (timedout) expected:<ALLOCATED> but was:<SCHEDULED>
	at org.junit.Assert.fail(Assert.java:88)
	at org.junit.Assert.failNotEquals(Assert.java:743)
	at org.junit.Assert.assertEquals(Assert.java:118)
	at org.apache.hadoop.yarn.server.resourcemanager.MockAM.waitForState(MockAM.java:86)
	at org.apache.hadoop.yarn.server.resourcemanager.MockRM.sendAMLaunched(MockRM.java:507)
	at org.apache.hadoop.yarn.server.resourcemanager.MockRM.launchAM(MockRM.java:685)
	at org.apache.hadoop.yarn.server.resourcemanager.MockRM.launchAndRegisterAM(MockRM.java:692)
	at org.apache.hadoop.yarn.server.resourcemanager.MockRM.waitForNewAMToLaunchAndRegister(MockRM.java:194)
	at org.apache.hadoop.yarn.server.resourcemanager.applicationsmanager.TestAMRestart.testShouldNotCountFailureToMaxAttemptRetry(TestAMRestart.java:392)


REGRESSION:  org.apache.hadoop.yarn.server.resourcemanager.scheduler.fair.TestAllocationFileLoaderService.testGetAllocationFileFromClasspath

Error Message:
null

Stack Trace:
java.lang.AssertionError: null
	at org.junit.Assert.fail(Assert.java:86)
	at org.junit.Assert.assertTrue(Assert.java:41)
	at org.junit.Assert.assertTrue(Assert.java:52)
	at org.apache.hadoop.yarn.server.resourcemanager.scheduler.fair.TestAllocationFileLoaderService.testGetAllocationFileFromClasspath(TestAllocationFileLoaderService.java:66)



Failed: YARN-3410 PreCommit Build #7300

Posted by Apache Jenkins Server <je...@builds.apache.org>.
Jira: https://issues.apache.org/jira/browse/YARN-3410
Build: https://builds.apache.org/job/PreCommit-YARN-Build/7300/

###################################################################################
########################## LAST 60 LINES OF THE CONSOLE ###########################
[...truncated 3601 lines...]

{color:red}-1 overall{color}.  Here are the results of testing the latest attachment 
  http://issues.apache.org/jira/secure/attachment/12724602/0001-YARN-3410.patch
  against trunk revision 577d755.

    {color:green}+1 @author{color}.  The patch does not contain any @author tags.

    {color:green}+1 tests included{color}.  The patch appears to include 4 new or modified test files.

    {color:green}+1 javac{color}.  The applied patch does not increase the total number of javac compiler warnings.

    {color:green}+1 javadoc{color}.  There were no new javadoc warning messages.

    {color:green}+1 eclipse:eclipse{color}.  The patch built with eclipse:eclipse.

    {color:green}+1 findbugs{color}.  The patch does not introduce any new Findbugs (version 2.0.3) warnings.

    {color:green}+1 release audit{color}.  The applied patch does not increase the total number of release audit warnings.

    {color:red}-1 core tests{color}.  The patch failed these unit tests in hadoop-yarn-project/hadoop-yarn/hadoop-yarn-server/hadoop-yarn-server-common hadoop-yarn-project/hadoop-yarn/hadoop-yarn-server/hadoop-yarn-server-resourcemanager:

                  org.apache.hadoop.yarn.server.resourcemanager.scheduler.capacity.TestCapacityScheduler

Test results: https://builds.apache.org/job/PreCommit-YARN-Build/7300//testReport/
Console output: https://builds.apache.org/job/PreCommit-YARN-Build/7300//console

This message is automatically generated.


======================================================================
======================================================================
    Adding comment to Jira.
======================================================================
======================================================================


Comment added.
6cc7cfb8c037fc261d13c406362b315da657cf4c logged out


======================================================================
======================================================================
    Finished build.
======================================================================
======================================================================


Build step 'Execute shell' marked build as failure
Archiving artifacts
Sending artifact delta relative to PreCommit-YARN-Build #7293
Archived 20 artifacts
Archive block size is 32768
Received 2 blocks and 9307949 bytes
Compression is 0.7%
Took 1.8 sec
[description-setter] Could not determine description.
Recording test results
Email was triggered for: Failure
Sending email for trigger: Failure



###################################################################################
############################## FAILED TESTS (if any) ##############################
14 tests failed.
REGRESSION:  org.apache.hadoop.yarn.server.resourcemanager.scheduler.capacity.TestCapacityScheduler.testAsyncScheduling

Error Message:
java.util.zip.ZipException: invalid code lengths set

Stack Trace:
java.lang.RuntimeException: java.util.zip.ZipException: invalid code lengths set
	at java.util.zip.InflaterInputStream.read(InflaterInputStream.java:164)
	at java.util.zip.InflaterInputStream.read(InflaterInputStream.java:122)
	at java.io.FilterInputStream.read(FilterInputStream.java:83)
	at org.apache.xerces.impl.XMLEntityManager$RewindableInputStream.read(Unknown Source)
	at org.apache.xerces.impl.XMLEntityManager.setupCurrentEntity(Unknown Source)
	at org.apache.xerces.impl.XMLVersionDetector.determineDocVersion(Unknown Source)
	at org.apache.xerces.parsers.XML11Configuration.parse(Unknown Source)
	at org.apache.xerces.parsers.XML11Configuration.parse(Unknown Source)
	at org.apache.xerces.parsers.XMLParser.parse(Unknown Source)
	at org.apache.xerces.parsers.DOMParser.parse(Unknown Source)
	at org.apache.xerces.jaxp.DocumentBuilderImpl.parse(Unknown Source)
	at javax.xml.parsers.DocumentBuilder.parse(DocumentBuilder.java:150)
	at org.apache.hadoop.conf.Configuration.parse(Configuration.java:2501)
	at org.apache.hadoop.conf.Configuration.parse(Configuration.java:2489)
	at org.apache.hadoop.conf.Configuration.loadResource(Configuration.java:2560)
	at org.apache.hadoop.conf.Configuration.loadResources(Configuration.java:2513)
	at org.apache.hadoop.conf.Configuration.getProps(Configuration.java:2424)
	at org.apache.hadoop.conf.Configuration.set(Configuration.java:1160)
	at org.apache.hadoop.conf.Configuration.set(Configuration.java:1132)
	at org.apache.hadoop.yarn.server.resourcemanager.scheduler.capacity.CapacitySchedulerConfiguration.setQueues(CapacitySchedulerConfiguration.java:542)
	at org.apache.hadoop.yarn.server.resourcemanager.scheduler.capacity.TestCapacityScheduler.setupQueueConfiguration(TestCapacityScheduler.java:377)
	at org.apache.hadoop.yarn.server.resourcemanager.scheduler.capacity.TestCapacityScheduler.setUp(TestCapacityScheduler.java:176)


REGRESSION:  org.apache.hadoop.yarn.server.resourcemanager.scheduler.capacity.TestCapacityScheduler.testAsyncScheduling

Error Message:
null

Stack Trace:
java.lang.NullPointerException: null
	at org.apache.hadoop.yarn.server.resourcemanager.ResourceManager.transitionToStandby(ResourceManager.java:1051)
	at org.apache.hadoop.yarn.server.resourcemanager.ResourceManager.serviceStop(ResourceManager.java:1107)
	at org.apache.hadoop.service.AbstractService.stop(AbstractService.java:221)
	at org.apache.hadoop.yarn.server.resourcemanager.scheduler.capacity.TestCapacityScheduler.tearDown(TestCapacityScheduler.java:192)


REGRESSION:  org.apache.hadoop.yarn.server.resourcemanager.scheduler.capacity.TestCapacityScheduler.testQueueHierarchyPendingResourceUpdate

Error Message:
java.util.zip.ZipException: invalid code lengths set

Stack Trace:
java.lang.RuntimeException: java.util.zip.ZipException: invalid code lengths set
	at java.util.zip.InflaterInputStream.read(InflaterInputStream.java:164)
	at java.util.zip.InflaterInputStream.read(InflaterInputStream.java:122)
	at java.io.FilterInputStream.read(FilterInputStream.java:83)
	at org.apache.xerces.impl.XMLEntityManager$RewindableInputStream.read(Unknown Source)
	at org.apache.xerces.impl.XMLEntityManager.setupCurrentEntity(Unknown Source)
	at org.apache.xerces.impl.XMLVersionDetector.determineDocVersion(Unknown Source)
	at org.apache.xerces.parsers.XML11Configuration.parse(Unknown Source)
	at org.apache.xerces.parsers.XML11Configuration.parse(Unknown Source)
	at org.apache.xerces.parsers.XMLParser.parse(Unknown Source)
	at org.apache.xerces.parsers.DOMParser.parse(Unknown Source)
	at org.apache.xerces.jaxp.DocumentBuilderImpl.parse(Unknown Source)
	at javax.xml.parsers.DocumentBuilder.parse(DocumentBuilder.java:150)
	at org.apache.hadoop.conf.Configuration.parse(Configuration.java:2501)
	at org.apache.hadoop.conf.Configuration.parse(Configuration.java:2489)
	at org.apache.hadoop.conf.Configuration.loadResource(Configuration.java:2560)
	at org.apache.hadoop.conf.Configuration.loadResources(Configuration.java:2513)
	at org.apache.hadoop.conf.Configuration.getProps(Configuration.java:2424)
	at org.apache.hadoop.conf.Configuration.set(Configuration.java:1160)
	at org.apache.hadoop.conf.Configuration.set(Configuration.java:1132)
	at org.apache.hadoop.yarn.server.resourcemanager.scheduler.capacity.CapacitySchedulerConfiguration.setQueues(CapacitySchedulerConfiguration.java:542)
	at org.apache.hadoop.yarn.server.resourcemanager.scheduler.capacity.TestCapacityScheduler.setupQueueConfiguration(TestCapacityScheduler.java:377)
	at org.apache.hadoop.yarn.server.resourcemanager.scheduler.capacity.TestCapacityScheduler.setUp(TestCapacityScheduler.java:176)


REGRESSION:  org.apache.hadoop.yarn.server.resourcemanager.scheduler.capacity.TestCapacityScheduler.testQueueHierarchyPendingResourceUpdate

Error Message:
null

Stack Trace:
java.lang.NullPointerException: null
	at org.apache.hadoop.yarn.server.resourcemanager.ResourceManager.transitionToStandby(ResourceManager.java:1051)
	at org.apache.hadoop.yarn.server.resourcemanager.ResourceManager.serviceStop(ResourceManager.java:1107)
	at org.apache.hadoop.service.AbstractService.stop(AbstractService.java:221)
	at org.apache.hadoop.yarn.server.resourcemanager.scheduler.capacity.TestCapacityScheduler.tearDown(TestCapacityScheduler.java:192)


REGRESSION:  org.apache.hadoop.yarn.server.resourcemanager.scheduler.capacity.TestCapacityScheduler.testRefreshQueuesWithNewQueue

Error Message:
java.util.zip.ZipException: invalid code lengths set

Stack Trace:
java.lang.RuntimeException: java.util.zip.ZipException: invalid code lengths set
	at java.util.zip.InflaterInputStream.read(InflaterInputStream.java:164)
	at java.util.zip.InflaterInputStream.read(InflaterInputStream.java:122)
	at java.io.FilterInputStream.read(FilterInputStream.java:83)
	at org.apache.xerces.impl.XMLEntityManager$RewindableInputStream.read(Unknown Source)
	at org.apache.xerces.impl.XMLEntityManager.setupCurrentEntity(Unknown Source)
	at org.apache.xerces.impl.XMLVersionDetector.determineDocVersion(Unknown Source)
	at org.apache.xerces.parsers.XML11Configuration.parse(Unknown Source)
	at org.apache.xerces.parsers.XML11Configuration.parse(Unknown Source)
	at org.apache.xerces.parsers.XMLParser.parse(Unknown Source)
	at org.apache.xerces.parsers.DOMParser.parse(Unknown Source)
	at org.apache.xerces.jaxp.DocumentBuilderImpl.parse(Unknown Source)
	at javax.xml.parsers.DocumentBuilder.parse(DocumentBuilder.java:150)
	at org.apache.hadoop.conf.Configuration.parse(Configuration.java:2501)
	at org.apache.hadoop.conf.Configuration.parse(Configuration.java:2489)
	at org.apache.hadoop.conf.Configuration.loadResource(Configuration.java:2560)
	at org.apache.hadoop.conf.Configuration.loadResources(Configuration.java:2513)
	at org.apache.hadoop.conf.Configuration.getProps(Configuration.java:2424)
	at org.apache.hadoop.conf.Configuration.set(Configuration.java:1160)
	at org.apache.hadoop.conf.Configuration.set(Configuration.java:1132)
	at org.apache.hadoop.yarn.server.resourcemanager.scheduler.capacity.CapacitySchedulerConfiguration.setQueues(CapacitySchedulerConfiguration.java:542)
	at org.apache.hadoop.yarn.server.resourcemanager.scheduler.capacity.TestCapacityScheduler.setupQueueConfiguration(TestCapacityScheduler.java:377)
	at org.apache.hadoop.yarn.server.resourcemanager.scheduler.capacity.TestCapacityScheduler.setUp(TestCapacityScheduler.java:176)


REGRESSION:  org.apache.hadoop.yarn.server.resourcemanager.scheduler.capacity.TestCapacityScheduler.testRefreshQueuesWithNewQueue

Error Message:
null

Stack Trace:
java.lang.NullPointerException: null
	at org.apache.hadoop.yarn.server.resourcemanager.ResourceManager.transitionToStandby(ResourceManager.java:1051)
	at org.apache.hadoop.yarn.server.resourcemanager.ResourceManager.serviceStop(ResourceManager.java:1107)
	at org.apache.hadoop.service.AbstractService.stop(AbstractService.java:221)
	at org.apache.hadoop.yarn.server.resourcemanager.scheduler.capacity.TestCapacityScheduler.tearDown(TestCapacityScheduler.java:192)


REGRESSION:  org.apache.hadoop.yarn.server.resourcemanager.scheduler.capacity.TestCapacityScheduler.testMoveAppBasic

Error Message:
java.util.zip.ZipException: invalid code lengths set

Stack Trace:
java.lang.RuntimeException: java.util.zip.ZipException: invalid code lengths set
	at java.util.zip.InflaterInputStream.read(InflaterInputStream.java:164)
	at java.util.zip.InflaterInputStream.read(InflaterInputStream.java:122)
	at java.io.FilterInputStream.read(FilterInputStream.java:83)
	at org.apache.xerces.impl.XMLEntityManager$RewindableInputStream.read(Unknown Source)
	at org.apache.xerces.impl.XMLEntityManager.setupCurrentEntity(Unknown Source)
	at org.apache.xerces.impl.XMLVersionDetector.determineDocVersion(Unknown Source)
	at org.apache.xerces.parsers.XML11Configuration.parse(Unknown Source)
	at org.apache.xerces.parsers.XML11Configuration.parse(Unknown Source)
	at org.apache.xerces.parsers.XMLParser.parse(Unknown Source)
	at org.apache.xerces.parsers.DOMParser.parse(Unknown Source)
	at org.apache.xerces.jaxp.DocumentBuilderImpl.parse(Unknown Source)
	at javax.xml.parsers.DocumentBuilder.parse(DocumentBuilder.java:150)
	at org.apache.hadoop.conf.Configuration.parse(Configuration.java:2501)
	at org.apache.hadoop.conf.Configuration.parse(Configuration.java:2489)
	at org.apache.hadoop.conf.Configuration.loadResource(Configuration.java:2560)
	at org.apache.hadoop.conf.Configuration.loadResources(Configuration.java:2513)
	at org.apache.hadoop.conf.Configuration.getProps(Configuration.java:2424)
	at org.apache.hadoop.conf.Configuration.set(Configuration.java:1160)
	at org.apache.hadoop.conf.Configuration.set(Configuration.java:1132)
	at org.apache.hadoop.yarn.server.resourcemanager.scheduler.capacity.CapacitySchedulerConfiguration.setQueues(CapacitySchedulerConfiguration.java:542)
	at org.apache.hadoop.yarn.server.resourcemanager.scheduler.capacity.TestCapacityScheduler.setupQueueConfiguration(TestCapacityScheduler.java:377)
	at org.apache.hadoop.yarn.server.resourcemanager.scheduler.capacity.TestCapacityScheduler.setUp(TestCapacityScheduler.java:176)


REGRESSION:  org.apache.hadoop.yarn.server.resourcemanager.scheduler.capacity.TestCapacityScheduler.testMoveAppBasic

Error Message:
null

Stack Trace:
java.lang.NullPointerException: null
	at org.apache.hadoop.yarn.server.resourcemanager.ResourceManager.transitionToStandby(ResourceManager.java:1051)
	at org.apache.hadoop.yarn.server.resourcemanager.ResourceManager.serviceStop(ResourceManager.java:1107)
	at org.apache.hadoop.service.AbstractService.stop(AbstractService.java:221)
	at org.apache.hadoop.yarn.server.resourcemanager.scheduler.capacity.TestCapacityScheduler.tearDown(TestCapacityScheduler.java:192)


REGRESSION:  org.apache.hadoop.yarn.server.resourcemanager.scheduler.capacity.TestCapacityScheduler.testRefreshQueuesMaxAllocationRefreshLarger

Error Message:
java.util.zip.ZipException: invalid code lengths set

Stack Trace:
java.lang.RuntimeException: java.util.zip.ZipException: invalid code lengths set
	at java.util.zip.InflaterInputStream.read(InflaterInputStream.java:164)
	at java.util.zip.InflaterInputStream.read(InflaterInputStream.java:122)
	at java.io.FilterInputStream.read(FilterInputStream.java:83)
	at org.apache.xerces.impl.XMLEntityManager$RewindableInputStream.read(Unknown Source)
	at org.apache.xerces.impl.XMLEntityManager.setupCurrentEntity(Unknown Source)
	at org.apache.xerces.impl.XMLVersionDetector.determineDocVersion(Unknown Source)
	at org.apache.xerces.parsers.XML11Configuration.parse(Unknown Source)
	at org.apache.xerces.parsers.XML11Configuration.parse(Unknown Source)
	at org.apache.xerces.parsers.XMLParser.parse(Unknown Source)
	at org.apache.xerces.parsers.DOMParser.parse(Unknown Source)
	at org.apache.xerces.jaxp.DocumentBuilderImpl.parse(Unknown Source)
	at javax.xml.parsers.DocumentBuilder.parse(DocumentBuilder.java:150)
	at org.apache.hadoop.conf.Configuration.parse(Configuration.java:2501)
	at org.apache.hadoop.conf.Configuration.parse(Configuration.java:2489)
	at org.apache.hadoop.conf.Configuration.loadResource(Configuration.java:2560)
	at org.apache.hadoop.conf.Configuration.loadResources(Configuration.java:2513)
	at org.apache.hadoop.conf.Configuration.getProps(Configuration.java:2424)
	at org.apache.hadoop.conf.Configuration.set(Configuration.java:1160)
	at org.apache.hadoop.conf.Configuration.set(Configuration.java:1132)
	at org.apache.hadoop.yarn.server.resourcemanager.scheduler.capacity.CapacitySchedulerConfiguration.setQueues(CapacitySchedulerConfiguration.java:542)
	at org.apache.hadoop.yarn.server.resourcemanager.scheduler.capacity.TestCapacityScheduler.setupQueueConfiguration(TestCapacityScheduler.java:377)
	at org.apache.hadoop.yarn.server.resourcemanager.scheduler.capacity.TestCapacityScheduler.setUp(TestCapacityScheduler.java:176)


REGRESSION:  org.apache.hadoop.yarn.server.resourcemanager.scheduler.capacity.TestCapacityScheduler.testRefreshQueuesMaxAllocationRefreshLarger

Error Message:
null

Stack Trace:
java.lang.NullPointerException: null
	at org.apache.hadoop.yarn.server.resourcemanager.ResourceManager.transitionToStandby(ResourceManager.java:1051)
	at org.apache.hadoop.yarn.server.resourcemanager.ResourceManager.serviceStop(ResourceManager.java:1107)
	at org.apache.hadoop.service.AbstractService.stop(AbstractService.java:221)
	at org.apache.hadoop.yarn.server.resourcemanager.scheduler.capacity.TestCapacityScheduler.tearDown(TestCapacityScheduler.java:192)


REGRESSION:  org.apache.hadoop.yarn.server.resourcemanager.scheduler.capacity.TestCapacityScheduler.testMaximumCapacitySetup

Error Message:
java.util.zip.ZipException: invalid code lengths set

Stack Trace:
java.lang.RuntimeException: java.util.zip.ZipException: invalid code lengths set
	at java.util.zip.InflaterInputStream.read(InflaterInputStream.java:164)
	at java.util.zip.InflaterInputStream.read(InflaterInputStream.java:122)
	at java.io.FilterInputStream.read(FilterInputStream.java:83)
	at org.apache.xerces.impl.XMLEntityManager$RewindableInputStream.read(Unknown Source)
	at org.apache.xerces.impl.XMLEntityManager.setupCurrentEntity(Unknown Source)
	at org.apache.xerces.impl.XMLVersionDetector.determineDocVersion(Unknown Source)
	at org.apache.xerces.parsers.XML11Configuration.parse(Unknown Source)
	at org.apache.xerces.parsers.XML11Configuration.parse(Unknown Source)
	at org.apache.xerces.parsers.XMLParser.parse(Unknown Source)
	at org.apache.xerces.parsers.DOMParser.parse(Unknown Source)
	at org.apache.xerces.jaxp.DocumentBuilderImpl.parse(Unknown Source)
	at javax.xml.parsers.DocumentBuilder.parse(DocumentBuilder.java:150)
	at org.apache.hadoop.conf.Configuration.parse(Configuration.java:2501)
	at org.apache.hadoop.conf.Configuration.parse(Configuration.java:2489)
	at org.apache.hadoop.conf.Configuration.loadResource(Configuration.java:2560)
	at org.apache.hadoop.conf.Configuration.loadResources(Configuration.java:2513)
	at org.apache.hadoop.conf.Configuration.getProps(Configuration.java:2424)
	at org.apache.hadoop.conf.Configuration.set(Configuration.java:1160)
	at org.apache.hadoop.conf.Configuration.set(Configuration.java:1132)
	at org.apache.hadoop.yarn.server.resourcemanager.scheduler.capacity.CapacitySchedulerConfiguration.setQueues(CapacitySchedulerConfiguration.java:542)
	at org.apache.hadoop.yarn.server.resourcemanager.scheduler.capacity.TestCapacityScheduler.setupQueueConfiguration(TestCapacityScheduler.java:377)
	at org.apache.hadoop.yarn.server.resourcemanager.scheduler.capacity.TestCapacityScheduler.setUp(TestCapacityScheduler.java:176)


REGRESSION:  org.apache.hadoop.yarn.server.resourcemanager.scheduler.capacity.TestCapacityScheduler.testMaximumCapacitySetup

Error Message:
null

Stack Trace:
java.lang.NullPointerException: null
	at org.apache.hadoop.yarn.server.resourcemanager.ResourceManager.transitionToStandby(ResourceManager.java:1051)
	at org.apache.hadoop.yarn.server.resourcemanager.ResourceManager.serviceStop(ResourceManager.java:1107)
	at org.apache.hadoop.service.AbstractService.stop(AbstractService.java:221)
	at org.apache.hadoop.yarn.server.resourcemanager.scheduler.capacity.TestCapacityScheduler.tearDown(TestCapacityScheduler.java:192)


REGRESSION:  org.apache.hadoop.yarn.server.resourcemanager.scheduler.capacity.TestCapacityScheduler.testApplicationHeadRoom

Error Message:
java.util.zip.ZipException: invalid code lengths set

Stack Trace:
java.lang.RuntimeException: java.util.zip.ZipException: invalid code lengths set
	at java.util.zip.InflaterInputStream.read(InflaterInputStream.java:164)
	at java.util.zip.InflaterInputStream.read(InflaterInputStream.java:122)
	at java.io.FilterInputStream.read(FilterInputStream.java:83)
	at org.apache.xerces.impl.XMLEntityManager$RewindableInputStream.read(Unknown Source)
	at org.apache.xerces.impl.XMLEntityManager.setupCurrentEntity(Unknown Source)
	at org.apache.xerces.impl.XMLVersionDetector.determineDocVersion(Unknown Source)
	at org.apache.xerces.parsers.XML11Configuration.parse(Unknown Source)
	at org.apache.xerces.parsers.XML11Configuration.parse(Unknown Source)
	at org.apache.xerces.parsers.XMLParser.parse(Unknown Source)
	at org.apache.xerces.parsers.DOMParser.parse(Unknown Source)
	at org.apache.xerces.jaxp.DocumentBuilderImpl.parse(Unknown Source)
	at javax.xml.parsers.DocumentBuilder.parse(DocumentBuilder.java:150)
	at org.apache.hadoop.conf.Configuration.parse(Configuration.java:2501)
	at org.apache.hadoop.conf.Configuration.parse(Configuration.java:2489)
	at org.apache.hadoop.conf.Configuration.loadResource(Configuration.java:2560)
	at org.apache.hadoop.conf.Configuration.loadResources(Configuration.java:2513)
	at org.apache.hadoop.conf.Configuration.getProps(Configuration.java:2424)
	at org.apache.hadoop.conf.Configuration.set(Configuration.java:1160)
	at org.apache.hadoop.conf.Configuration.set(Configuration.java:1132)
	at org.apache.hadoop.yarn.server.resourcemanager.scheduler.capacity.CapacitySchedulerConfiguration.setQueues(CapacitySchedulerConfiguration.java:542)
	at org.apache.hadoop.yarn.server.resourcemanager.scheduler.capacity.TestCapacityScheduler.setupQueueConfiguration(TestCapacityScheduler.java:377)
	at org.apache.hadoop.yarn.server.resourcemanager.scheduler.capacity.TestCapacityScheduler.setUp(TestCapacityScheduler.java:176)


REGRESSION:  org.apache.hadoop.yarn.server.resourcemanager.scheduler.capacity.TestCapacityScheduler.testApplicationHeadRoom

Error Message:
null

Stack Trace:
java.lang.NullPointerException: null
	at org.apache.hadoop.yarn.server.resourcemanager.ResourceManager.transitionToStandby(ResourceManager.java:1051)
	at org.apache.hadoop.yarn.server.resourcemanager.ResourceManager.serviceStop(ResourceManager.java:1107)
	at org.apache.hadoop.service.AbstractService.stop(AbstractService.java:221)
	at org.apache.hadoop.yarn.server.resourcemanager.scheduler.capacity.TestCapacityScheduler.tearDown(TestCapacityScheduler.java:192)



Failed: YARN-3410 PreCommit Build #7299

Posted by Apache Jenkins Server <je...@builds.apache.org>.
Jira: https://issues.apache.org/jira/browse/YARN-3410
Build: https://builds.apache.org/job/PreCommit-YARN-Build/7299/

###################################################################################
########################## LAST 60 LINES OF THE CONSOLE ###########################
[...truncated 45 lines...]
Checking patch hadoop-yarn-project/hadoop-yarn/hadoop-yarn-server/hadoop-yarn-server-resourcemanager/src/main/java/org/apache/hadoop/yarn/server/resourcemanager/recovery/ZKRMStateStore.java...
Checking patch hadoop-yarn-project/hadoop-yarn/hadoop-yarn-server/hadoop-yarn-server-resourcemanager/src/test/java/org/apache/hadoop/yarn/server/resourcemanager/recovery/RMStateStoreTestBase.java...
Checking patch hadoop-yarn-project/hadoop-yarn/hadoop-yarn-server/hadoop-yarn-server-resourcemanager/src/test/java/org/apache/hadoop/yarn/server/resourcemanager/recovery/TestFSRMStateStore.java...
Checking patch hadoop-yarn-project/hadoop-yarn/hadoop-yarn-server/hadoop-yarn-server-resourcemanager/src/test/java/org/apache/hadoop/yarn/server/resourcemanager/recovery/TestLeveldbRMStateStore.java...
Checking patch hadoop-yarn-project/hadoop-yarn/hadoop-yarn-server/hadoop-yarn-server-resourcemanager/src/test/java/org/apache/hadoop/yarn/server/resourcemanager/recovery/TestZKRMStateStore.java...
Checking patch hadoop-yarn-project/hadoop-yarn/hadoop-yarn-site/src/site/markdown/YarnCommands.md...


======================================================================
======================================================================
 Pre-build trunk to verify trunk stability and javac warnings
======================================================================
======================================================================


Compiling /home/jenkins/jenkins-slave/workspace/PreCommit-YARN-Build
/home/jenkins/tools/maven/latest/bin/mvn clean test -DskipTests -DHadoopPatchProcess -Ptest-patch > /home/jenkins/jenkins-slave/workspace/PreCommit-YARN-Build/../patchprocess/trunkJavacWarnings.txt 2>&1
/home/jenkins/tools/maven/latest/bin/mvn clean test javadoc:javadoc -DskipTests -Pdocs -DHadoopPatchProcess > /home/jenkins/jenkins-slave/workspace/PreCommit-YARN-Build/../patchprocess/trunkJavadocWarnings.txt 2>&1
/home/jenkins/jenkins-slave/workspace/PreCommit-YARN-Build/dev-support/test-patch.sh: line 310: /home/jenkins/jenkins-slave/workspace/PreCommit-YARN-Build/../patchprocess/trunkJavadocWarnings.txt: No such file or directory
Trunk javadoc compilation is broken?




{color:red}-1 overall{color}.  Here are the results of testing the latest attachment 
  http://issues.apache.org/jira/secure/attachment/12724599/0001-YARN-3410.patch
  against trunk revision 577d755.

    {color:red}-1 patch{color}.  Trunk compilation may be broken.

Console output: https://builds.apache.org/job/PreCommit-YARN-Build/7299//console

This message is automatically generated.


======================================================================
======================================================================
    Adding comment to Jira.
======================================================================
======================================================================


Comment added.
d3e8bc53eaf156055be2aa8342ed99c5c8e58812 logged out


======================================================================
======================================================================
    Finished build.
======================================================================
======================================================================


Build step 'Execute shell' marked build as failure
Archiving artifacts
[description-setter] Could not determine description.
Recording test results
Email was triggered for: Failure
Sending email for trigger: Failure



###################################################################################
############################## FAILED TESTS (if any) ##############################
No tests ran.