You are viewing a plain text version of this content. The canonical link for it is here.
Posted to builds@beam.apache.org by Apache Jenkins Server <je...@builds.apache.org> on 2022/09/14 07:17:43 UTC

Build failed in Jenkins: beam_PerformanceTests_InfluxDbIO_IT #2318

See <https://ci-beam.apache.org/job/beam_PerformanceTests_InfluxDbIO_IT/2318/display/redirect>

Changes:


------------------------------------------
[...truncated 182.27 KB...]
:sdks:java:core:shadowTestJar (Thread[Execution worker Thread 2,5,main]) completed. Took 0.123 secs.
work action resolve beam-sdks-java-core-tests.jar (project :sdks:java:core) (Thread[Execution worker Thread 7,5,main]) started.
work action null (Thread[Execution worker Thread 7,5,main]) completed. Took 0.0 secs.
Resolve mutations for :runners:core-java:compileTestJava (Thread[Execution worker Thread 6,5,main]) started.
Resolve mutations for :runners:core-java:compileTestJava (Thread[Execution worker Thread 6,5,main]) completed. Took 0.0 secs.
:runners:core-java:compileTestJava (Thread[Execution worker Thread 2,5,main]) started.

> Task :sdks:java:harness:compileJava FROM-CACHE
Custom actions are attached to task ':sdks:java:harness:compileJava'.
Build cache key for task ':sdks:java:harness:compileJava' is f3742ef367ae9dd018c822b5726751e6
Task ':sdks:java:harness:compileJava' is not up-to-date because:
  No history is available.
Loaded cache entry for task ':sdks:java:harness:compileJava' with cache key f3742ef367ae9dd018c822b5726751e6
:sdks:java:harness:compileJava (Thread[Execution worker Thread 4,5,main]) completed. Took 0.083 secs.
Resolve mutations for :sdks:java:harness:classes (Thread[Execution worker Thread 7,5,main]) started.
Resolve mutations for :sdks:java:harness:classes (Thread[Execution worker Thread 7,5,main]) completed. Took 0.0 secs.
:sdks:java:harness:classes (Thread[Execution worker Thread 7,5,main]) started.

> Task :sdks:java:harness:classes UP-TO-DATE
Skipping task ':sdks:java:harness:classes' as it has no actions.
:sdks:java:harness:classes (Thread[Execution worker Thread 7,5,main]) completed. Took 0.0 secs.
Resolve mutations for :sdks:java:harness:jar (Thread[included builds,5,main]) started.
Resolve mutations for :sdks:java:harness:jar (Thread[included builds,5,main]) completed. Took 0.0 secs.
:sdks:java:harness:jar (Thread[Execution worker Thread 4,5,main]) started.

> Task :sdks:java:harness:jar
Caching disabled for task ':sdks:java:harness:jar' because:
  Not worth caching
Task ':sdks:java:harness:jar' is not up-to-date because:
  No history is available.
file or directory '<https://ci-beam.apache.org/job/beam_PerformanceTests_InfluxDbIO_IT/ws/src/sdks/java/harness/build/resources/main',> not found
:sdks:java:harness:jar (Thread[Execution worker Thread 4,5,main]) completed. Took 0.06 secs.
work action resolve beam-sdks-java-harness-unshaded.jar (project :sdks:java:harness) (Thread[Execution worker Thread 7,5,main]) started.
work action null (Thread[Execution worker Thread 7,5,main]) completed. Took 0.0 secs.
Resolve mutations for :runners:java-fn-execution:compileJava (Thread[included builds,5,main]) started.
Resolve mutations for :runners:java-fn-execution:compileJava (Thread[included builds,5,main]) completed. Took 0.0 secs.
:runners:java-fn-execution:compileJava (Thread[Execution worker Thread 3,5,main]) started.

> Task :runners:java-fn-execution:compileJava FROM-CACHE
Custom actions are attached to task ':runners:java-fn-execution:compileJava'.
Build cache key for task ':runners:java-fn-execution:compileJava' is bb897232c8cfe7bb21e58599ebf4adf6
Task ':runners:java-fn-execution:compileJava' is not up-to-date because:
  No history is available.
Loaded cache entry for task ':runners:java-fn-execution:compileJava' with cache key bb897232c8cfe7bb21e58599ebf4adf6
:runners:java-fn-execution:compileJava (Thread[Execution worker Thread 3,5,main]) completed. Took 0.363 secs.
Resolve mutations for :runners:java-fn-execution:classes (Thread[Execution worker Thread 3,5,main]) started.
Resolve mutations for :runners:java-fn-execution:classes (Thread[Execution worker Thread 3,5,main]) completed. Took 0.0 secs.
:runners:java-fn-execution:classes (Thread[Execution worker Thread 3,5,main]) started.

> Task :runners:java-fn-execution:classes UP-TO-DATE
Skipping task ':runners:java-fn-execution:classes' as it has no actions.
:runners:java-fn-execution:classes (Thread[Execution worker Thread 3,5,main]) completed. Took 0.0 secs.
Resolve mutations for :runners:java-fn-execution:jar (Thread[Execution worker Thread 4,5,main]) started.
Resolve mutations for :runners:java-fn-execution:jar (Thread[Execution worker Thread 4,5,main]) completed. Took 0.0 secs.
:runners:java-fn-execution:jar (Thread[Execution worker Thread 7,5,main]) started.

> Task :runners:java-fn-execution:jar
Caching disabled for task ':runners:java-fn-execution:jar' because:
  Not worth caching
Task ':runners:java-fn-execution:jar' is not up-to-date because:
  No history is available.
file or directory '<https://ci-beam.apache.org/job/beam_PerformanceTests_InfluxDbIO_IT/ws/src/runners/java-fn-execution/build/resources/main',> not found
:runners:java-fn-execution:jar (Thread[Execution worker Thread 7,5,main]) completed. Took 0.041 secs.
work action resolve beam-runners-java-fn-execution.jar (project :runners:java-fn-execution) (Thread[Execution worker Thread 3,5,main]) started.
work action null (Thread[Execution worker Thread 3,5,main]) completed. Took 0.0 secs.
Resolve mutations for :runners:direct-java:compileJava (Thread[Execution worker Thread 6,5,main]) started.
Resolve mutations for :runners:direct-java:compileJava (Thread[Execution worker Thread 6,5,main]) completed. Took 0.0 secs.
:runners:direct-java:compileJava (Thread[Execution worker Thread 7,5,main]) started.

> Task :runners:core-java:compileTestJava FROM-CACHE
Custom actions are attached to task ':runners:core-java:compileTestJava'.
Build cache key for task ':runners:core-java:compileTestJava' is 485a89f0aa35a6f30d18d878408c29f5
Task ':runners:core-java:compileTestJava' is not up-to-date because:
  No history is available.
Loaded cache entry for task ':runners:core-java:compileTestJava' with cache key 485a89f0aa35a6f30d18d878408c29f5
:runners:core-java:compileTestJava (Thread[Execution worker Thread 2,5,main]) completed. Took 0.595 secs.
Resolve mutations for :runners:core-java:testClasses (Thread[Execution worker Thread 3,5,main]) started.
Resolve mutations for :runners:core-java:testClasses (Thread[Execution worker Thread 3,5,main]) completed. Took 0.0 secs.
:runners:core-java:testClasses (Thread[Execution worker Thread 5,5,main]) started.

> Task :runners:core-java:testClasses UP-TO-DATE
Skipping task ':runners:core-java:testClasses' as it has no actions.
:runners:core-java:testClasses (Thread[Execution worker Thread 5,5,main]) completed. Took 0.0 secs.
Resolve mutations for :runners:core-java:testJar (Thread[Execution worker Thread 2,5,main]) started.
Resolve mutations for :runners:core-java:testJar (Thread[Execution worker Thread 2,5,main]) completed. Took 0.0 secs.
:runners:core-java:testJar (Thread[Execution worker Thread 3,5,main]) started.

> Task :runners:direct-java:compileJava FROM-CACHE
Custom actions are attached to task ':runners:direct-java:compileJava'.
Build cache key for task ':runners:direct-java:compileJava' is 56e7489efd9bf3f1be9b61e60889b4e1
Task ':runners:direct-java:compileJava' is not up-to-date because:
  No history is available.
Loaded cache entry for task ':runners:direct-java:compileJava' with cache key 56e7489efd9bf3f1be9b61e60889b4e1
:runners:direct-java:compileJava (Thread[Execution worker Thread 7,5,main]) completed. Took 0.09 secs.
Resolve mutations for :runners:direct-java:classes (Thread[Execution worker Thread 5,5,main]) started.
Resolve mutations for :runners:direct-java:classes (Thread[Execution worker Thread 5,5,main]) completed. Took 0.0 secs.
:runners:direct-java:classes (Thread[Execution worker Thread 6,5,main]) started.

> Task :runners:direct-java:classes UP-TO-DATE
Skipping task ':runners:direct-java:classes' as it has no actions.
:runners:direct-java:classes (Thread[Execution worker Thread 6,5,main]) completed. Took 0.0 secs.
Resolve mutations for :runners:direct-java:shadowJar (Thread[Execution worker Thread 7,5,main]) started.
Resolve mutations for :runners:direct-java:shadowJar (Thread[Execution worker Thread 7,5,main]) completed. Took 0.0 secs.
:runners:direct-java:shadowJar (Thread[Execution worker Thread 5,5,main]) started.

> Task :runners:core-java:testJar
Caching disabled for task ':runners:core-java:testJar' because:
  Not worth caching
Task ':runners:core-java:testJar' is not up-to-date because:
  No history is available.
file or directory '<https://ci-beam.apache.org/job/beam_PerformanceTests_InfluxDbIO_IT/ws/src/runners/core-java/build/resources/test',> not found
:runners:core-java:testJar (Thread[Execution worker Thread 3,5,main]) completed. Took 0.035 secs.
work action resolve beam-runners-core-java-tests.jar (project :runners:core-java) (Thread[Execution worker Thread 6,5,main]) started.
work action null (Thread[Execution worker Thread 6,5,main]) completed. Took 0.0 secs.

> Task :runners:direct-java:shadowJar FROM-CACHE
Custom actions are attached to task ':runners:direct-java:shadowJar'.
Build cache key for task ':runners:direct-java:shadowJar' is fcbf044b1d80340ce891f4f08ab49b85
Task ':runners:direct-java:shadowJar' is not up-to-date because:
  No history is available.
Loaded cache entry for task ':runners:direct-java:shadowJar' with cache key fcbf044b1d80340ce891f4f08ab49b85
:runners:direct-java:shadowJar (Thread[Execution worker Thread 5,5,main]) completed. Took 0.296 secs.
work action resolve beam-runners-direct-java.jar (project :runners:direct-java) (Thread[Execution worker Thread 5,5,main]) started.
work action null (Thread[Execution worker Thread 5,5,main]) completed. Took 0.0 secs.
work action resolve beam-runners-direct-java.jar (project :runners:direct-java) (Thread[Execution worker Thread 2,5,main]) started.
work action null (Thread[Execution worker Thread 2,5,main]) completed. Took 0.0 secs.
Resolve mutations for :runners:direct-java:compileTestJava (Thread[Execution worker,5,main]) started.
Resolve mutations for :runners:direct-java:compileTestJava (Thread[Execution worker,5,main]) completed. Took 0.0 secs.
:runners:direct-java:compileTestJava (Thread[Execution worker Thread 3,5,main]) started.

> Task :runners:direct-java:compileTestJava FROM-CACHE
Custom actions are attached to task ':runners:direct-java:compileTestJava'.
Build cache key for task ':runners:direct-java:compileTestJava' is 9c5ca6e9bb56160a066e26d10ed4f878
Task ':runners:direct-java:compileTestJava' is not up-to-date because:
  No history is available.
Loaded cache entry for task ':runners:direct-java:compileTestJava' with cache key 9c5ca6e9bb56160a066e26d10ed4f878
:runners:direct-java:compileTestJava (Thread[Execution worker Thread 3,5,main]) completed. Took 0.092 secs.
Resolve mutations for :runners:direct-java:testClasses (Thread[Execution worker Thread 2,5,main]) started.
Resolve mutations for :runners:direct-java:testClasses (Thread[Execution worker Thread 2,5,main]) completed. Took 0.0 secs.
:runners:direct-java:testClasses (Thread[Execution worker Thread 2,5,main]) started.

> Task :runners:direct-java:testClasses UP-TO-DATE
Skipping task ':runners:direct-java:testClasses' as it has no actions.
:runners:direct-java:testClasses (Thread[Execution worker Thread 2,5,main]) completed. Took 0.0 secs.
Resolve mutations for :runners:direct-java:shadowTestJar (Thread[Execution worker,5,main]) started.
Resolve mutations for :runners:direct-java:shadowTestJar (Thread[Execution worker,5,main]) completed. Took 0.0 secs.
:runners:direct-java:shadowTestJar (Thread[Execution worker Thread 5,5,main]) started.

> Task :runners:direct-java:shadowTestJar FROM-CACHE
Build cache key for task ':runners:direct-java:shadowTestJar' is 7d820c01f6e8f8aa9026b73d4a3dbdda
Task ':runners:direct-java:shadowTestJar' is not up-to-date because:
  No history is available.
Loaded cache entry for task ':runners:direct-java:shadowTestJar' with cache key 7d820c01f6e8f8aa9026b73d4a3dbdda
:runners:direct-java:shadowTestJar (Thread[Execution worker Thread 5,5,main]) completed. Took 0.208 secs.
work action resolve beam-runners-direct-java-tests.jar (project :runners:direct-java) (Thread[Execution worker Thread 5,5,main]) started.
work action null (Thread[Execution worker Thread 5,5,main]) completed. Took 0.0 secs.
Resolve mutations for :sdks:java:io:influxdb:integrationTest (Thread[Execution worker Thread 5,5,main]) started.
Resolve mutations for :sdks:java:io:influxdb:integrationTest (Thread[Execution worker Thread 5,5,main]) completed. Took 0.0 secs.
:sdks:java:io:influxdb:integrationTest (Thread[Execution worker Thread 2,5,main]) started.
producer locations for task group 0 (Thread[Execution worker Thread 5,5,main]) started.
producer locations for task group 0 (Thread[Execution worker Thread 5,5,main]) completed. Took 0.0 secs.
Gradle Test Executor 76 started executing tests.

> Task :sdks:java:io:influxdb:integrationTest
Custom actions are attached to task ':sdks:java:io:influxdb:integrationTest'.
Build cache key for task ':sdks:java:io:influxdb:integrationTest' is 29f79ce16e4c0e0f483b98bd4b1d9008
Task ':sdks:java:io:influxdb:integrationTest' is not up-to-date because:
  Task.upToDateWhen is false.
Starting process 'Gradle Test Executor 76'. Working directory: <https://ci-beam.apache.org/job/beam_PerformanceTests_InfluxDbIO_IT/ws/src/sdks/java/io/influxdb> Command: /usr/lib/jvm/java-8-openjdk-amd64/bin/java -DbeamTestPipelineOptions=["--influxDBURL=http://35.222.176.207:8086","--influxDBUserName=superadmin","--influxDBPassword=supersecretpassword","--databaseName=db1"] -Djava.security.manager=worker.org.gradle.process.internal.worker.child.BootstrapSecurityManager -Dorg.gradle.internal.worker.tmpdir=<https://ci-beam.apache.org/job/beam_PerformanceTests_InfluxDbIO_IT/ws/src/sdks/java/io/influxdb/build/tmp/integrationTest/work> -Dorg.gradle.native=false -Xmx2g -Dfile.encoding=UTF-8 -Duser.country=US -Duser.language=en -Duser.variant -ea -cp /home/jenkins/.gradle/caches/7.5.1/workerMain/gradle-worker.jar worker.org.gradle.process.internal.worker.GradleWorkerMain 'Gradle Test Executor 76'
Successfully started process 'Gradle Test Executor 76'

org.apache.beam.sdk.io.influxdb.InfluxDbIOIT > testWriteAndReadWithMultipleMetric FAILED
    org.influxdb.InfluxDBIOException: java.net.SocketTimeoutException: connect timed out
        at org.influxdb.impl.InfluxDBImpl.execute(InfluxDBImpl.java:836)
        at org.influxdb.impl.InfluxDBImpl.executeQuery(InfluxDBImpl.java:819)
        at org.influxdb.impl.InfluxDBImpl.query(InfluxDBImpl.java:554)
        at org.apache.beam.sdk.io.influxdb.InfluxDbIOIT.initTest(InfluxDbIOIT.java:99)

        Caused by:
        java.net.SocketTimeoutException: connect timed out
            at java.net.PlainSocketImpl.socketConnect(Native Method)
            at java.net.AbstractPlainSocketImpl.doConnect(AbstractPlainSocketImpl.java:350)
            at java.net.AbstractPlainSocketImpl.connectToAddress(AbstractPlainSocketImpl.java:206)
            at java.net.AbstractPlainSocketImpl.connect(AbstractPlainSocketImpl.java:188)
            at java.net.SocksSocketImpl.connect(SocksSocketImpl.java:392)
            at java.net.Socket.connect(Socket.java:607)
            at okhttp3.internal.platform.Platform.connectSocket(Platform.kt:119)
            at okhttp3.internal.connection.RealConnection.connectSocket(RealConnection.kt:283)
            at okhttp3.internal.connection.RealConnection.connect(RealConnection.kt:195)
            at okhttp3.internal.connection.ExchangeFinder.findConnection(ExchangeFinder.kt:249)
            at okhttp3.internal.connection.ExchangeFinder.findHealthyConnection(ExchangeFinder.kt:108)
            at okhttp3.internal.connection.ExchangeFinder.find(ExchangeFinder.kt:76)
            at okhttp3.internal.connection.RealCall.initExchange$okhttp(RealCall.kt:245)
            at okhttp3.internal.connection.ConnectInterceptor.intercept(ConnectInterceptor.kt:32)
            at okhttp3.internal.http.RealInterceptorChain.proceed(RealInterceptorChain.kt:100)
            at okhttp3.internal.cache.CacheInterceptor.intercept(CacheInterceptor.kt:82)
            at okhttp3.internal.http.RealInterceptorChain.proceed(RealInterceptorChain.kt:100)
            at okhttp3.internal.http.BridgeInterceptor.intercept(BridgeInterceptor.kt:83)
            at okhttp3.internal.http.RealInterceptorChain.proceed(RealInterceptorChain.kt:100)
            at okhttp3.internal.http.RetryAndFollowUpInterceptor.intercept(RetryAndFollowUpInterceptor.kt:76)
            at okhttp3.internal.http.RealInterceptorChain.proceed(RealInterceptorChain.kt:100)
            at org.influxdb.impl.BasicAuthInterceptor.intercept(BasicAuthInterceptor.java:22)
            at okhttp3.internal.http.RealInterceptorChain.proceed(RealInterceptorChain.kt:100)
            at org.influxdb.impl.GzipRequestInterceptor.intercept(GzipRequestInterceptor.java:42)
            at okhttp3.internal.http.RealInterceptorChain.proceed(RealInterceptorChain.kt:100)
            at okhttp3.logging.HttpLoggingInterceptor.intercept(HttpLoggingInterceptor.kt:152)
            at okhttp3.internal.http.RealInterceptorChain.proceed(RealInterceptorChain.kt:100)
            at okhttp3.internal.connection.RealCall.getResponseWithInterceptorChain$okhttp(RealCall.kt:197)
            at okhttp3.internal.connection.RealCall.execute(RealCall.kt:148)
            at retrofit2.OkHttpCall.execute(OkHttpCall.java:190)
            at org.influxdb.impl.InfluxDBImpl.execute(InfluxDBImpl.java:824)
            ... 3 more

Gradle Test Executor 76 finished executing tests.

> Task :sdks:java:io:influxdb:integrationTest FAILED

6 tests completed, 1 failed
Finished generating test XML results (0.001 secs) into: <https://ci-beam.apache.org/job/beam_PerformanceTests_InfluxDbIO_IT/ws/src/sdks/java/io/influxdb/build/test-results/integrationTest>
Generating HTML test report...
Finished generating test html results (0.002 secs) into: <https://ci-beam.apache.org/job/beam_PerformanceTests_InfluxDbIO_IT/ws/src/sdks/java/io/influxdb/build/reports/tests/integrationTest>
:sdks:java:io:influxdb:integrationTest (Thread[Execution worker Thread 2,5,main]) completed. Took 19.067 secs.

FAILURE: Build failed with an exception.

* What went wrong:
Execution failed for task ':sdks:java:io:influxdb:integrationTest'.
> There were failing tests. See the report at: file://<https://ci-beam.apache.org/job/beam_PerformanceTests_InfluxDbIO_IT/ws/src/sdks/java/io/influxdb/build/reports/tests/integrationTest/index.html>

* Try:
> Run with --stacktrace option to get the stack trace.
> Run with --debug option to get more log output.

* Get more help at https://help.gradle.org

Deprecated Gradle features were used in this build, making it incompatible with Gradle 8.0.

You can use '--warning-mode all' to show the individual deprecation warnings and determine if they come from your own scripts or plugins.

See https://docs.gradle.org/7.5.1/userguide/command_line_interface.html#sec:command_line_warnings

BUILD FAILED in 27s
77 actionable tasks: 42 executed, 33 from cache, 2 up-to-date

Publishing build scan...
https://gradle.com/s/cmbartruxdgts

Build step 'Invoke Gradle script' changed build result to FAILURE
Build step 'Invoke Gradle script' marked build as failure

---------------------------------------------------------------------
To unsubscribe, e-mail: builds-unsubscribe@beam.apache.org
For additional commands, e-mail: builds-help@beam.apache.org


Jenkins build is back to normal : beam_PerformanceTests_InfluxDbIO_IT #2324

Posted by Apache Jenkins Server <je...@builds.apache.org>.
See <https://ci-beam.apache.org/job/beam_PerformanceTests_InfluxDbIO_IT/2324/display/redirect?page=changes>


---------------------------------------------------------------------
To unsubscribe, e-mail: builds-unsubscribe@beam.apache.org
For additional commands, e-mail: builds-help@beam.apache.org


Build failed in Jenkins: beam_PerformanceTests_InfluxDbIO_IT #2323

Posted by Apache Jenkins Server <je...@builds.apache.org>.
See <https://ci-beam.apache.org/job/beam_PerformanceTests_InfluxDbIO_IT/2323/display/redirect?page=changes>

Changes:

[noreply] Pass namespace through RunInference transform (#23182)


------------------------------------------
[...truncated 185.68 KB...]
Task ':runners:java-fn-execution:compileJava' is not up-to-date because:
  No history is available.
Loaded cache entry for task ':runners:java-fn-execution:compileJava' with cache key 847afbf388a7f9a9ea7abc1cb81d9434
:runners:java-fn-execution:compileJava (Thread[included builds,5,main]) completed. Took 0.082 secs.
Resolve mutations for :runners:java-fn-execution:classes (Thread[Execution worker Thread 3,5,main]) started.
Resolve mutations for :runners:java-fn-execution:classes (Thread[Execution worker Thread 3,5,main]) completed. Took 0.0 secs.
:runners:java-fn-execution:classes (Thread[Execution worker Thread 3,5,main]) started.

> Task :runners:java-fn-execution:classes UP-TO-DATE
Skipping task ':runners:java-fn-execution:classes' as it has no actions.
:runners:java-fn-execution:classes (Thread[Execution worker Thread 3,5,main]) completed. Took 0.0 secs.
Resolve mutations for :runners:java-fn-execution:jar (Thread[Execution worker Thread 2,5,main]) started.
Resolve mutations for :runners:java-fn-execution:jar (Thread[Execution worker Thread 2,5,main]) completed. Took 0.0 secs.
:runners:java-fn-execution:jar (Thread[Execution worker Thread 5,5,main]) started.

> Task :runners:java-fn-execution:jar
Caching disabled for task ':runners:java-fn-execution:jar' because:
  Not worth caching
Task ':runners:java-fn-execution:jar' is not up-to-date because:
  No history is available.
file or directory '<https://ci-beam.apache.org/job/beam_PerformanceTests_InfluxDbIO_IT/ws/src/runners/java-fn-execution/build/resources/main',> not found
:runners:java-fn-execution:jar (Thread[Execution worker Thread 5,5,main]) completed. Took 0.039 secs.
work action resolve beam-runners-java-fn-execution.jar (project :runners:java-fn-execution) (Thread[Execution worker Thread 3,5,main]) started.
work action null (Thread[Execution worker Thread 3,5,main]) completed. Took 0.0 secs.
Resolve mutations for :runners:direct-java:compileJava (Thread[Execution worker Thread 4,5,main]) started.
Resolve mutations for :runners:direct-java:compileJava (Thread[Execution worker Thread 4,5,main]) completed. Took 0.0 secs.
:runners:direct-java:compileJava (Thread[Execution worker Thread 4,5,main]) started.

> Task :runners:core-java:compileTestJava FROM-CACHE
Custom actions are attached to task ':runners:core-java:compileTestJava'.
Build cache key for task ':runners:core-java:compileTestJava' is 58aa36c6f9005ce309aa150dccbe1d73
Task ':runners:core-java:compileTestJava' is not up-to-date because:
  No history is available.
Loaded cache entry for task ':runners:core-java:compileTestJava' with cache key 58aa36c6f9005ce309aa150dccbe1d73
:runners:core-java:compileTestJava (Thread[Execution worker Thread 7,5,main]) completed. Took 0.326 secs.
Resolve mutations for :runners:core-java:testClasses (Thread[Execution worker Thread 5,5,main]) started.
Resolve mutations for :runners:core-java:testClasses (Thread[Execution worker Thread 5,5,main]) completed. Took 0.0 secs.
:runners:core-java:testClasses (Thread[Execution worker Thread 5,5,main]) started.

> Task :runners:core-java:testClasses UP-TO-DATE
Skipping task ':runners:core-java:testClasses' as it has no actions.
:runners:core-java:testClasses (Thread[Execution worker Thread 5,5,main]) completed. Took 0.0 secs.
Resolve mutations for :runners:core-java:testJar (Thread[Execution worker Thread 5,5,main]) started.
Resolve mutations for :runners:core-java:testJar (Thread[Execution worker Thread 5,5,main]) completed. Took 0.0 secs.
:runners:core-java:testJar (Thread[Execution worker Thread 5,5,main]) started.

> Task :runners:direct-java:compileJava FROM-CACHE
Custom actions are attached to task ':runners:direct-java:compileJava'.
Build cache key for task ':runners:direct-java:compileJava' is 4680edce0596cb0762368f20d4c80798
Task ':runners:direct-java:compileJava' is not up-to-date because:
  No history is available.
Loaded cache entry for task ':runners:direct-java:compileJava' with cache key 4680edce0596cb0762368f20d4c80798
:runners:direct-java:compileJava (Thread[Execution worker Thread 4,5,main]) completed. Took 0.092 secs.
Resolve mutations for :runners:direct-java:classes (Thread[Execution worker Thread 4,5,main]) started.
Resolve mutations for :runners:direct-java:classes (Thread[Execution worker Thread 4,5,main]) completed. Took 0.0 secs.
:runners:direct-java:classes (Thread[included builds,5,main]) started.

> Task :runners:direct-java:classes UP-TO-DATE
Skipping task ':runners:direct-java:classes' as it has no actions.
:runners:direct-java:classes (Thread[included builds,5,main]) completed. Took 0.0 secs.
Resolve mutations for :runners:direct-java:shadowJar (Thread[Execution worker Thread 7,5,main]) started.
Resolve mutations for :runners:direct-java:shadowJar (Thread[Execution worker Thread 7,5,main]) completed. Took 0.0 secs.
:runners:direct-java:shadowJar (Thread[Execution worker Thread 4,5,main]) started.

> Task :runners:core-java:testJar
Caching disabled for task ':runners:core-java:testJar' because:
  Not worth caching
Task ':runners:core-java:testJar' is not up-to-date because:
  No history is available.
file or directory '<https://ci-beam.apache.org/job/beam_PerformanceTests_InfluxDbIO_IT/ws/src/runners/core-java/build/resources/test',> not found
:runners:core-java:testJar (Thread[Execution worker Thread 5,5,main]) completed. Took 0.034 secs.
work action resolve beam-runners-core-java-tests.jar (project :runners:core-java) (Thread[included builds,5,main]) started.
work action null (Thread[included builds,5,main]) completed. Took 0.0 secs.

> Task :runners:direct-java:shadowJar FROM-CACHE
Custom actions are attached to task ':runners:direct-java:shadowJar'.
Build cache key for task ':runners:direct-java:shadowJar' is c6113ad7db3d8881cf8ecb6faaffef1b
Task ':runners:direct-java:shadowJar' is not up-to-date because:
  No history is available.
Loaded cache entry for task ':runners:direct-java:shadowJar' with cache key c6113ad7db3d8881cf8ecb6faaffef1b
:runners:direct-java:shadowJar (Thread[Execution worker Thread 4,5,main]) completed. Took 0.292 secs.
work action resolve beam-runners-direct-java.jar (project :runners:direct-java) (Thread[Execution worker Thread 5,5,main]) started.
work action null (Thread[Execution worker Thread 5,5,main]) completed. Took 0.0 secs.
work action resolve beam-runners-direct-java.jar (project :runners:direct-java) (Thread[Execution worker,5,main]) started.
work action null (Thread[Execution worker,5,main]) completed. Took 0.0 secs.
Resolve mutations for :runners:direct-java:compileTestJava (Thread[Execution worker Thread 2,5,main]) started.
Resolve mutations for :runners:direct-java:compileTestJava (Thread[Execution worker Thread 2,5,main]) completed. Took 0.0 secs.
:runners:direct-java:compileTestJava (Thread[Execution worker Thread 5,5,main]) started.

> Task :runners:direct-java:compileTestJava FROM-CACHE
Custom actions are attached to task ':runners:direct-java:compileTestJava'.
Build cache key for task ':runners:direct-java:compileTestJava' is 79fe0aaa977d1894100ff4f6936cf445
Task ':runners:direct-java:compileTestJava' is not up-to-date because:
  No history is available.
Loaded cache entry for task ':runners:direct-java:compileTestJava' with cache key 79fe0aaa977d1894100ff4f6936cf445
:runners:direct-java:compileTestJava (Thread[Execution worker Thread 5,5,main]) completed. Took 0.103 secs.
Resolve mutations for :runners:direct-java:testClasses (Thread[Execution worker Thread 5,5,main]) started.
Resolve mutations for :runners:direct-java:testClasses (Thread[Execution worker Thread 5,5,main]) completed. Took 0.0 secs.
:runners:direct-java:testClasses (Thread[Execution worker Thread 5,5,main]) started.

> Task :runners:direct-java:testClasses UP-TO-DATE
Skipping task ':runners:direct-java:testClasses' as it has no actions.
:runners:direct-java:testClasses (Thread[Execution worker Thread 5,5,main]) completed. Took 0.0 secs.
Resolve mutations for :runners:direct-java:shadowTestJar (Thread[Execution worker Thread 7,5,main]) started.
Resolve mutations for :runners:direct-java:shadowTestJar (Thread[Execution worker Thread 7,5,main]) completed. Took 0.0 secs.
:runners:direct-java:shadowTestJar (Thread[Execution worker,5,main]) started.

> Task :runners:direct-java:shadowTestJar FROM-CACHE
Build cache key for task ':runners:direct-java:shadowTestJar' is 8ebad141a8ec730c2de2e48b435cd66f
Task ':runners:direct-java:shadowTestJar' is not up-to-date because:
  No history is available.
Loaded cache entry for task ':runners:direct-java:shadowTestJar' with cache key 8ebad141a8ec730c2de2e48b435cd66f
:runners:direct-java:shadowTestJar (Thread[Execution worker,5,main]) completed. Took 0.199 secs.
work action resolve beam-runners-direct-java-tests.jar (project :runners:direct-java) (Thread[Execution worker,5,main]) started.
work action null (Thread[Execution worker,5,main]) completed. Took 0.0 secs.
Resolve mutations for :sdks:java:io:influxdb:integrationTest (Thread[included builds,5,main]) started.
Resolve mutations for :sdks:java:io:influxdb:integrationTest (Thread[included builds,5,main]) completed. Took 0.0 secs.
:sdks:java:io:influxdb:integrationTest (Thread[Execution worker Thread 2,5,main]) started.
producer locations for task group 0 (Thread[included builds,5,main]) started.
producer locations for task group 0 (Thread[included builds,5,main]) completed. Took 0.0 secs.
Gradle Test Executor 146 started executing tests.

> Task :sdks:java:io:influxdb:integrationTest
Custom actions are attached to task ':sdks:java:io:influxdb:integrationTest'.
Build cache key for task ':sdks:java:io:influxdb:integrationTest' is 46b185c1bf94b10ab16e3ace4507d294
Task ':sdks:java:io:influxdb:integrationTest' is not up-to-date because:
  Task.upToDateWhen is false.
Starting process 'Gradle Test Executor 146'. Working directory: <https://ci-beam.apache.org/job/beam_PerformanceTests_InfluxDbIO_IT/ws/src/sdks/java/io/influxdb> Command: /usr/lib/jvm/java-8-openjdk-amd64/bin/java -DbeamTestPipelineOptions=["--influxDBURL=http://34.134.20.136:8086","--influxDBUserName=superadmin","--influxDBPassword=supersecretpassword","--databaseName=db1"] -Djava.security.manager=worker.org.gradle.process.internal.worker.child.BootstrapSecurityManager -Dorg.gradle.internal.worker.tmpdir=<https://ci-beam.apache.org/job/beam_PerformanceTests_InfluxDbIO_IT/ws/src/sdks/java/io/influxdb/build/tmp/integrationTest/work> -Dorg.gradle.native=false -Xmx2g -Dfile.encoding=UTF-8 -Duser.country=US -Duser.language=en -Duser.variant -ea -cp /home/jenkins/.gradle/caches/7.5.1/workerMain/gradle-worker.jar worker.org.gradle.process.internal.worker.GradleWorkerMain 'Gradle Test Executor 146'
Successfully started process 'Gradle Test Executor 146'

org.apache.beam.sdk.io.influxdb.InfluxDbIOIT > testWriteAndReadWithMultipleMetric FAILED
    org.influxdb.InfluxDBIOException: java.net.SocketTimeoutException: connect timed out
        at org.influxdb.impl.InfluxDBImpl.execute(InfluxDBImpl.java:836)
        at org.influxdb.impl.InfluxDBImpl.executeQuery(InfluxDBImpl.java:819)
        at org.influxdb.impl.InfluxDBImpl.query(InfluxDBImpl.java:554)
        at org.apache.beam.sdk.io.influxdb.InfluxDbIOIT.initTest(InfluxDbIOIT.java:99)

        Caused by:
        java.net.SocketTimeoutException: connect timed out
            at java.net.PlainSocketImpl.socketConnect(Native Method)
            at java.net.AbstractPlainSocketImpl.doConnect(AbstractPlainSocketImpl.java:350)
            at java.net.AbstractPlainSocketImpl.connectToAddress(AbstractPlainSocketImpl.java:206)
            at java.net.AbstractPlainSocketImpl.connect(AbstractPlainSocketImpl.java:188)
            at java.net.SocksSocketImpl.connect(SocksSocketImpl.java:392)
            at java.net.Socket.connect(Socket.java:607)
            at okhttp3.internal.platform.Platform.connectSocket(Platform.kt:119)
            at okhttp3.internal.connection.RealConnection.connectSocket(RealConnection.kt:283)
            at okhttp3.internal.connection.RealConnection.connect(RealConnection.kt:195)
            at okhttp3.internal.connection.ExchangeFinder.findConnection(ExchangeFinder.kt:249)
            at okhttp3.internal.connection.ExchangeFinder.findHealthyConnection(ExchangeFinder.kt:108)
            at okhttp3.internal.connection.ExchangeFinder.find(ExchangeFinder.kt:76)
            at okhttp3.internal.connection.RealCall.initExchange$okhttp(RealCall.kt:245)
            at okhttp3.internal.connection.ConnectInterceptor.intercept(ConnectInterceptor.kt:32)
            at okhttp3.internal.http.RealInterceptorChain.proceed(RealInterceptorChain.kt:100)
            at okhttp3.internal.cache.CacheInterceptor.intercept(CacheInterceptor.kt:82)
            at okhttp3.internal.http.RealInterceptorChain.proceed(RealInterceptorChain.kt:100)
            at okhttp3.internal.http.BridgeInterceptor.intercept(BridgeInterceptor.kt:83)
            at okhttp3.internal.http.RealInterceptorChain.proceed(RealInterceptorChain.kt:100)
            at okhttp3.internal.http.RetryAndFollowUpInterceptor.intercept(RetryAndFollowUpInterceptor.kt:76)
            at okhttp3.internal.http.RealInterceptorChain.proceed(RealInterceptorChain.kt:100)
            at org.influxdb.impl.BasicAuthInterceptor.intercept(BasicAuthInterceptor.java:22)
            at okhttp3.internal.http.RealInterceptorChain.proceed(RealInterceptorChain.kt:100)
            at org.influxdb.impl.GzipRequestInterceptor.intercept(GzipRequestInterceptor.java:42)
            at okhttp3.internal.http.RealInterceptorChain.proceed(RealInterceptorChain.kt:100)
            at okhttp3.logging.HttpLoggingInterceptor.intercept(HttpLoggingInterceptor.kt:152)
            at okhttp3.internal.http.RealInterceptorChain.proceed(RealInterceptorChain.kt:100)
            at okhttp3.internal.connection.RealCall.getResponseWithInterceptorChain$okhttp(RealCall.kt:197)
            at okhttp3.internal.connection.RealCall.execute(RealCall.kt:148)
            at retrofit2.OkHttpCall.execute(OkHttpCall.java:190)
            at org.influxdb.impl.InfluxDBImpl.execute(InfluxDBImpl.java:824)
            ... 3 more

    org.influxdb.InfluxDBIOException: java.net.SocketTimeoutException: connect timed out
        at org.influxdb.impl.InfluxDBImpl.execute(InfluxDBImpl.java:836)
        at org.influxdb.impl.InfluxDBImpl.executeQuery(InfluxDBImpl.java:819)
        at org.influxdb.impl.InfluxDBImpl.query(InfluxDBImpl.java:554)
        at org.apache.beam.sdk.io.influxdb.InfluxDbIOIT.clear(InfluxDbIOIT.java:88)

        Caused by:
        java.net.SocketTimeoutException: connect timed out
            at java.net.PlainSocketImpl.socketConnect(Native Method)
            at java.net.AbstractPlainSocketImpl.doConnect(AbstractPlainSocketImpl.java:350)
            at java.net.AbstractPlainSocketImpl.connectToAddress(AbstractPlainSocketImpl.java:206)
            at java.net.AbstractPlainSocketImpl.connect(AbstractPlainSocketImpl.java:188)
            at java.net.SocksSocketImpl.connect(SocksSocketImpl.java:392)
            at java.net.Socket.connect(Socket.java:607)
            at okhttp3.internal.platform.Platform.connectSocket(Platform.kt:119)
            at okhttp3.internal.connection.RealConnection.connectSocket(RealConnection.kt:283)
            at okhttp3.internal.connection.RealConnection.connect(RealConnection.kt:195)
            at okhttp3.internal.connection.ExchangeFinder.findConnection(ExchangeFinder.kt:249)
            at okhttp3.internal.connection.ExchangeFinder.findHealthyConnection(ExchangeFinder.kt:108)
            at okhttp3.internal.connection.ExchangeFinder.find(ExchangeFinder.kt:76)
            at okhttp3.internal.connection.RealCall.initExchange$okhttp(RealCall.kt:245)
            at okhttp3.internal.connection.ConnectInterceptor.intercept(ConnectInterceptor.kt:32)
            at okhttp3.internal.http.RealInterceptorChain.proceed(RealInterceptorChain.kt:100)
            at okhttp3.internal.cache.CacheInterceptor.intercept(CacheInterceptor.kt:82)
            at okhttp3.internal.http.RealInterceptorChain.proceed(RealInterceptorChain.kt:100)
            at okhttp3.internal.http.BridgeInterceptor.intercept(BridgeInterceptor.kt:83)
            at okhttp3.internal.http.RealInterceptorChain.proceed(RealInterceptorChain.kt:100)
            at okhttp3.internal.http.RetryAndFollowUpInterceptor.intercept(RetryAndFollowUpInterceptor.kt:76)
            at okhttp3.internal.http.RealInterceptorChain.proceed(RealInterceptorChain.kt:100)
            at org.influxdb.impl.BasicAuthInterceptor.intercept(BasicAuthInterceptor.java:22)
            at okhttp3.internal.http.RealInterceptorChain.proceed(RealInterceptorChain.kt:100)
            at org.influxdb.impl.GzipRequestInterceptor.intercept(GzipRequestInterceptor.java:42)
            at okhttp3.internal.http.RealInterceptorChain.proceed(RealInterceptorChain.kt:100)
            at okhttp3.logging.HttpLoggingInterceptor.intercept(HttpLoggingInterceptor.kt:152)
            at okhttp3.internal.http.RealInterceptorChain.proceed(RealInterceptorChain.kt:100)
            at okhttp3.internal.connection.RealCall.getResponseWithInterceptorChain$okhttp(RealCall.kt:197)
            at okhttp3.internal.connection.RealCall.execute(RealCall.kt:148)
            at retrofit2.OkHttpCall.execute(OkHttpCall.java:190)
            at org.influxdb.impl.InfluxDBImpl.execute(InfluxDBImpl.java:824)
            ... 3 more

Gradle Test Executor 146 finished executing tests.

> Task :sdks:java:io:influxdb:integrationTest FAILED

6 tests completed, 1 failed
Finished generating test XML results (0.001 secs) into: <https://ci-beam.apache.org/job/beam_PerformanceTests_InfluxDbIO_IT/ws/src/sdks/java/io/influxdb/build/test-results/integrationTest>
Generating HTML test report...
Finished generating test html results (0.003 secs) into: <https://ci-beam.apache.org/job/beam_PerformanceTests_InfluxDbIO_IT/ws/src/sdks/java/io/influxdb/build/reports/tests/integrationTest>
:sdks:java:io:influxdb:integrationTest (Thread[Execution worker Thread 2,5,main]) completed. Took 33.862 secs.

FAILURE: Build failed with an exception.

* What went wrong:
Execution failed for task ':sdks:java:io:influxdb:integrationTest'.
> There were failing tests. See the report at: file://<https://ci-beam.apache.org/job/beam_PerformanceTests_InfluxDbIO_IT/ws/src/sdks/java/io/influxdb/build/reports/tests/integrationTest/index.html>

* Try:
> Run with --stacktrace option to get the stack trace.
> Run with --debug option to get more log output.

* Get more help at https://help.gradle.org

Deprecated Gradle features were used in this build, making it incompatible with Gradle 8.0.

You can use '--warning-mode all' to show the individual deprecation warnings and determine if they come from your own scripts or plugins.

See https://docs.gradle.org/7.5.1/userguide/command_line_interface.html#sec:command_line_warnings

BUILD FAILED in 41s
77 actionable tasks: 42 executed, 33 from cache, 2 up-to-date

Publishing build scan...
https://gradle.com/s/nafrjz4dzqi7e

Build step 'Invoke Gradle script' changed build result to FAILURE
Build step 'Invoke Gradle script' marked build as failure

---------------------------------------------------------------------
To unsubscribe, e-mail: builds-unsubscribe@beam.apache.org
For additional commands, e-mail: builds-help@beam.apache.org


Build failed in Jenkins: beam_PerformanceTests_InfluxDbIO_IT #2322

Posted by Apache Jenkins Server <je...@builds.apache.org>.
See <https://ci-beam.apache.org/job/beam_PerformanceTests_InfluxDbIO_IT/2322/display/redirect>

Changes:


------------------------------------------
[...truncated 181.96 KB...]
:sdks:java:core:shadowTestJar (Thread[included builds,5,main]) completed. Took 0.132 secs.
work action resolve beam-sdks-java-core-tests.jar (project :sdks:java:core) (Thread[included builds,5,main]) started.
work action null (Thread[included builds,5,main]) completed. Took 0.0 secs.
Resolve mutations for :runners:core-java:compileTestJava (Thread[included builds,5,main]) started.
Resolve mutations for :runners:core-java:compileTestJava (Thread[included builds,5,main]) completed. Took 0.0 secs.
:runners:core-java:compileTestJava (Thread[Execution worker,5,main]) started.

> Task :sdks:java:harness:compileJava FROM-CACHE
Custom actions are attached to task ':sdks:java:harness:compileJava'.
Build cache key for task ':sdks:java:harness:compileJava' is 68187c0268e7e364f01af188c8badebb
Task ':sdks:java:harness:compileJava' is not up-to-date because:
  No history is available.
Loaded cache entry for task ':sdks:java:harness:compileJava' with cache key 68187c0268e7e364f01af188c8badebb
:sdks:java:harness:compileJava (Thread[Execution worker Thread 2,5,main]) completed. Took 0.089 secs.
Resolve mutations for :sdks:java:harness:classes (Thread[Execution worker Thread 2,5,main]) started.
Resolve mutations for :sdks:java:harness:classes (Thread[Execution worker Thread 2,5,main]) completed. Took 0.0 secs.
:sdks:java:harness:classes (Thread[Execution worker Thread 4,5,main]) started.

> Task :sdks:java:harness:classes UP-TO-DATE
Skipping task ':sdks:java:harness:classes' as it has no actions.
:sdks:java:harness:classes (Thread[Execution worker Thread 4,5,main]) completed. Took 0.0 secs.
Resolve mutations for :sdks:java:harness:jar (Thread[Execution worker Thread 6,5,main]) started.
Resolve mutations for :sdks:java:harness:jar (Thread[Execution worker Thread 6,5,main]) completed. Took 0.0 secs.
:sdks:java:harness:jar (Thread[Execution worker Thread 2,5,main]) started.

> Task :sdks:java:harness:jar
Caching disabled for task ':sdks:java:harness:jar' because:
  Not worth caching
Task ':sdks:java:harness:jar' is not up-to-date because:
  No history is available.
file or directory '<https://ci-beam.apache.org/job/beam_PerformanceTests_InfluxDbIO_IT/ws/src/sdks/java/harness/build/resources/main',> not found
:sdks:java:harness:jar (Thread[Execution worker Thread 2,5,main]) completed. Took 0.061 secs.
work action resolve beam-sdks-java-harness-unshaded.jar (project :sdks:java:harness) (Thread[Execution worker Thread 2,5,main]) started.
work action null (Thread[Execution worker Thread 2,5,main]) completed. Took 0.0 secs.
Resolve mutations for :runners:java-fn-execution:compileJava (Thread[Execution worker Thread 2,5,main]) started.
Resolve mutations for :runners:java-fn-execution:compileJava (Thread[Execution worker Thread 2,5,main]) completed. Took 0.0 secs.
:runners:java-fn-execution:compileJava (Thread[Execution worker Thread 2,5,main]) started.

> Task :runners:java-fn-execution:compileJava FROM-CACHE
Custom actions are attached to task ':runners:java-fn-execution:compileJava'.
Build cache key for task ':runners:java-fn-execution:compileJava' is 847afbf388a7f9a9ea7abc1cb81d9434
Task ':runners:java-fn-execution:compileJava' is not up-to-date because:
  No history is available.
Loaded cache entry for task ':runners:java-fn-execution:compileJava' with cache key 847afbf388a7f9a9ea7abc1cb81d9434
:runners:java-fn-execution:compileJava (Thread[Execution worker Thread 2,5,main]) completed. Took 0.092 secs.
Resolve mutations for :runners:java-fn-execution:classes (Thread[Execution worker Thread 2,5,main]) started.
Resolve mutations for :runners:java-fn-execution:classes (Thread[Execution worker Thread 2,5,main]) completed. Took 0.0 secs.
:runners:java-fn-execution:classes (Thread[Execution worker Thread 2,5,main]) started.

> Task :runners:java-fn-execution:classes UP-TO-DATE
Skipping task ':runners:java-fn-execution:classes' as it has no actions.
:runners:java-fn-execution:classes (Thread[Execution worker Thread 2,5,main]) completed. Took 0.0 secs.
Resolve mutations for :runners:java-fn-execution:jar (Thread[Execution worker Thread 2,5,main]) started.
Resolve mutations for :runners:java-fn-execution:jar (Thread[Execution worker Thread 2,5,main]) completed. Took 0.0 secs.
:runners:java-fn-execution:jar (Thread[Execution worker Thread 2,5,main]) started.

> Task :runners:java-fn-execution:jar
Caching disabled for task ':runners:java-fn-execution:jar' because:
  Not worth caching
Task ':runners:java-fn-execution:jar' is not up-to-date because:
  No history is available.
file or directory '<https://ci-beam.apache.org/job/beam_PerformanceTests_InfluxDbIO_IT/ws/src/runners/java-fn-execution/build/resources/main',> not found
:runners:java-fn-execution:jar (Thread[Execution worker Thread 2,5,main]) completed. Took 0.042 secs.
work action resolve beam-runners-java-fn-execution.jar (project :runners:java-fn-execution) (Thread[Execution worker Thread 7,5,main]) started.
work action null (Thread[Execution worker Thread 7,5,main]) completed. Took 0.0 secs.
Resolve mutations for :runners:direct-java:compileJava (Thread[Execution worker Thread 6,5,main]) started.
Resolve mutations for :runners:direct-java:compileJava (Thread[Execution worker Thread 6,5,main]) completed. Took 0.0 secs.
:runners:direct-java:compileJava (Thread[Execution worker Thread 2,5,main]) started.

> Task :runners:core-java:compileTestJava FROM-CACHE
Custom actions are attached to task ':runners:core-java:compileTestJava'.
Build cache key for task ':runners:core-java:compileTestJava' is 58aa36c6f9005ce309aa150dccbe1d73
Task ':runners:core-java:compileTestJava' is not up-to-date because:
  No history is available.
Loaded cache entry for task ':runners:core-java:compileTestJava' with cache key 58aa36c6f9005ce309aa150dccbe1d73
:runners:core-java:compileTestJava (Thread[Execution worker,5,main]) completed. Took 0.331 secs.
Resolve mutations for :runners:core-java:testClasses (Thread[Execution worker,5,main]) started.
Resolve mutations for :runners:core-java:testClasses (Thread[Execution worker,5,main]) completed. Took 0.0 secs.
:runners:core-java:testClasses (Thread[Execution worker,5,main]) started.

> Task :runners:core-java:testClasses UP-TO-DATE
Skipping task ':runners:core-java:testClasses' as it has no actions.
:runners:core-java:testClasses (Thread[Execution worker,5,main]) completed. Took 0.0 secs.
Resolve mutations for :runners:core-java:testJar (Thread[included builds,5,main]) started.
Resolve mutations for :runners:core-java:testJar (Thread[included builds,5,main]) completed. Took 0.0 secs.
:runners:core-java:testJar (Thread[Execution worker Thread 7,5,main]) started.

> Task :runners:direct-java:compileJava FROM-CACHE
Custom actions are attached to task ':runners:direct-java:compileJava'.
Build cache key for task ':runners:direct-java:compileJava' is 4680edce0596cb0762368f20d4c80798
Task ':runners:direct-java:compileJava' is not up-to-date because:
  No history is available.
Loaded cache entry for task ':runners:direct-java:compileJava' with cache key 4680edce0596cb0762368f20d4c80798
:runners:direct-java:compileJava (Thread[Execution worker Thread 2,5,main]) completed. Took 0.103 secs.
Resolve mutations for :runners:direct-java:classes (Thread[Execution worker Thread 2,5,main]) started.
Resolve mutations for :runners:direct-java:classes (Thread[Execution worker Thread 2,5,main]) completed. Took 0.0 secs.
:runners:direct-java:classes (Thread[Execution worker Thread 2,5,main]) started.

> Task :runners:direct-java:classes UP-TO-DATE
Skipping task ':runners:direct-java:classes' as it has no actions.
:runners:direct-java:classes (Thread[Execution worker Thread 2,5,main]) completed. Took 0.0 secs.
Resolve mutations for :runners:direct-java:shadowJar (Thread[Execution worker Thread 5,5,main]) started.
Resolve mutations for :runners:direct-java:shadowJar (Thread[Execution worker Thread 5,5,main]) completed. Took 0.0 secs.
:runners:direct-java:shadowJar (Thread[Execution worker,5,main]) started.

> Task :runners:core-java:testJar
Caching disabled for task ':runners:core-java:testJar' because:
  Not worth caching
Task ':runners:core-java:testJar' is not up-to-date because:
  No history is available.
file or directory '<https://ci-beam.apache.org/job/beam_PerformanceTests_InfluxDbIO_IT/ws/src/runners/core-java/build/resources/test',> not found
:runners:core-java:testJar (Thread[Execution worker Thread 7,5,main]) completed. Took 0.037 secs.
work action resolve beam-runners-core-java-tests.jar (project :runners:core-java) (Thread[Execution worker Thread 2,5,main]) started.
work action null (Thread[Execution worker Thread 2,5,main]) completed. Took 0.0 secs.

> Task :runners:direct-java:shadowJar FROM-CACHE
Custom actions are attached to task ':runners:direct-java:shadowJar'.
Build cache key for task ':runners:direct-java:shadowJar' is c6113ad7db3d8881cf8ecb6faaffef1b
Task ':runners:direct-java:shadowJar' is not up-to-date because:
  No history is available.
Loaded cache entry for task ':runners:direct-java:shadowJar' with cache key c6113ad7db3d8881cf8ecb6faaffef1b
:runners:direct-java:shadowJar (Thread[Execution worker,5,main]) completed. Took 0.303 secs.
work action resolve beam-runners-direct-java.jar (project :runners:direct-java) (Thread[Execution worker,5,main]) started.
work action null (Thread[Execution worker,5,main]) completed. Took 0.0 secs.
work action resolve beam-runners-direct-java.jar (project :runners:direct-java) (Thread[Execution worker,5,main]) started.
work action null (Thread[Execution worker,5,main]) completed. Took 0.0 secs.
Resolve mutations for :runners:direct-java:compileTestJava (Thread[Execution worker,5,main]) started.
Resolve mutations for :runners:direct-java:compileTestJava (Thread[Execution worker,5,main]) completed. Took 0.0 secs.
:runners:direct-java:compileTestJava (Thread[Execution worker Thread 7,5,main]) started.

> Task :runners:direct-java:compileTestJava FROM-CACHE
Custom actions are attached to task ':runners:direct-java:compileTestJava'.
Build cache key for task ':runners:direct-java:compileTestJava' is 79fe0aaa977d1894100ff4f6936cf445
Task ':runners:direct-java:compileTestJava' is not up-to-date because:
  No history is available.
Loaded cache entry for task ':runners:direct-java:compileTestJava' with cache key 79fe0aaa977d1894100ff4f6936cf445
:runners:direct-java:compileTestJava (Thread[Execution worker Thread 7,5,main]) completed. Took 0.107 secs.
Resolve mutations for :runners:direct-java:testClasses (Thread[Execution worker,5,main]) started.
Resolve mutations for :runners:direct-java:testClasses (Thread[Execution worker,5,main]) completed. Took 0.0 secs.
:runners:direct-java:testClasses (Thread[Execution worker,5,main]) started.

> Task :runners:direct-java:testClasses UP-TO-DATE
Skipping task ':runners:direct-java:testClasses' as it has no actions.
:runners:direct-java:testClasses (Thread[Execution worker,5,main]) completed. Took 0.0 secs.
Resolve mutations for :runners:direct-java:shadowTestJar (Thread[Execution worker Thread 2,5,main]) started.
Resolve mutations for :runners:direct-java:shadowTestJar (Thread[Execution worker Thread 2,5,main]) completed. Took 0.0 secs.
:runners:direct-java:shadowTestJar (Thread[Execution worker Thread 7,5,main]) started.

> Task :runners:direct-java:shadowTestJar FROM-CACHE
Build cache key for task ':runners:direct-java:shadowTestJar' is 8ebad141a8ec730c2de2e48b435cd66f
Task ':runners:direct-java:shadowTestJar' is not up-to-date because:
  No history is available.
Loaded cache entry for task ':runners:direct-java:shadowTestJar' with cache key 8ebad141a8ec730c2de2e48b435cd66f
:runners:direct-java:shadowTestJar (Thread[Execution worker Thread 7,5,main]) completed. Took 0.211 secs.
work action resolve beam-runners-direct-java-tests.jar (project :runners:direct-java) (Thread[Execution worker,5,main]) started.
work action null (Thread[Execution worker,5,main]) completed. Took 0.0 secs.
Resolve mutations for :sdks:java:io:influxdb:integrationTest (Thread[Execution worker Thread 3,5,main]) started.
Resolve mutations for :sdks:java:io:influxdb:integrationTest (Thread[Execution worker Thread 3,5,main]) completed. Took 0.0 secs.
:sdks:java:io:influxdb:integrationTest (Thread[Execution worker Thread 7,5,main]) started.
producer locations for task group 0 (Thread[Execution worker Thread 3,5,main]) started.
producer locations for task group 0 (Thread[Execution worker Thread 3,5,main]) completed. Took 0.0 secs.
Gradle Test Executor 135 started executing tests.

> Task :sdks:java:io:influxdb:integrationTest
Custom actions are attached to task ':sdks:java:io:influxdb:integrationTest'.
Build cache key for task ':sdks:java:io:influxdb:integrationTest' is 46b185c1bf94b10ab16e3ace4507d294
Task ':sdks:java:io:influxdb:integrationTest' is not up-to-date because:
  Task.upToDateWhen is false.
Starting process 'Gradle Test Executor 135'. Working directory: <https://ci-beam.apache.org/job/beam_PerformanceTests_InfluxDbIO_IT/ws/src/sdks/java/io/influxdb> Command: /usr/lib/jvm/java-8-openjdk-amd64/bin/java -DbeamTestPipelineOptions=["--influxDBURL=http://35.193.126.177:8086","--influxDBUserName=superadmin","--influxDBPassword=supersecretpassword","--databaseName=db1"] -Djava.security.manager=worker.org.gradle.process.internal.worker.child.BootstrapSecurityManager -Dorg.gradle.internal.worker.tmpdir=<https://ci-beam.apache.org/job/beam_PerformanceTests_InfluxDbIO_IT/ws/src/sdks/java/io/influxdb/build/tmp/integrationTest/work> -Dorg.gradle.native=false -Xmx2g -Dfile.encoding=UTF-8 -Duser.country=US -Duser.language=en -Duser.variant -ea -cp /home/jenkins/.gradle/caches/7.5.1/workerMain/gradle-worker.jar worker.org.gradle.process.internal.worker.GradleWorkerMain 'Gradle Test Executor 135'
Successfully started process 'Gradle Test Executor 135'

org.apache.beam.sdk.io.influxdb.InfluxDbIOIT > testWriteAndReadWithMultipleMetric FAILED
    org.influxdb.InfluxDBIOException: java.net.SocketTimeoutException: connect timed out
        at org.influxdb.impl.InfluxDBImpl.execute(InfluxDBImpl.java:836)
        at org.influxdb.impl.InfluxDBImpl.executeQuery(InfluxDBImpl.java:819)
        at org.influxdb.impl.InfluxDBImpl.query(InfluxDBImpl.java:554)
        at org.apache.beam.sdk.io.influxdb.InfluxDbIOIT.initTest(InfluxDbIOIT.java:99)

        Caused by:
        java.net.SocketTimeoutException: connect timed out
            at java.net.PlainSocketImpl.socketConnect(Native Method)
            at java.net.AbstractPlainSocketImpl.doConnect(AbstractPlainSocketImpl.java:350)
            at java.net.AbstractPlainSocketImpl.connectToAddress(AbstractPlainSocketImpl.java:206)
            at java.net.AbstractPlainSocketImpl.connect(AbstractPlainSocketImpl.java:188)
            at java.net.SocksSocketImpl.connect(SocksSocketImpl.java:392)
            at java.net.Socket.connect(Socket.java:607)
            at okhttp3.internal.platform.Platform.connectSocket(Platform.kt:119)
            at okhttp3.internal.connection.RealConnection.connectSocket(RealConnection.kt:283)
            at okhttp3.internal.connection.RealConnection.connect(RealConnection.kt:195)
            at okhttp3.internal.connection.ExchangeFinder.findConnection(ExchangeFinder.kt:249)
            at okhttp3.internal.connection.ExchangeFinder.findHealthyConnection(ExchangeFinder.kt:108)
            at okhttp3.internal.connection.ExchangeFinder.find(ExchangeFinder.kt:76)
            at okhttp3.internal.connection.RealCall.initExchange$okhttp(RealCall.kt:245)
            at okhttp3.internal.connection.ConnectInterceptor.intercept(ConnectInterceptor.kt:32)
            at okhttp3.internal.http.RealInterceptorChain.proceed(RealInterceptorChain.kt:100)
            at okhttp3.internal.cache.CacheInterceptor.intercept(CacheInterceptor.kt:82)
            at okhttp3.internal.http.RealInterceptorChain.proceed(RealInterceptorChain.kt:100)
            at okhttp3.internal.http.BridgeInterceptor.intercept(BridgeInterceptor.kt:83)
            at okhttp3.internal.http.RealInterceptorChain.proceed(RealInterceptorChain.kt:100)
            at okhttp3.internal.http.RetryAndFollowUpInterceptor.intercept(RetryAndFollowUpInterceptor.kt:76)
            at okhttp3.internal.http.RealInterceptorChain.proceed(RealInterceptorChain.kt:100)
            at org.influxdb.impl.BasicAuthInterceptor.intercept(BasicAuthInterceptor.java:22)
            at okhttp3.internal.http.RealInterceptorChain.proceed(RealInterceptorChain.kt:100)
            at org.influxdb.impl.GzipRequestInterceptor.intercept(GzipRequestInterceptor.java:42)
            at okhttp3.internal.http.RealInterceptorChain.proceed(RealInterceptorChain.kt:100)
            at okhttp3.logging.HttpLoggingInterceptor.intercept(HttpLoggingInterceptor.kt:152)
            at okhttp3.internal.http.RealInterceptorChain.proceed(RealInterceptorChain.kt:100)
            at okhttp3.internal.connection.RealCall.getResponseWithInterceptorChain$okhttp(RealCall.kt:197)
            at okhttp3.internal.connection.RealCall.execute(RealCall.kt:148)
            at retrofit2.OkHttpCall.execute(OkHttpCall.java:190)
            at org.influxdb.impl.InfluxDBImpl.execute(InfluxDBImpl.java:824)
            ... 3 more

Gradle Test Executor 135 finished executing tests.

> Task :sdks:java:io:influxdb:integrationTest FAILED

6 tests completed, 1 failed
Finished generating test XML results (0.001 secs) into: <https://ci-beam.apache.org/job/beam_PerformanceTests_InfluxDbIO_IT/ws/src/sdks/java/io/influxdb/build/test-results/integrationTest>
Generating HTML test report...
Finished generating test html results (0.002 secs) into: <https://ci-beam.apache.org/job/beam_PerformanceTests_InfluxDbIO_IT/ws/src/sdks/java/io/influxdb/build/reports/tests/integrationTest>
:sdks:java:io:influxdb:integrationTest (Thread[Execution worker Thread 7,5,main]) completed. Took 26.337 secs.

FAILURE: Build failed with an exception.

* What went wrong:
Execution failed for task ':sdks:java:io:influxdb:integrationTest'.
> There were failing tests. See the report at: file://<https://ci-beam.apache.org/job/beam_PerformanceTests_InfluxDbIO_IT/ws/src/sdks/java/io/influxdb/build/reports/tests/integrationTest/index.html>

* Try:
> Run with --stacktrace option to get the stack trace.
> Run with --debug option to get more log output.

* Get more help at https://help.gradle.org

Deprecated Gradle features were used in this build, making it incompatible with Gradle 8.0.

You can use '--warning-mode all' to show the individual deprecation warnings and determine if they come from your own scripts or plugins.

See https://docs.gradle.org/7.5.1/userguide/command_line_interface.html#sec:command_line_warnings

BUILD FAILED in 34s
77 actionable tasks: 42 executed, 33 from cache, 2 up-to-date

Publishing build scan...
https://gradle.com/s/ckpqugacsnjty

Build step 'Invoke Gradle script' changed build result to FAILURE
Build step 'Invoke Gradle script' marked build as failure

---------------------------------------------------------------------
To unsubscribe, e-mail: builds-unsubscribe@beam.apache.org
For additional commands, e-mail: builds-help@beam.apache.org


Build failed in Jenkins: beam_PerformanceTests_InfluxDbIO_IT #2321

Posted by Apache Jenkins Server <je...@builds.apache.org>.
See <https://ci-beam.apache.org/job/beam_PerformanceTests_InfluxDbIO_IT/2321/display/redirect?page=changes>

Changes:

[noreply] Resolve script parsing error when changing from bash to sh. (#23199)

[noreply] Bump cloud.google.com/go/bigquery from 1.39.0 to 1.40.0 in /sdks

[noreply] Bump github.com/google/go-cmp from 0.5.8 to 0.5.9 in /sdks (#23123)

[noreply] Update google-cloud-bigquery requirement from <3,>=1.6.0 to >=1.6.0,<4

[noreply] Optimize varint reading and writing for small ints. (#23192)


------------------------------------------
[...truncated 197.63 KB...]
Task ':runners:direct-java:shadowJar' is not up-to-date because:
  No history is available.
Loaded cache entry for task ':runners:direct-java:shadowJar' with cache key c6113ad7db3d8881cf8ecb6faaffef1b
:runners:direct-java:shadowJar (Thread[Execution worker Thread 2,5,main]) completed. Took 0.3 secs.
work action resolve beam-runners-direct-java.jar (project :runners:direct-java) (Thread[Execution worker Thread 2,5,main]) started.
work action null (Thread[Execution worker Thread 2,5,main]) completed. Took 0.0 secs.
work action resolve beam-runners-direct-java.jar (project :runners:direct-java) (Thread[Execution worker Thread 2,5,main]) started.
work action null (Thread[Execution worker Thread 2,5,main]) completed. Took 0.0 secs.
Resolve mutations for :runners:direct-java:compileTestJava (Thread[Execution worker Thread 2,5,main]) started.
Resolve mutations for :runners:direct-java:compileTestJava (Thread[Execution worker Thread 2,5,main]) completed. Took 0.0 secs.
:runners:direct-java:compileTestJava (Thread[Execution worker Thread 5,5,main]) started.

> Task :runners:direct-java:compileTestJava FROM-CACHE
Custom actions are attached to task ':runners:direct-java:compileTestJava'.
Build cache key for task ':runners:direct-java:compileTestJava' is 79fe0aaa977d1894100ff4f6936cf445
Task ':runners:direct-java:compileTestJava' is not up-to-date because:
  No history is available.
Loaded cache entry for task ':runners:direct-java:compileTestJava' with cache key 79fe0aaa977d1894100ff4f6936cf445
:runners:direct-java:compileTestJava (Thread[Execution worker Thread 5,5,main]) completed. Took 0.129 secs.
Resolve mutations for :runners:direct-java:testClasses (Thread[Execution worker Thread 6,5,main]) started.
Resolve mutations for :runners:direct-java:testClasses (Thread[Execution worker Thread 6,5,main]) completed. Took 0.0 secs.
:runners:direct-java:testClasses (Thread[Execution worker Thread 4,5,main]) started.

> Task :runners:direct-java:testClasses UP-TO-DATE
Skipping task ':runners:direct-java:testClasses' as it has no actions.
:runners:direct-java:testClasses (Thread[Execution worker Thread 4,5,main]) completed. Took 0.0 secs.
Resolve mutations for :runners:direct-java:shadowTestJar (Thread[Execution worker Thread 2,5,main]) started.
Resolve mutations for :runners:direct-java:shadowTestJar (Thread[Execution worker Thread 2,5,main]) completed. Took 0.0 secs.
:runners:direct-java:shadowTestJar (Thread[Execution worker Thread 5,5,main]) started.

> Task :runners:direct-java:shadowTestJar FROM-CACHE
Build cache key for task ':runners:direct-java:shadowTestJar' is 8ebad141a8ec730c2de2e48b435cd66f
Task ':runners:direct-java:shadowTestJar' is not up-to-date because:
  No history is available.
Loaded cache entry for task ':runners:direct-java:shadowTestJar' with cache key 8ebad141a8ec730c2de2e48b435cd66f
:runners:direct-java:shadowTestJar (Thread[Execution worker Thread 5,5,main]) completed. Took 0.2 secs.
work action resolve beam-runners-direct-java-tests.jar (project :runners:direct-java) (Thread[Execution worker Thread 5,5,main]) started.
work action null (Thread[Execution worker Thread 5,5,main]) completed. Took 0.0 secs.
Resolve mutations for :sdks:java:io:influxdb:integrationTest (Thread[Execution worker Thread 3,5,main]) started.
Resolve mutations for :sdks:java:io:influxdb:integrationTest (Thread[Execution worker Thread 3,5,main]) completed. Took 0.0 secs.
:sdks:java:io:influxdb:integrationTest (Thread[Execution worker Thread 4,5,main]) started.
producer locations for task group 0 (Thread[Execution worker Thread 3,5,main]) started.
producer locations for task group 0 (Thread[Execution worker Thread 3,5,main]) completed. Took 0.0 secs.
Gradle Test Executor 124 started executing tests.

> Task :sdks:java:io:influxdb:integrationTest
Custom actions are attached to task ':sdks:java:io:influxdb:integrationTest'.
Build cache key for task ':sdks:java:io:influxdb:integrationTest' is 46b185c1bf94b10ab16e3ace4507d294
Task ':sdks:java:io:influxdb:integrationTest' is not up-to-date because:
  Task.upToDateWhen is false.
Starting process 'Gradle Test Executor 124'. Working directory: <https://ci-beam.apache.org/job/beam_PerformanceTests_InfluxDbIO_IT/ws/src/sdks/java/io/influxdb> Command: /usr/lib/jvm/java-8-openjdk-amd64/bin/java -DbeamTestPipelineOptions=["--influxDBURL=http://34.173.2.193:8086","--influxDBUserName=superadmin","--influxDBPassword=supersecretpassword","--databaseName=db1"] -Djava.security.manager=worker.org.gradle.process.internal.worker.child.BootstrapSecurityManager -Dorg.gradle.internal.worker.tmpdir=<https://ci-beam.apache.org/job/beam_PerformanceTests_InfluxDbIO_IT/ws/src/sdks/java/io/influxdb/build/tmp/integrationTest/work> -Dorg.gradle.native=false -Xmx2g -Dfile.encoding=UTF-8 -Duser.country=US -Duser.language=en -Duser.variant -ea -cp /home/jenkins/.gradle/caches/7.5.1/workerMain/gradle-worker.jar worker.org.gradle.process.internal.worker.GradleWorkerMain 'Gradle Test Executor 124'
Successfully started process 'Gradle Test Executor 124'

org.apache.beam.sdk.io.influxdb.InfluxDbIOIT > testWriteAndReadWithMultipleMetric FAILED
    org.influxdb.InfluxDBIOException: java.net.SocketTimeoutException: connect timed out
        at org.influxdb.impl.InfluxDBImpl.execute(InfluxDBImpl.java:836)
        at org.influxdb.impl.InfluxDBImpl.executeQuery(InfluxDBImpl.java:819)
        at org.influxdb.impl.InfluxDBImpl.query(InfluxDBImpl.java:554)
        at org.apache.beam.sdk.io.influxdb.InfluxDbIOIT.initTest(InfluxDbIOIT.java:99)

        Caused by:
        java.net.SocketTimeoutException: connect timed out
            at java.net.PlainSocketImpl.socketConnect(Native Method)
            at java.net.AbstractPlainSocketImpl.doConnect(AbstractPlainSocketImpl.java:350)
            at java.net.AbstractPlainSocketImpl.connectToAddress(AbstractPlainSocketImpl.java:206)
            at java.net.AbstractPlainSocketImpl.connect(AbstractPlainSocketImpl.java:188)
            at java.net.SocksSocketImpl.connect(SocksSocketImpl.java:392)
            at java.net.Socket.connect(Socket.java:607)
            at okhttp3.internal.platform.Platform.connectSocket(Platform.kt:119)
            at okhttp3.internal.connection.RealConnection.connectSocket(RealConnection.kt:283)
            at okhttp3.internal.connection.RealConnection.connect(RealConnection.kt:195)
            at okhttp3.internal.connection.ExchangeFinder.findConnection(ExchangeFinder.kt:249)
            at okhttp3.internal.connection.ExchangeFinder.findHealthyConnection(ExchangeFinder.kt:108)
            at okhttp3.internal.connection.ExchangeFinder.find(ExchangeFinder.kt:76)
            at okhttp3.internal.connection.RealCall.initExchange$okhttp(RealCall.kt:245)
            at okhttp3.internal.connection.ConnectInterceptor.intercept(ConnectInterceptor.kt:32)
            at okhttp3.internal.http.RealInterceptorChain.proceed(RealInterceptorChain.kt:100)
            at okhttp3.internal.cache.CacheInterceptor.intercept(CacheInterceptor.kt:82)
            at okhttp3.internal.http.RealInterceptorChain.proceed(RealInterceptorChain.kt:100)
            at okhttp3.internal.http.BridgeInterceptor.intercept(BridgeInterceptor.kt:83)
            at okhttp3.internal.http.RealInterceptorChain.proceed(RealInterceptorChain.kt:100)
            at okhttp3.internal.http.RetryAndFollowUpInterceptor.intercept(RetryAndFollowUpInterceptor.kt:76)
            at okhttp3.internal.http.RealInterceptorChain.proceed(RealInterceptorChain.kt:100)
            at org.influxdb.impl.BasicAuthInterceptor.intercept(BasicAuthInterceptor.java:22)
            at okhttp3.internal.http.RealInterceptorChain.proceed(RealInterceptorChain.kt:100)
            at org.influxdb.impl.GzipRequestInterceptor.intercept(GzipRequestInterceptor.java:42)
            at okhttp3.internal.http.RealInterceptorChain.proceed(RealInterceptorChain.kt:100)
            at okhttp3.logging.HttpLoggingInterceptor.intercept(HttpLoggingInterceptor.kt:152)
            at okhttp3.internal.http.RealInterceptorChain.proceed(RealInterceptorChain.kt:100)
            at okhttp3.internal.connection.RealCall.getResponseWithInterceptorChain$okhttp(RealCall.kt:197)
            at okhttp3.internal.connection.RealCall.execute(RealCall.kt:148)
            at retrofit2.OkHttpCall.execute(OkHttpCall.java:190)
            at org.influxdb.impl.InfluxDBImpl.execute(InfluxDBImpl.java:824)
            ... 3 more

    org.influxdb.InfluxDBIOException: java.net.SocketTimeoutException: connect timed out
        at org.influxdb.impl.InfluxDBImpl.execute(InfluxDBImpl.java:836)
        at org.influxdb.impl.InfluxDBImpl.executeQuery(InfluxDBImpl.java:819)
        at org.influxdb.impl.InfluxDBImpl.query(InfluxDBImpl.java:554)
        at org.apache.beam.sdk.io.influxdb.InfluxDbIOIT.clear(InfluxDbIOIT.java:88)

        Caused by:
        java.net.SocketTimeoutException: connect timed out
            at java.net.PlainSocketImpl.socketConnect(Native Method)
            at java.net.AbstractPlainSocketImpl.doConnect(AbstractPlainSocketImpl.java:350)
            at java.net.AbstractPlainSocketImpl.connectToAddress(AbstractPlainSocketImpl.java:206)
            at java.net.AbstractPlainSocketImpl.connect(AbstractPlainSocketImpl.java:188)
            at java.net.SocksSocketImpl.connect(SocksSocketImpl.java:392)
            at java.net.Socket.connect(Socket.java:607)
            at okhttp3.internal.platform.Platform.connectSocket(Platform.kt:119)
            at okhttp3.internal.connection.RealConnection.connectSocket(RealConnection.kt:283)
            at okhttp3.internal.connection.RealConnection.connect(RealConnection.kt:195)
            at okhttp3.internal.connection.ExchangeFinder.findConnection(ExchangeFinder.kt:249)
            at okhttp3.internal.connection.ExchangeFinder.findHealthyConnection(ExchangeFinder.kt:108)
            at okhttp3.internal.connection.ExchangeFinder.find(ExchangeFinder.kt:76)
            at okhttp3.internal.connection.RealCall.initExchange$okhttp(RealCall.kt:245)
            at okhttp3.internal.connection.ConnectInterceptor.intercept(ConnectInterceptor.kt:32)
            at okhttp3.internal.http.RealInterceptorChain.proceed(RealInterceptorChain.kt:100)
            at okhttp3.internal.cache.CacheInterceptor.intercept(CacheInterceptor.kt:82)
            at okhttp3.internal.http.RealInterceptorChain.proceed(RealInterceptorChain.kt:100)
            at okhttp3.internal.http.BridgeInterceptor.intercept(BridgeInterceptor.kt:83)
            at okhttp3.internal.http.RealInterceptorChain.proceed(RealInterceptorChain.kt:100)
            at okhttp3.internal.http.RetryAndFollowUpInterceptor.intercept(RetryAndFollowUpInterceptor.kt:76)
            at okhttp3.internal.http.RealInterceptorChain.proceed(RealInterceptorChain.kt:100)
            at org.influxdb.impl.BasicAuthInterceptor.intercept(BasicAuthInterceptor.java:22)
            at okhttp3.internal.http.RealInterceptorChain.proceed(RealInterceptorChain.kt:100)
            at org.influxdb.impl.GzipRequestInterceptor.intercept(GzipRequestInterceptor.java:42)
            at okhttp3.internal.http.RealInterceptorChain.proceed(RealInterceptorChain.kt:100)
            at okhttp3.logging.HttpLoggingInterceptor.intercept(HttpLoggingInterceptor.kt:152)
            at okhttp3.internal.http.RealInterceptorChain.proceed(RealInterceptorChain.kt:100)
            at okhttp3.internal.connection.RealCall.getResponseWithInterceptorChain$okhttp(RealCall.kt:197)
            at okhttp3.internal.connection.RealCall.execute(RealCall.kt:148)
            at retrofit2.OkHttpCall.execute(OkHttpCall.java:190)
            at org.influxdb.impl.InfluxDBImpl.execute(InfluxDBImpl.java:824)
            ... 3 more

org.apache.beam.sdk.io.influxdb.InfluxDbIOIT > testZeroRecordFormNonExistentMetric FAILED
    org.influxdb.InfluxDBIOException: java.net.SocketTimeoutException: connect timed out
        at org.influxdb.impl.InfluxDBImpl.execute(InfluxDBImpl.java:836)
        at org.influxdb.impl.InfluxDBImpl.executeQuery(InfluxDBImpl.java:819)
        at org.influxdb.impl.InfluxDBImpl.query(InfluxDBImpl.java:554)
        at org.apache.beam.sdk.io.influxdb.InfluxDbIOIT.initTest(InfluxDbIOIT.java:99)

        Caused by:
        java.net.SocketTimeoutException: connect timed out
            at java.net.PlainSocketImpl.socketConnect(Native Method)
            at java.net.AbstractPlainSocketImpl.doConnect(AbstractPlainSocketImpl.java:350)
            at java.net.AbstractPlainSocketImpl.connectToAddress(AbstractPlainSocketImpl.java:206)
            at java.net.AbstractPlainSocketImpl.connect(AbstractPlainSocketImpl.java:188)
            at java.net.SocksSocketImpl.connect(SocksSocketImpl.java:392)
            at java.net.Socket.connect(Socket.java:607)
            at okhttp3.internal.platform.Platform.connectSocket(Platform.kt:119)
            at okhttp3.internal.connection.RealConnection.connectSocket(RealConnection.kt:283)
            at okhttp3.internal.connection.RealConnection.connect(RealConnection.kt:195)
            at okhttp3.internal.connection.ExchangeFinder.findConnection(ExchangeFinder.kt:249)
            at okhttp3.internal.connection.ExchangeFinder.findHealthyConnection(ExchangeFinder.kt:108)
            at okhttp3.internal.connection.ExchangeFinder.find(ExchangeFinder.kt:76)
            at okhttp3.internal.connection.RealCall.initExchange$okhttp(RealCall.kt:245)
            at okhttp3.internal.connection.ConnectInterceptor.intercept(ConnectInterceptor.kt:32)
            at okhttp3.internal.http.RealInterceptorChain.proceed(RealInterceptorChain.kt:100)
            at okhttp3.internal.cache.CacheInterceptor.intercept(CacheInterceptor.kt:82)
            at okhttp3.internal.http.RealInterceptorChain.proceed(RealInterceptorChain.kt:100)
            at okhttp3.internal.http.BridgeInterceptor.intercept(BridgeInterceptor.kt:83)
            at okhttp3.internal.http.RealInterceptorChain.proceed(RealInterceptorChain.kt:100)
            at okhttp3.internal.http.RetryAndFollowUpInterceptor.intercept(RetryAndFollowUpInterceptor.kt:76)
            at okhttp3.internal.http.RealInterceptorChain.proceed(RealInterceptorChain.kt:100)
            at org.influxdb.impl.BasicAuthInterceptor.intercept(BasicAuthInterceptor.java:22)
            at okhttp3.internal.http.RealInterceptorChain.proceed(RealInterceptorChain.kt:100)
            at org.influxdb.impl.GzipRequestInterceptor.intercept(GzipRequestInterceptor.java:42)
            at okhttp3.internal.http.RealInterceptorChain.proceed(RealInterceptorChain.kt:100)
            at okhttp3.logging.HttpLoggingInterceptor.intercept(HttpLoggingInterceptor.kt:152)
            at okhttp3.internal.http.RealInterceptorChain.proceed(RealInterceptorChain.kt:100)
            at okhttp3.internal.connection.RealCall.getResponseWithInterceptorChain$okhttp(RealCall.kt:197)
            at okhttp3.internal.connection.RealCall.execute(RealCall.kt:148)
            at retrofit2.OkHttpCall.execute(OkHttpCall.java:190)
            at org.influxdb.impl.InfluxDBImpl.execute(InfluxDBImpl.java:824)
            ... 3 more

org.apache.beam.sdk.io.influxdb.InfluxDbIOIT > testWriteAndRead FAILED
    java.lang.AssertionError: Count All/Flatten.PCollections.out: 
    Expected: <2000L>
         but: was <1999L>
        at org.apache.beam.sdk.testing.PAssert$PAssertionSite.capture(PAssert.java:175)
        at org.apache.beam.sdk.testing.PAssert.thatSingleton(PAssert.java:498)
        at org.apache.beam.sdk.testing.PAssert.thatSingleton(PAssert.java:490)
        at org.apache.beam.sdk.io.influxdb.InfluxDbIOIT.testWriteAndRead(InfluxDbIOIT.java:162)

        Caused by:
        java.lang.AssertionError: 
        Expected: <2000L>
             but: was <1999L>
            at org.hamcrest.MatcherAssert.assertThat(MatcherAssert.java:18)
            at org.hamcrest.MatcherAssert.assertThat(MatcherAssert.java:6)
            at org.apache.beam.sdk.testing.PAssert$AssertIsEqualTo.apply(PAssert.java:1643)
            at org.apache.beam.sdk.testing.PAssert$AssertIsEqualTo.apply(PAssert.java:1634)
            at org.apache.beam.sdk.testing.PAssert$CheckRelationAgainstExpected.apply(PAssert.java:1299)
            at org.apache.beam.sdk.testing.PAssert$CheckRelationAgainstExpected.apply(PAssert.java:1279)
            at org.apache.beam.sdk.testing.PAssert.doChecks(PAssert.java:1621)
            at org.apache.beam.sdk.testing.PAssert$SingletonCheckerDoFn.processElement(PAssert.java:1614)
            at org.apache.beam.sdk.testing.PAssert$SingletonCheckerDoFn$DoFnInvoker.invokeProcessElement(Unknown Source)
            at org.apache.beam.repackaged.direct_java.runners.core.SimpleDoFnRunner.invokeProcessElement(SimpleDoFnRunner.java:211)
            at org.apache.beam.repackaged.direct_java.runners.core.SimpleDoFnRunner.processElement(SimpleDoFnRunner.java:188)
            at org.apache.beam.repackaged.direct_java.runners.core.SimplePushbackSideInputDoFnRunner.processElementInReadyWindows(SimplePushbackSideInputDoFnRunner.java:79)
            at org.apache.beam.runners.direct.ParDoEvaluator.processElement(ParDoEvaluator.java:244)
            at org.apache.beam.runners.direct.DoFnLifecycleManagerRemovingTransformEvaluator.processElement(DoFnLifecycleManagerRemovingTransformEvaluator.java:54)
            at org.apache.beam.runners.direct.DirectTransformExecutor.processElements(DirectTransformExecutor.java:165)
            at org.apache.beam.runners.direct.DirectTransformExecutor.run(DirectTransformExecutor.java:129)
            at java.util.concurrent.Executors$RunnableAdapter.call(Executors.java:511)
            at java.util.concurrent.FutureTask.run(FutureTask.java:266)
            at java.util.concurrent.ThreadPoolExecutor.runWorker(ThreadPoolExecutor.java:1149)
            at java.util.concurrent.ThreadPoolExecutor$Worker.run(ThreadPoolExecutor.java:624)
            at java.lang.Thread.run(Thread.java:750)

Gradle Test Executor 124 finished executing tests.

> Task :sdks:java:io:influxdb:integrationTest FAILED

6 tests completed, 3 failed
Finished generating test XML results (0.001 secs) into: <https://ci-beam.apache.org/job/beam_PerformanceTests_InfluxDbIO_IT/ws/src/sdks/java/io/influxdb/build/test-results/integrationTest>
Generating HTML test report...
Finished generating test html results (0.002 secs) into: <https://ci-beam.apache.org/job/beam_PerformanceTests_InfluxDbIO_IT/ws/src/sdks/java/io/influxdb/build/reports/tests/integrationTest>
:sdks:java:io:influxdb:integrationTest (Thread[Execution worker Thread 4,5,main]) completed. Took 38.156 secs.

FAILURE: Build failed with an exception.

* What went wrong:
Execution failed for task ':sdks:java:io:influxdb:integrationTest'.
> There were failing tests. See the report at: file://<https://ci-beam.apache.org/job/beam_PerformanceTests_InfluxDbIO_IT/ws/src/sdks/java/io/influxdb/build/reports/tests/integrationTest/index.html>

* Try:
> Run with --stacktrace option to get the stack trace.
> Run with --debug option to get more log output.

* Get more help at https://help.gradle.org

Deprecated Gradle features were used in this build, making it incompatible with Gradle 8.0.

You can use '--warning-mode all' to show the individual deprecation warnings and determine if they come from your own scripts or plugins.

See https://docs.gradle.org/7.5.1/userguide/command_line_interface.html#sec:command_line_warnings

BUILD FAILED in 47s
77 actionable tasks: 42 executed, 33 from cache, 2 up-to-date

Publishing build scan...
https://gradle.com/s/tr2yva5lt24ew

Build step 'Invoke Gradle script' changed build result to FAILURE
Build step 'Invoke Gradle script' marked build as failure

---------------------------------------------------------------------
To unsubscribe, e-mail: builds-unsubscribe@beam.apache.org
For additional commands, e-mail: builds-help@beam.apache.org


Build failed in Jenkins: beam_PerformanceTests_InfluxDbIO_IT #2320

Posted by Apache Jenkins Server <je...@builds.apache.org>.
See <https://ci-beam.apache.org/job/beam_PerformanceTests_InfluxDbIO_IT/2320/display/redirect?page=changes>

Changes:

[noreply] Fix assignees check

[noreply] Exclude protobuf 3.20.2 (#23226)

[noreply] Fix IllegalStateException in StorageApiWriteUnshardedRecords error

[noreply] Update cibuildwheel (#23024)

[noreply] Add section to docs on resource hints/RunInference (#23215)

[noreply] (BQ Python) Perform job waits in finish_bundle to allow BQ streaming

[noreply] Update to newest version of CloudPickle. (#23223)


------------------------------------------
[...truncated 188.12 KB...]
Task ':runners:java-fn-execution:compileJava' is not up-to-date because:
  No history is available.
Loaded cache entry for task ':runners:java-fn-execution:compileJava' with cache key 847afbf388a7f9a9ea7abc1cb81d9434
:runners:java-fn-execution:compileJava (Thread[included builds,5,main]) completed. Took 0.087 secs.
Resolve mutations for :runners:java-fn-execution:classes (Thread[Execution worker Thread 3,5,main]) started.
Resolve mutations for :runners:java-fn-execution:classes (Thread[Execution worker Thread 3,5,main]) completed. Took 0.0 secs.
:runners:java-fn-execution:classes (Thread[Execution worker,5,main]) started.

> Task :runners:java-fn-execution:classes UP-TO-DATE
Skipping task ':runners:java-fn-execution:classes' as it has no actions.
:runners:java-fn-execution:classes (Thread[Execution worker,5,main]) completed. Took 0.0 secs.
Resolve mutations for :runners:java-fn-execution:jar (Thread[included builds,5,main]) started.
Resolve mutations for :runners:java-fn-execution:jar (Thread[included builds,5,main]) completed. Took 0.0 secs.
:runners:java-fn-execution:jar (Thread[Execution worker Thread 3,5,main]) started.

> Task :runners:java-fn-execution:jar
Caching disabled for task ':runners:java-fn-execution:jar' because:
  Not worth caching
Task ':runners:java-fn-execution:jar' is not up-to-date because:
  No history is available.
file or directory '<https://ci-beam.apache.org/job/beam_PerformanceTests_InfluxDbIO_IT/ws/src/runners/java-fn-execution/build/resources/main',> not found
:runners:java-fn-execution:jar (Thread[Execution worker Thread 3,5,main]) completed. Took 0.039 secs.
work action resolve beam-runners-java-fn-execution.jar (project :runners:java-fn-execution) (Thread[Execution worker,5,main]) started.
work action null (Thread[Execution worker,5,main]) completed. Took 0.0 secs.
Resolve mutations for :runners:direct-java:compileJava (Thread[Execution worker Thread 2,5,main]) started.
Resolve mutations for :runners:direct-java:compileJava (Thread[Execution worker Thread 2,5,main]) completed. Took 0.0 secs.
:runners:direct-java:compileJava (Thread[Execution worker Thread 3,5,main]) started.

> Task :runners:direct-java:compileJava FROM-CACHE
Custom actions are attached to task ':runners:direct-java:compileJava'.
Build cache key for task ':runners:direct-java:compileJava' is 4680edce0596cb0762368f20d4c80798
Task ':runners:direct-java:compileJava' is not up-to-date because:
  No history is available.
Loaded cache entry for task ':runners:direct-java:compileJava' with cache key 4680edce0596cb0762368f20d4c80798
:runners:direct-java:compileJava (Thread[Execution worker Thread 3,5,main]) completed. Took 0.095 secs.
Resolve mutations for :runners:direct-java:classes (Thread[Execution worker,5,main]) started.
Resolve mutations for :runners:direct-java:classes (Thread[Execution worker,5,main]) completed. Took 0.0 secs.
:runners:direct-java:classes (Thread[Execution worker Thread 4,5,main]) started.

> Task :runners:direct-java:classes UP-TO-DATE
Skipping task ':runners:direct-java:classes' as it has no actions.
:runners:direct-java:classes (Thread[Execution worker Thread 4,5,main]) completed. Took 0.0 secs.
Resolve mutations for :runners:direct-java:shadowJar (Thread[Execution worker Thread 3,5,main]) started.
Resolve mutations for :runners:direct-java:shadowJar (Thread[Execution worker Thread 3,5,main]) completed. Took 0.0 secs.
:runners:direct-java:shadowJar (Thread[Execution worker,5,main]) started.

> Task :runners:core-java:compileTestJava FROM-CACHE
Custom actions are attached to task ':runners:core-java:compileTestJava'.
Build cache key for task ':runners:core-java:compileTestJava' is 58aa36c6f9005ce309aa150dccbe1d73
Task ':runners:core-java:compileTestJava' is not up-to-date because:
  No history is available.
Loaded cache entry for task ':runners:core-java:compileTestJava' with cache key 58aa36c6f9005ce309aa150dccbe1d73
:runners:core-java:compileTestJava (Thread[Execution worker Thread 7,5,main]) completed. Took 0.333 secs.
Resolve mutations for :runners:core-java:testClasses (Thread[Execution worker Thread 4,5,main]) started.
Resolve mutations for :runners:core-java:testClasses (Thread[Execution worker Thread 4,5,main]) completed. Took 0.0 secs.
:runners:core-java:testClasses (Thread[Execution worker Thread 5,5,main]) started.

> Task :runners:core-java:testClasses UP-TO-DATE
Skipping task ':runners:core-java:testClasses' as it has no actions.
:runners:core-java:testClasses (Thread[Execution worker Thread 5,5,main]) completed. Took 0.0 secs.
Resolve mutations for :runners:core-java:testJar (Thread[Execution worker Thread 7,5,main]) started.
Resolve mutations for :runners:core-java:testJar (Thread[Execution worker Thread 7,5,main]) completed. Took 0.0 secs.
:runners:core-java:testJar (Thread[Execution worker Thread 4,5,main]) started.

> Task :runners:core-java:testJar
Caching disabled for task ':runners:core-java:testJar' because:
  Not worth caching
Task ':runners:core-java:testJar' is not up-to-date because:
  No history is available.
file or directory '<https://ci-beam.apache.org/job/beam_PerformanceTests_InfluxDbIO_IT/ws/src/runners/core-java/build/resources/test',> not found
:runners:core-java:testJar (Thread[Execution worker Thread 4,5,main]) completed. Took 0.037 secs.
work action resolve beam-runners-core-java-tests.jar (project :runners:core-java) (Thread[Execution worker Thread 5,5,main]) started.
work action null (Thread[Execution worker Thread 5,5,main]) completed. Took 0.0 secs.

> Task :runners:direct-java:shadowJar FROM-CACHE
Custom actions are attached to task ':runners:direct-java:shadowJar'.
Build cache key for task ':runners:direct-java:shadowJar' is c6113ad7db3d8881cf8ecb6faaffef1b
Task ':runners:direct-java:shadowJar' is not up-to-date because:
  No history is available.
Loaded cache entry for task ':runners:direct-java:shadowJar' with cache key c6113ad7db3d8881cf8ecb6faaffef1b
:runners:direct-java:shadowJar (Thread[Execution worker,5,main]) completed. Took 0.299 secs.
work action resolve beam-runners-direct-java.jar (project :runners:direct-java) (Thread[Execution worker Thread 4,5,main]) started.
work action null (Thread[Execution worker Thread 4,5,main]) completed. Took 0.0 secs.
work action resolve beam-runners-direct-java.jar (project :runners:direct-java) (Thread[Execution worker Thread 5,5,main]) started.
work action null (Thread[Execution worker Thread 5,5,main]) completed. Took 0.0 secs.
Resolve mutations for :runners:direct-java:compileTestJava (Thread[Execution worker Thread 5,5,main]) started.
Resolve mutations for :runners:direct-java:compileTestJava (Thread[Execution worker Thread 5,5,main]) completed. Took 0.0 secs.
:runners:direct-java:compileTestJava (Thread[Execution worker Thread 4,5,main]) started.

> Task :runners:direct-java:compileTestJava FROM-CACHE
Custom actions are attached to task ':runners:direct-java:compileTestJava'.
Build cache key for task ':runners:direct-java:compileTestJava' is 79fe0aaa977d1894100ff4f6936cf445
Task ':runners:direct-java:compileTestJava' is not up-to-date because:
  No history is available.
Loaded cache entry for task ':runners:direct-java:compileTestJava' with cache key 79fe0aaa977d1894100ff4f6936cf445
:runners:direct-java:compileTestJava (Thread[Execution worker Thread 4,5,main]) completed. Took 0.109 secs.
Resolve mutations for :runners:direct-java:testClasses (Thread[Execution worker Thread 4,5,main]) started.
Resolve mutations for :runners:direct-java:testClasses (Thread[Execution worker Thread 4,5,main]) completed. Took 0.0 secs.
:runners:direct-java:testClasses (Thread[Execution worker Thread 4,5,main]) started.

> Task :runners:direct-java:testClasses UP-TO-DATE
Skipping task ':runners:direct-java:testClasses' as it has no actions.
:runners:direct-java:testClasses (Thread[Execution worker Thread 4,5,main]) completed. Took 0.0 secs.
Resolve mutations for :runners:direct-java:shadowTestJar (Thread[Execution worker Thread 3,5,main]) started.
Resolve mutations for :runners:direct-java:shadowTestJar (Thread[Execution worker Thread 3,5,main]) completed. Took 0.0 secs.
:runners:direct-java:shadowTestJar (Thread[Execution worker Thread 3,5,main]) started.

> Task :runners:direct-java:shadowTestJar FROM-CACHE
Build cache key for task ':runners:direct-java:shadowTestJar' is 8ebad141a8ec730c2de2e48b435cd66f
Task ':runners:direct-java:shadowTestJar' is not up-to-date because:
  No history is available.
Loaded cache entry for task ':runners:direct-java:shadowTestJar' with cache key 8ebad141a8ec730c2de2e48b435cd66f
:runners:direct-java:shadowTestJar (Thread[Execution worker Thread 3,5,main]) completed. Took 0.204 secs.
work action resolve beam-runners-direct-java-tests.jar (project :runners:direct-java) (Thread[Execution worker Thread 4,5,main]) started.
work action null (Thread[Execution worker Thread 4,5,main]) completed. Took 0.0 secs.
Resolve mutations for :sdks:java:io:influxdb:integrationTest (Thread[Execution worker Thread 4,5,main]) started.
Resolve mutations for :sdks:java:io:influxdb:integrationTest (Thread[Execution worker Thread 4,5,main]) completed. Took 0.0 secs.
:sdks:java:io:influxdb:integrationTest (Thread[Execution worker Thread 3,5,main]) started.
producer locations for task group 0 (Thread[Execution worker Thread 4,5,main]) started.
producer locations for task group 0 (Thread[Execution worker Thread 4,5,main]) completed. Took 0.0 secs.
Gradle Test Executor 104 started executing tests.

> Task :sdks:java:io:influxdb:integrationTest
Custom actions are attached to task ':sdks:java:io:influxdb:integrationTest'.
Build cache key for task ':sdks:java:io:influxdb:integrationTest' is 46b185c1bf94b10ab16e3ace4507d294
Task ':sdks:java:io:influxdb:integrationTest' is not up-to-date because:
  Task.upToDateWhen is false.
Starting process 'Gradle Test Executor 104'. Working directory: <https://ci-beam.apache.org/job/beam_PerformanceTests_InfluxDbIO_IT/ws/src/sdks/java/io/influxdb> Command: /usr/lib/jvm/java-8-openjdk-amd64/bin/java -DbeamTestPipelineOptions=["--influxDBURL=http://34.170.24.102:8086","--influxDBUserName=superadmin","--influxDBPassword=supersecretpassword","--databaseName=db1"] -Djava.security.manager=worker.org.gradle.process.internal.worker.child.BootstrapSecurityManager -Dorg.gradle.internal.worker.tmpdir=<https://ci-beam.apache.org/job/beam_PerformanceTests_InfluxDbIO_IT/ws/src/sdks/java/io/influxdb/build/tmp/integrationTest/work> -Dorg.gradle.native=false -Xmx2g -Dfile.encoding=UTF-8 -Duser.country=US -Duser.language=en -Duser.variant -ea -cp /home/jenkins/.gradle/caches/7.5.1/workerMain/gradle-worker.jar worker.org.gradle.process.internal.worker.GradleWorkerMain 'Gradle Test Executor 104'
Successfully started process 'Gradle Test Executor 104'

org.apache.beam.sdk.io.influxdb.InfluxDbIOIT > testWriteAndReadWithMultipleMetric FAILED
    org.influxdb.InfluxDBIOException: java.net.SocketTimeoutException: connect timed out
        at org.influxdb.impl.InfluxDBImpl.execute(InfluxDBImpl.java:836)
        at org.influxdb.impl.InfluxDBImpl.executeQuery(InfluxDBImpl.java:819)
        at org.influxdb.impl.InfluxDBImpl.query(InfluxDBImpl.java:554)
        at org.apache.beam.sdk.io.influxdb.InfluxDbIOIT.initTest(InfluxDbIOIT.java:99)

        Caused by:
        java.net.SocketTimeoutException: connect timed out
            at java.net.PlainSocketImpl.socketConnect(Native Method)
            at java.net.AbstractPlainSocketImpl.doConnect(AbstractPlainSocketImpl.java:350)
            at java.net.AbstractPlainSocketImpl.connectToAddress(AbstractPlainSocketImpl.java:206)
            at java.net.AbstractPlainSocketImpl.connect(AbstractPlainSocketImpl.java:188)
            at java.net.SocksSocketImpl.connect(SocksSocketImpl.java:392)
            at java.net.Socket.connect(Socket.java:607)
            at okhttp3.internal.platform.Platform.connectSocket(Platform.kt:119)
            at okhttp3.internal.connection.RealConnection.connectSocket(RealConnection.kt:283)
            at okhttp3.internal.connection.RealConnection.connect(RealConnection.kt:195)
            at okhttp3.internal.connection.ExchangeFinder.findConnection(ExchangeFinder.kt:249)
            at okhttp3.internal.connection.ExchangeFinder.findHealthyConnection(ExchangeFinder.kt:108)
            at okhttp3.internal.connection.ExchangeFinder.find(ExchangeFinder.kt:76)
            at okhttp3.internal.connection.RealCall.initExchange$okhttp(RealCall.kt:245)
            at okhttp3.internal.connection.ConnectInterceptor.intercept(ConnectInterceptor.kt:32)
            at okhttp3.internal.http.RealInterceptorChain.proceed(RealInterceptorChain.kt:100)
            at okhttp3.internal.cache.CacheInterceptor.intercept(CacheInterceptor.kt:82)
            at okhttp3.internal.http.RealInterceptorChain.proceed(RealInterceptorChain.kt:100)
            at okhttp3.internal.http.BridgeInterceptor.intercept(BridgeInterceptor.kt:83)
            at okhttp3.internal.http.RealInterceptorChain.proceed(RealInterceptorChain.kt:100)
            at okhttp3.internal.http.RetryAndFollowUpInterceptor.intercept(RetryAndFollowUpInterceptor.kt:76)
            at okhttp3.internal.http.RealInterceptorChain.proceed(RealInterceptorChain.kt:100)
            at org.influxdb.impl.BasicAuthInterceptor.intercept(BasicAuthInterceptor.java:22)
            at okhttp3.internal.http.RealInterceptorChain.proceed(RealInterceptorChain.kt:100)
            at org.influxdb.impl.GzipRequestInterceptor.intercept(GzipRequestInterceptor.java:42)
            at okhttp3.internal.http.RealInterceptorChain.proceed(RealInterceptorChain.kt:100)
            at okhttp3.logging.HttpLoggingInterceptor.intercept(HttpLoggingInterceptor.kt:152)
            at okhttp3.internal.http.RealInterceptorChain.proceed(RealInterceptorChain.kt:100)
            at okhttp3.internal.connection.RealCall.getResponseWithInterceptorChain$okhttp(RealCall.kt:197)
            at okhttp3.internal.connection.RealCall.execute(RealCall.kt:148)
            at retrofit2.OkHttpCall.execute(OkHttpCall.java:190)
            at org.influxdb.impl.InfluxDBImpl.execute(InfluxDBImpl.java:824)
            ... 3 more

    org.influxdb.InfluxDBIOException: java.net.SocketTimeoutException: connect timed out
        at org.influxdb.impl.InfluxDBImpl.execute(InfluxDBImpl.java:836)
        at org.influxdb.impl.InfluxDBImpl.executeQuery(InfluxDBImpl.java:819)
        at org.influxdb.impl.InfluxDBImpl.query(InfluxDBImpl.java:554)
        at org.apache.beam.sdk.io.influxdb.InfluxDbIOIT.clear(InfluxDbIOIT.java:88)

        Caused by:
        java.net.SocketTimeoutException: connect timed out
            at java.net.PlainSocketImpl.socketConnect(Native Method)
            at java.net.AbstractPlainSocketImpl.doConnect(AbstractPlainSocketImpl.java:350)
            at java.net.AbstractPlainSocketImpl.connectToAddress(AbstractPlainSocketImpl.java:206)
            at java.net.AbstractPlainSocketImpl.connect(AbstractPlainSocketImpl.java:188)
            at java.net.SocksSocketImpl.connect(SocksSocketImpl.java:392)
            at java.net.Socket.connect(Socket.java:607)
            at okhttp3.internal.platform.Platform.connectSocket(Platform.kt:119)
            at okhttp3.internal.connection.RealConnection.connectSocket(RealConnection.kt:283)
            at okhttp3.internal.connection.RealConnection.connect(RealConnection.kt:195)
            at okhttp3.internal.connection.ExchangeFinder.findConnection(ExchangeFinder.kt:249)
            at okhttp3.internal.connection.ExchangeFinder.findHealthyConnection(ExchangeFinder.kt:108)
            at okhttp3.internal.connection.ExchangeFinder.find(ExchangeFinder.kt:76)
            at okhttp3.internal.connection.RealCall.initExchange$okhttp(RealCall.kt:245)
            at okhttp3.internal.connection.ConnectInterceptor.intercept(ConnectInterceptor.kt:32)
            at okhttp3.internal.http.RealInterceptorChain.proceed(RealInterceptorChain.kt:100)
            at okhttp3.internal.cache.CacheInterceptor.intercept(CacheInterceptor.kt:82)
            at okhttp3.internal.http.RealInterceptorChain.proceed(RealInterceptorChain.kt:100)
            at okhttp3.internal.http.BridgeInterceptor.intercept(BridgeInterceptor.kt:83)
            at okhttp3.internal.http.RealInterceptorChain.proceed(RealInterceptorChain.kt:100)
            at okhttp3.internal.http.RetryAndFollowUpInterceptor.intercept(RetryAndFollowUpInterceptor.kt:76)
            at okhttp3.internal.http.RealInterceptorChain.proceed(RealInterceptorChain.kt:100)
            at org.influxdb.impl.BasicAuthInterceptor.intercept(BasicAuthInterceptor.java:22)
            at okhttp3.internal.http.RealInterceptorChain.proceed(RealInterceptorChain.kt:100)
            at org.influxdb.impl.GzipRequestInterceptor.intercept(GzipRequestInterceptor.java:42)
            at okhttp3.internal.http.RealInterceptorChain.proceed(RealInterceptorChain.kt:100)
            at okhttp3.logging.HttpLoggingInterceptor.intercept(HttpLoggingInterceptor.kt:152)
            at okhttp3.internal.http.RealInterceptorChain.proceed(RealInterceptorChain.kt:100)
            at okhttp3.internal.connection.RealCall.getResponseWithInterceptorChain$okhttp(RealCall.kt:197)
            at okhttp3.internal.connection.RealCall.execute(RealCall.kt:148)
            at retrofit2.OkHttpCall.execute(OkHttpCall.java:190)
            at org.influxdb.impl.InfluxDBImpl.execute(InfluxDBImpl.java:824)
            ... 3 more

Gradle Test Executor 104 finished executing tests.

> Task :sdks:java:io:influxdb:integrationTest FAILED

6 tests completed, 1 failed
Finished generating test XML results (0.001 secs) into: <https://ci-beam.apache.org/job/beam_PerformanceTests_InfluxDbIO_IT/ws/src/sdks/java/io/influxdb/build/test-results/integrationTest>
Generating HTML test report...
Finished generating test html results (0.002 secs) into: <https://ci-beam.apache.org/job/beam_PerformanceTests_InfluxDbIO_IT/ws/src/sdks/java/io/influxdb/build/reports/tests/integrationTest>
:sdks:java:io:influxdb:integrationTest (Thread[Execution worker Thread 3,5,main]) completed. Took 26.71 secs.

FAILURE: Build failed with an exception.

* What went wrong:
Execution failed for task ':sdks:java:io:influxdb:integrationTest'.
> There were failing tests. See the report at: file://<https://ci-beam.apache.org/job/beam_PerformanceTests_InfluxDbIO_IT/ws/src/sdks/java/io/influxdb/build/reports/tests/integrationTest/index.html>

* Try:
> Run with --stacktrace option to get the stack trace.
> Run with --debug option to get more log output.

* Get more help at https://help.gradle.org

Deprecated Gradle features were used in this build, making it incompatible with Gradle 8.0.

You can use '--warning-mode all' to show the individual deprecation warnings and determine if they come from your own scripts or plugins.

See https://docs.gradle.org/7.5.1/userguide/command_line_interface.html#sec:command_line_warnings

BUILD FAILED in 34s
77 actionable tasks: 42 executed, 33 from cache, 2 up-to-date

Publishing build scan...
https://gradle.com/s/hiwmbslmynaz4

Build step 'Invoke Gradle script' changed build result to FAILURE
Build step 'Invoke Gradle script' marked build as failure

---------------------------------------------------------------------
To unsubscribe, e-mail: builds-unsubscribe@beam.apache.org
For additional commands, e-mail: builds-help@beam.apache.org


Build failed in Jenkins: beam_PerformanceTests_InfluxDbIO_IT #2319

Posted by Apache Jenkins Server <je...@builds.apache.org>.
See <https://ci-beam.apache.org/job/beam_PerformanceTests_InfluxDbIO_IT/2319/display/redirect?page=changes>

Changes:

[noreply] Publish results of JMH benchmark runs (Java SDK) to InfluxDB (part of


------------------------------------------
[...truncated 194.50 KB...]
:runners:direct-java:classes (Thread[Execution worker,5,main]) started.

> Task :runners:direct-java:classes UP-TO-DATE
Skipping task ':runners:direct-java:classes' as it has no actions.
:runners:direct-java:classes (Thread[Execution worker,5,main]) completed. Took 0.0 secs.
Resolve mutations for :runners:direct-java:shadowJar (Thread[included builds,5,main]) started.
Resolve mutations for :runners:direct-java:shadowJar (Thread[included builds,5,main]) completed. Took 0.0 secs.
:runners:direct-java:shadowJar (Thread[Execution worker Thread 7,5,main]) started.

> Task :runners:core-java:testJar
Caching disabled for task ':runners:core-java:testJar' because:
  Not worth caching
Task ':runners:core-java:testJar' is not up-to-date because:
  No history is available.
file or directory '<https://ci-beam.apache.org/job/beam_PerformanceTests_InfluxDbIO_IT/ws/src/runners/core-java/build/resources/test',> not found
:runners:core-java:testJar (Thread[Execution worker Thread 2,5,main]) completed. Took 0.034 secs.
work action resolve beam-runners-core-java-tests.jar (project :runners:core-java) (Thread[Execution worker Thread 2,5,main]) started.
work action null (Thread[Execution worker Thread 2,5,main]) completed. Took 0.0 secs.

> Task :runners:direct-java:shadowJar FROM-CACHE
Custom actions are attached to task ':runners:direct-java:shadowJar'.
Build cache key for task ':runners:direct-java:shadowJar' is c6113ad7db3d8881cf8ecb6faaffef1b
Task ':runners:direct-java:shadowJar' is not up-to-date because:
  No history is available.
Loaded cache entry for task ':runners:direct-java:shadowJar' with cache key c6113ad7db3d8881cf8ecb6faaffef1b
:runners:direct-java:shadowJar (Thread[Execution worker Thread 7,5,main]) completed. Took 0.309 secs.
work action resolve beam-runners-direct-java.jar (project :runners:direct-java) (Thread[Execution worker Thread 5,5,main]) started.
work action null (Thread[Execution worker Thread 5,5,main]) completed. Took 0.0 secs.
work action resolve beam-runners-direct-java.jar (project :runners:direct-java) (Thread[Execution worker Thread 2,5,main]) started.
work action null (Thread[Execution worker Thread 2,5,main]) completed. Took 0.0 secs.
Resolve mutations for :runners:direct-java:compileTestJava (Thread[Execution worker Thread 7,5,main]) started.
Resolve mutations for :runners:direct-java:compileTestJava (Thread[Execution worker Thread 7,5,main]) completed. Took 0.0 secs.
:runners:direct-java:compileTestJava (Thread[Execution worker Thread 5,5,main]) started.

> Task :runners:direct-java:compileTestJava FROM-CACHE
Custom actions are attached to task ':runners:direct-java:compileTestJava'.
Build cache key for task ':runners:direct-java:compileTestJava' is 79fe0aaa977d1894100ff4f6936cf445
Task ':runners:direct-java:compileTestJava' is not up-to-date because:
  No history is available.
Loaded cache entry for task ':runners:direct-java:compileTestJava' with cache key 79fe0aaa977d1894100ff4f6936cf445
:runners:direct-java:compileTestJava (Thread[Execution worker Thread 5,5,main]) completed. Took 0.115 secs.
Resolve mutations for :runners:direct-java:testClasses (Thread[Execution worker Thread 2,5,main]) started.
Resolve mutations for :runners:direct-java:testClasses (Thread[Execution worker Thread 2,5,main]) completed. Took 0.0 secs.
:runners:direct-java:testClasses (Thread[included builds,5,main]) started.

> Task :runners:direct-java:testClasses UP-TO-DATE
Skipping task ':runners:direct-java:testClasses' as it has no actions.
:runners:direct-java:testClasses (Thread[included builds,5,main]) completed. Took 0.0 secs.
Resolve mutations for :runners:direct-java:shadowTestJar (Thread[Execution worker Thread 5,5,main]) started.
Resolve mutations for :runners:direct-java:shadowTestJar (Thread[Execution worker Thread 5,5,main]) completed. Took 0.0 secs.
:runners:direct-java:shadowTestJar (Thread[Execution worker Thread 2,5,main]) started.

> Task :sdks:java:io:influxdb:compileJava
Custom actions are attached to task ':sdks:java:io:influxdb:compileJava'.
Build cache key for task ':sdks:java:io:influxdb:compileJava' is e91a5f874c2b6fde2baed9cbb6fc0412
Task ':sdks:java:io:influxdb:compileJava' is not up-to-date because:
  No history is available.
The input changes require a full rebuild for incremental task ':sdks:java:io:influxdb:compileJava'.
Full recompilation is required because no incremental change information is available. This is usually caused by clean builds or changing compiler arguments.
Compiling with toolchain '/usr/lib/jvm/java-8-openjdk-amd64'.
Invalidating in-memory cache of /home/jenkins/.gradle/caches/7.5.1/fileContent/java-modules.bin
Invalidating in-memory cache of /home/jenkins/.gradle/caches/7.5.1/fileContent/annotation-processors.bin
Starting process 'Gradle Worker Daemon 92'. Working directory: /home/jenkins/.gradle/workers Command: /usr/lib/jvm/java-8-openjdk-amd64/bin/java -Djava.security.manager=worker.org.gradle.process.internal.worker.child.BootstrapSecurityManager -Xbootclasspath/p:/home/jenkins/.gradle/caches/modules-2/files-2.1/com.google.errorprone/javac/9+181-r4173-1/bdf4c0aa7d540ee1f7bf14d47447aea4bbf450c5/javac-9+181-r4173-1.jar -Xbootclasspath/p:/home/jenkins/.gradle/caches/modules-2/files-2.1/com.google.errorprone/javac/9+181-r4173-1/bdf4c0aa7d540ee1f7bf14d47447aea4bbf450c5/javac-9+181-r4173-1.jar -Xmx512m -Dfile.encoding=UTF-8 -Duser.country=US -Duser.language=en -Duser.variant -cp /home/jenkins/.gradle/caches/7.5.1/workerMain/gradle-worker.jar worker.org.gradle.process.internal.worker.GradleWorkerMain 'Gradle Worker Daemon 92'
Successfully started process 'Gradle Worker Daemon 92'
Started Gradle worker daemon (0.355 secs) with fork options DaemonForkOptions{executable=/usr/lib/jvm/java-8-openjdk-amd64/bin/java, minHeapSize=null, maxHeapSize=null, jvmArgs=[-Xbootclasspath/p:/home/jenkins/.gradle/caches/modules-2/files-2.1/com.google.errorprone/javac/9+181-r4173-1/bdf4c0aa7d540ee1f7bf14d47447aea4bbf450c5/javac-9+181-r4173-1.jar, -Xbootclasspath/p:/home/jenkins/.gradle/caches/modules-2/files-2.1/com.google.errorprone/javac/9+181-r4173-1/bdf4c0aa7d540ee1f7bf14d47447aea4bbf450c5/javac-9+181-r4173-1.jar], keepAliveMode=SESSION}.
Compiling with JDK Java compiler API.

> Task :runners:direct-java:shadowTestJar FROM-CACHE
Build cache key for task ':runners:direct-java:shadowTestJar' is 8ebad141a8ec730c2de2e48b435cd66f
Task ':runners:direct-java:shadowTestJar' is not up-to-date because:
  No history is available.
Loaded cache entry for task ':runners:direct-java:shadowTestJar' with cache key 8ebad141a8ec730c2de2e48b435cd66f
:runners:direct-java:shadowTestJar (Thread[Execution worker Thread 2,5,main]) completed. Took 0.211 secs.
work action resolve beam-runners-direct-java-tests.jar (project :runners:direct-java) (Thread[included builds,5,main]) started.
work action null (Thread[included builds,5,main]) completed. Took 0.0 secs.

> Task :sdks:java:io:influxdb:compileJava
Note: <https://ci-beam.apache.org/job/beam_PerformanceTests_InfluxDbIO_IT/ws/src/sdks/java/io/influxdb/src/main/java/org/apache/beam/sdk/io/influxdb/InfluxDbIO.java> uses unchecked or unsafe operations.
Note: Recompile with -Xlint:unchecked for details.
Invalidating in-memory cache of /home/jenkins/.gradle/caches/7.5.1/javaCompile/jarAnalysis.bin
Invalidating in-memory cache of /home/jenkins/.gradle/caches/7.5.1/javaCompile/classAnalysis.bin
Class dependency analysis for incremental compilation took 0.01 secs.
Created classpath snapshot for incremental compilation in 0.116 secs.
Stored cache entry for task ':sdks:java:io:influxdb:compileJava' with cache key e91a5f874c2b6fde2baed9cbb6fc0412
:sdks:java:io:influxdb:compileJava (Thread[Execution worker Thread 6,5,main]) completed. Took 8.147 secs.
Resolve mutations for :sdks:java:io:influxdb:classes (Thread[Execution worker Thread 6,5,main]) started.
Resolve mutations for :sdks:java:io:influxdb:classes (Thread[Execution worker Thread 6,5,main]) completed. Took 0.0 secs.
:sdks:java:io:influxdb:classes (Thread[Execution worker Thread 2,5,main]) started.

> Task :sdks:java:io:influxdb:classes
Skipping task ':sdks:java:io:influxdb:classes' as it has no actions.
:sdks:java:io:influxdb:classes (Thread[Execution worker Thread 2,5,main]) completed. Took 0.0 secs.
Resolve mutations for :sdks:java:io:influxdb:compileTestJava (Thread[Execution worker,5,main]) started.
Resolve mutations for :sdks:java:io:influxdb:compileTestJava (Thread[Execution worker,5,main]) completed. Took 0.0 secs.
:sdks:java:io:influxdb:compileTestJava (Thread[included builds,5,main]) started.

> Task :sdks:java:io:influxdb:compileTestJava
Custom actions are attached to task ':sdks:java:io:influxdb:compileTestJava'.
Build cache key for task ':sdks:java:io:influxdb:compileTestJava' is 779da935459ea365840819b7a457ffac
Task ':sdks:java:io:influxdb:compileTestJava' is not up-to-date because:
  No history is available.
The input changes require a full rebuild for incremental task ':sdks:java:io:influxdb:compileTestJava'.
Full recompilation is required because no incremental change information is available. This is usually caused by clean builds or changing compiler arguments.
Compiling with toolchain '/usr/lib/jvm/java-8-openjdk-amd64'.
Compiling with JDK Java compiler API.
Note: <https://ci-beam.apache.org/job/beam_PerformanceTests_InfluxDbIO_IT/ws/src/sdks/java/io/influxdb/src/test/java/org/apache/beam/sdk/io/influxdb/InfluxDbIOTest.java> uses unchecked or unsafe operations.
Note: Recompile with -Xlint:unchecked for details.
Class dependency analysis for incremental compilation took 0.002 secs.
Created classpath snapshot for incremental compilation in 0.062 secs.
Stored cache entry for task ':sdks:java:io:influxdb:compileTestJava' with cache key 779da935459ea365840819b7a457ffac
:sdks:java:io:influxdb:compileTestJava (Thread[included builds,5,main]) completed. Took 2.02 secs.
Resolve mutations for :sdks:java:io:influxdb:testClasses (Thread[Execution worker Thread 6,5,main]) started.
Resolve mutations for :sdks:java:io:influxdb:testClasses (Thread[Execution worker Thread 6,5,main]) completed. Took 0.0 secs.
:sdks:java:io:influxdb:testClasses (Thread[Execution worker,5,main]) started.

> Task :sdks:java:io:influxdb:testClasses
Skipping task ':sdks:java:io:influxdb:testClasses' as it has no actions.
:sdks:java:io:influxdb:testClasses (Thread[Execution worker,5,main]) completed. Took 0.0 secs.
Resolve mutations for :sdks:java:io:influxdb:integrationTest (Thread[Execution worker Thread 3,5,main]) started.
Resolve mutations for :sdks:java:io:influxdb:integrationTest (Thread[Execution worker Thread 3,5,main]) completed. Took 0.0 secs.
:sdks:java:io:influxdb:integrationTest (Thread[included builds,5,main]) started.
producer locations for task group 0 (Thread[Execution worker Thread 6,5,main]) started.
producer locations for task group 0 (Thread[Execution worker Thread 6,5,main]) completed. Took 0.0 secs.
Gradle Test Executor 93 started executing tests.

> Task :sdks:java:io:influxdb:integrationTest
Custom actions are attached to task ':sdks:java:io:influxdb:integrationTest'.
Build cache key for task ':sdks:java:io:influxdb:integrationTest' is 46b185c1bf94b10ab16e3ace4507d294
Task ':sdks:java:io:influxdb:integrationTest' is not up-to-date because:
  Task.upToDateWhen is false.
Starting process 'Gradle Test Executor 93'. Working directory: <https://ci-beam.apache.org/job/beam_PerformanceTests_InfluxDbIO_IT/ws/src/sdks/java/io/influxdb> Command: /usr/lib/jvm/java-8-openjdk-amd64/bin/java -DbeamTestPipelineOptions=["--influxDBURL=http://104.198.39.153:8086","--influxDBUserName=superadmin","--influxDBPassword=supersecretpassword","--databaseName=db1"] -Djava.security.manager=worker.org.gradle.process.internal.worker.child.BootstrapSecurityManager -Dorg.gradle.internal.worker.tmpdir=<https://ci-beam.apache.org/job/beam_PerformanceTests_InfluxDbIO_IT/ws/src/sdks/java/io/influxdb/build/tmp/integrationTest/work> -Dorg.gradle.native=false -Xmx2g -Dfile.encoding=UTF-8 -Duser.country=US -Duser.language=en -Duser.variant -ea -cp /home/jenkins/.gradle/caches/7.5.1/workerMain/gradle-worker.jar worker.org.gradle.process.internal.worker.GradleWorkerMain 'Gradle Test Executor 93'
Successfully started process 'Gradle Test Executor 93'

org.apache.beam.sdk.io.influxdb.InfluxDbIOIT > testWriteAndReadWithMultipleMetric FAILED
    org.influxdb.InfluxDBIOException: java.net.SocketTimeoutException: connect timed out
        at org.influxdb.impl.InfluxDBImpl.execute(InfluxDBImpl.java:836)
        at org.influxdb.impl.InfluxDBImpl.executeQuery(InfluxDBImpl.java:819)
        at org.influxdb.impl.InfluxDBImpl.query(InfluxDBImpl.java:554)
        at org.apache.beam.sdk.io.influxdb.InfluxDbIOIT.initTest(InfluxDbIOIT.java:99)

        Caused by:
        java.net.SocketTimeoutException: connect timed out
            at java.net.PlainSocketImpl.socketConnect(Native Method)
            at java.net.AbstractPlainSocketImpl.doConnect(AbstractPlainSocketImpl.java:350)
            at java.net.AbstractPlainSocketImpl.connectToAddress(AbstractPlainSocketImpl.java:206)
            at java.net.AbstractPlainSocketImpl.connect(AbstractPlainSocketImpl.java:188)
            at java.net.SocksSocketImpl.connect(SocksSocketImpl.java:392)
            at java.net.Socket.connect(Socket.java:607)
            at okhttp3.internal.platform.Platform.connectSocket(Platform.kt:119)
            at okhttp3.internal.connection.RealConnection.connectSocket(RealConnection.kt:283)
            at okhttp3.internal.connection.RealConnection.connect(RealConnection.kt:195)
            at okhttp3.internal.connection.ExchangeFinder.findConnection(ExchangeFinder.kt:249)
            at okhttp3.internal.connection.ExchangeFinder.findHealthyConnection(ExchangeFinder.kt:108)
            at okhttp3.internal.connection.ExchangeFinder.find(ExchangeFinder.kt:76)
            at okhttp3.internal.connection.RealCall.initExchange$okhttp(RealCall.kt:245)
            at okhttp3.internal.connection.ConnectInterceptor.intercept(ConnectInterceptor.kt:32)
            at okhttp3.internal.http.RealInterceptorChain.proceed(RealInterceptorChain.kt:100)
            at okhttp3.internal.cache.CacheInterceptor.intercept(CacheInterceptor.kt:82)
            at okhttp3.internal.http.RealInterceptorChain.proceed(RealInterceptorChain.kt:100)
            at okhttp3.internal.http.BridgeInterceptor.intercept(BridgeInterceptor.kt:83)
            at okhttp3.internal.http.RealInterceptorChain.proceed(RealInterceptorChain.kt:100)
            at okhttp3.internal.http.RetryAndFollowUpInterceptor.intercept(RetryAndFollowUpInterceptor.kt:76)
            at okhttp3.internal.http.RealInterceptorChain.proceed(RealInterceptorChain.kt:100)
            at org.influxdb.impl.BasicAuthInterceptor.intercept(BasicAuthInterceptor.java:22)
            at okhttp3.internal.http.RealInterceptorChain.proceed(RealInterceptorChain.kt:100)
            at org.influxdb.impl.GzipRequestInterceptor.intercept(GzipRequestInterceptor.java:42)
            at okhttp3.internal.http.RealInterceptorChain.proceed(RealInterceptorChain.kt:100)
            at okhttp3.logging.HttpLoggingInterceptor.intercept(HttpLoggingInterceptor.kt:152)
            at okhttp3.internal.http.RealInterceptorChain.proceed(RealInterceptorChain.kt:100)
            at okhttp3.internal.connection.RealCall.getResponseWithInterceptorChain$okhttp(RealCall.kt:197)
            at okhttp3.internal.connection.RealCall.execute(RealCall.kt:148)
            at retrofit2.OkHttpCall.execute(OkHttpCall.java:190)
            at org.influxdb.impl.InfluxDBImpl.execute(InfluxDBImpl.java:824)
            ... 3 more

Gradle Test Executor 93 finished executing tests.

> Task :sdks:java:io:influxdb:integrationTest

org.apache.beam.sdk.io.influxdb.InfluxDbIOIT > testWriteAndReadWithSingleMetric FAILED
    java.lang.AssertionError: Count All/Flatten.PCollections.out: 
    Expected: <2000L>
         but: was <1999L>
        at org.apache.beam.sdk.testing.PAssert$PAssertionSite.capture(PAssert.java:175)
        at org.apache.beam.sdk.testing.PAssert.thatSingleton(PAssert.java:498)
        at org.apache.beam.sdk.testing.PAssert.thatSingleton(PAssert.java:490)
        at org.apache.beam.sdk.io.influxdb.InfluxDbIOIT.testWriteAndReadWithSingleMetric(InfluxDbIOIT.java:203)

        Caused by:
        java.lang.AssertionError: 
        Expected: <2000L>
             but: was <1999L>
            at org.hamcrest.MatcherAssert.assertThat(MatcherAssert.java:18)
            at org.hamcrest.MatcherAssert.assertThat(MatcherAssert.java:6)
            at org.apache.beam.sdk.testing.PAssert$AssertIsEqualTo.apply(PAssert.java:1643)
            at org.apache.beam.sdk.testing.PAssert$AssertIsEqualTo.apply(PAssert.java:1634)
            at org.apache.beam.sdk.testing.PAssert$CheckRelationAgainstExpected.apply(PAssert.java:1299)
            at org.apache.beam.sdk.testing.PAssert$CheckRelationAgainstExpected.apply(PAssert.java:1279)
            at org.apache.beam.sdk.testing.PAssert.doChecks(PAssert.java:1621)
            at org.apache.beam.sdk.testing.PAssert$SingletonCheckerDoFn.processElement(PAssert.java:1614)
            at org.apache.beam.sdk.testing.PAssert$SingletonCheckerDoFn$DoFnInvoker.invokeProcessElement(Unknown Source)
            at org.apache.beam.repackaged.direct_java.runners.core.SimpleDoFnRunner.invokeProcessElement(SimpleDoFnRunner.java:211)
            at org.apache.beam.repackaged.direct_java.runners.core.SimpleDoFnRunner.processElement(SimpleDoFnRunner.java:188)
            at org.apache.beam.repackaged.direct_java.runners.core.SimplePushbackSideInputDoFnRunner.processElementInReadyWindows(SimplePushbackSideInputDoFnRunner.java:79)
            at org.apache.beam.runners.direct.ParDoEvaluator.processElement(ParDoEvaluator.java:244)
            at org.apache.beam.runners.direct.DoFnLifecycleManagerRemovingTransformEvaluator.processElement(DoFnLifecycleManagerRemovingTransformEvaluator.java:54)
            at org.apache.beam.runners.direct.DirectTransformExecutor.processElements(DirectTransformExecutor.java:165)
            at org.apache.beam.runners.direct.DirectTransformExecutor.run(DirectTransformExecutor.java:129)
            at java.util.concurrent.Executors$RunnableAdapter.call(Executors.java:511)
            at java.util.concurrent.FutureTask.run(FutureTask.java:266)
            at java.util.concurrent.ThreadPoolExecutor.runWorker(ThreadPoolExecutor.java:1149)
            at java.util.concurrent.ThreadPoolExecutor$Worker.run(ThreadPoolExecutor.java:624)
            at java.lang.Thread.run(Thread.java:750)

6 tests completed, 2 failed
Finished generating test XML results (0.001 secs) into: <https://ci-beam.apache.org/job/beam_PerformanceTests_InfluxDbIO_IT/ws/src/sdks/java/io/influxdb/build/test-results/integrationTest>
Generating HTML test report...
Finished generating test html results (0.002 secs) into: <https://ci-beam.apache.org/job/beam_PerformanceTests_InfluxDbIO_IT/ws/src/sdks/java/io/influxdb/build/reports/tests/integrationTest>

> Task :sdks:java:io:influxdb:integrationTest FAILED
:sdks:java:io:influxdb:integrationTest (Thread[included builds,5,main]) completed. Took 19.776 secs.

FAILURE: Build failed with an exception.

* What went wrong:
Execution failed for task ':sdks:java:io:influxdb:integrationTest'.
> There were failing tests. See the report at: file://<https://ci-beam.apache.org/job/beam_PerformanceTests_InfluxDbIO_IT/ws/src/sdks/java/io/influxdb/build/reports/tests/integrationTest/index.html>

* Try:
> Run with --stacktrace option to get the stack trace.
> Run with --debug option to get more log output.

* Get more help at https://help.gradle.org

Deprecated Gradle features were used in this build, making it incompatible with Gradle 8.0.

You can use '--warning-mode all' to show the individual deprecation warnings and determine if they come from your own scripts or plugins.

See https://docs.gradle.org/7.5.1/userguide/command_line_interface.html#sec:command_line_warnings

BUILD FAILED in 35s
77 actionable tasks: 44 executed, 31 from cache, 2 up-to-date

Publishing build scan...
https://gradle.com/s/w4rjibye2vq5y

Stopped 1 worker daemon(s).
Build step 'Invoke Gradle script' changed build result to FAILURE
Build step 'Invoke Gradle script' marked build as failure

---------------------------------------------------------------------
To unsubscribe, e-mail: builds-unsubscribe@beam.apache.org
For additional commands, e-mail: builds-help@beam.apache.org