You are viewing a plain text version of this content. The canonical link for it is here.
Posted to dev@lucene.apache.org by Policeman Jenkins Server <je...@thetaphi.de> on 2015/08/13 10:21:37 UTC
[JENKINS-EA] Lucene-Solr-5.x-Linux (64bit/jdk1.9.0-ea-b60) - Build
# 13612 - Failure!
Build: http://jenkins.thetaphi.de/job/Lucene-Solr-5.x-Linux/13612/
Java: 64bit/jdk1.9.0-ea-b60 -XX:+UseCompressedOops -XX:+UseSerialGC -Djava.locale.providers=JRE,SPI
1 tests failed.
FAILED: org.apache.solr.handler.component.SpellCheckComponentTest.testThresholdTokenFrequency
Error Message:
Path not found: /spellcheck/suggestions/[1]/suggestion
Stack Trace:
java.lang.RuntimeException: Path not found: /spellcheck/suggestions/[1]/suggestion
at __randomizedtesting.SeedInfo.seed([F9399A2457CF3AC1:739E15D5D82403BA]:0)
at org.apache.solr.SolrTestCaseJ4.assertJQ(SolrTestCaseJ4.java:853)
at org.apache.solr.SolrTestCaseJ4.assertJQ(SolrTestCaseJ4.java:800)
at org.apache.solr.handler.component.SpellCheckComponentTest.testThresholdTokenFrequency(SpellCheckComponentTest.java:219)
at sun.reflect.NativeMethodAccessorImpl.invoke0(Native Method)
at sun.reflect.NativeMethodAccessorImpl.invoke(NativeMethodAccessorImpl.java:62)
at sun.reflect.DelegatingMethodAccessorImpl.invoke(DelegatingMethodAccessorImpl.java:43)
at java.lang.reflect.Method.invoke(Method.java:502)
at com.carrotsearch.randomizedtesting.RandomizedRunner.invoke(RandomizedRunner.java:1627)
at com.carrotsearch.randomizedtesting.RandomizedRunner$6.evaluate(RandomizedRunner.java:836)
at com.carrotsearch.randomizedtesting.RandomizedRunner$7.evaluate(RandomizedRunner.java:872)
at com.carrotsearch.randomizedtesting.RandomizedRunner$8.evaluate(RandomizedRunner.java:886)
at com.carrotsearch.randomizedtesting.rules.SystemPropertiesRestoreRule$1.evaluate(SystemPropertiesRestoreRule.java:57)
at org.apache.lucene.util.TestRuleSetupTeardownChained$1.evaluate(TestRuleSetupTeardownChained.java:50)
at org.apache.lucene.util.AbstractBeforeAfterRule$1.evaluate(AbstractBeforeAfterRule.java:46)
at org.apache.lucene.util.TestRuleThreadAndTestName$1.evaluate(TestRuleThreadAndTestName.java:49)
at org.apache.lucene.util.TestRuleIgnoreAfterMaxFailures$1.evaluate(TestRuleIgnoreAfterMaxFailures.java:65)
at org.apache.lucene.util.TestRuleMarkFailure$1.evaluate(TestRuleMarkFailure.java:48)
at com.carrotsearch.randomizedtesting.rules.StatementAdapter.evaluate(StatementAdapter.java:36)
at com.carrotsearch.randomizedtesting.ThreadLeakControl$StatementRunner.run(ThreadLeakControl.java:365)
at com.carrotsearch.randomizedtesting.ThreadLeakControl.forkTimeoutingTask(ThreadLeakControl.java:798)
at com.carrotsearch.randomizedtesting.ThreadLeakControl$3.evaluate(ThreadLeakControl.java:458)
at com.carrotsearch.randomizedtesting.RandomizedRunner.runSingleTest(RandomizedRunner.java:845)
at com.carrotsearch.randomizedtesting.RandomizedRunner$3.evaluate(RandomizedRunner.java:747)
at com.carrotsearch.randomizedtesting.RandomizedRunner$4.evaluate(RandomizedRunner.java:781)
at com.carrotsearch.randomizedtesting.RandomizedRunner$5.evaluate(RandomizedRunner.java:792)
at com.carrotsearch.randomizedtesting.rules.StatementAdapter.evaluate(StatementAdapter.java:36)
at com.carrotsearch.randomizedtesting.rules.SystemPropertiesRestoreRule$1.evaluate(SystemPropertiesRestoreRule.java:57)
at org.apache.lucene.util.AbstractBeforeAfterRule$1.evaluate(AbstractBeforeAfterRule.java:46)
at com.carrotsearch.randomizedtesting.rules.StatementAdapter.evaluate(StatementAdapter.java:36)
at org.apache.lucene.util.TestRuleStoreClassName$1.evaluate(TestRuleStoreClassName.java:42)
at com.carrotsearch.randomizedtesting.rules.NoShadowingOrOverridesOnMethodsRule$1.evaluate(NoShadowingOrOverridesOnMethodsRule.java:39)
at com.carrotsearch.randomizedtesting.rules.NoShadowingOrOverridesOnMethodsRule$1.evaluate(NoShadowingOrOverridesOnMethodsRule.java:39)
at com.carrotsearch.randomizedtesting.rules.StatementAdapter.evaluate(StatementAdapter.java:36)
at com.carrotsearch.randomizedtesting.rules.StatementAdapter.evaluate(StatementAdapter.java:36)
at com.carrotsearch.randomizedtesting.rules.StatementAdapter.evaluate(StatementAdapter.java:36)
at org.apache.lucene.util.TestRuleAssertionsRequired$1.evaluate(TestRuleAssertionsRequired.java:54)
at org.apache.lucene.util.TestRuleMarkFailure$1.evaluate(TestRuleMarkFailure.java:48)
at org.apache.lucene.util.TestRuleIgnoreAfterMaxFailures$1.evaluate(TestRuleIgnoreAfterMaxFailures.java:65)
at org.apache.lucene.util.TestRuleIgnoreTestSuites$1.evaluate(TestRuleIgnoreTestSuites.java:55)
at com.carrotsearch.randomizedtesting.rules.StatementAdapter.evaluate(StatementAdapter.java:36)
at com.carrotsearch.randomizedtesting.ThreadLeakControl$StatementRunner.run(ThreadLeakControl.java:365)
at java.lang.Thread.run(Thread.java:745)
Build Log:
[...truncated 10896 lines...]
[junit4] Suite: org.apache.solr.handler.component.SpellCheckComponentTest
[junit4] 2> Creating dataDir: /home/jenkins/workspace/Lucene-Solr-5.x-Linux/solr/build/solr-core/test/J2/temp/solr.handler.component.SpellCheckComponentTest_F9399A2457CF3AC1-001/init-core-data-001
[junit4] 2> 826660 INFO (SUITE-SpellCheckComponentTest-seed#[F9399A2457CF3AC1]-worker) [ ] o.a.s.SolrTestCaseJ4 Randomized ssl (false) and clientAuth (true)
[junit4] 2> 826660 INFO (SUITE-SpellCheckComponentTest-seed#[F9399A2457CF3AC1]-worker) [ ] o.a.s.SolrTestCaseJ4 ####initCore
[junit4] 2> 826660 INFO (SUITE-SpellCheckComponentTest-seed#[F9399A2457CF3AC1]-worker) [ ] o.a.s.c.SolrResourceLoader new SolrResourceLoader for directory: '/home/jenkins/workspace/Lucene-Solr-5.x-Linux/solr/core/src/test-files/solr/collection1/'
[junit4] 2> 826661 INFO (SUITE-SpellCheckComponentTest-seed#[F9399A2457CF3AC1]-worker) [ ] o.a.s.c.SolrResourceLoader Adding 'file:/home/jenkins/workspace/Lucene-Solr-5.x-Linux/solr/core/src/test-files/solr/collection1/lib/classes/' to classloader
[junit4] 2> 826661 INFO (SUITE-SpellCheckComponentTest-seed#[F9399A2457CF3AC1]-worker) [ ] o.a.s.c.SolrResourceLoader Adding 'file:/home/jenkins/workspace/Lucene-Solr-5.x-Linux/solr/core/src/test-files/solr/collection1/lib/README' to classloader
[junit4] 2> 826672 INFO (SUITE-SpellCheckComponentTest-seed#[F9399A2457CF3AC1]-worker) [ ] o.a.s.c.SolrConfig current version of requestparams : -1
[junit4] 2> 826676 INFO (SUITE-SpellCheckComponentTest-seed#[F9399A2457CF3AC1]-worker) [ ] o.a.s.c.SolrConfig Using Lucene MatchVersion: 5.4.0
[junit4] 2> 826682 INFO (SUITE-SpellCheckComponentTest-seed#[F9399A2457CF3AC1]-worker) [ ] o.a.s.c.Config Loaded SolrConfig: solrconfig-spellcheckcomponent.xml
[junit4] 2> 826682 INFO (SUITE-SpellCheckComponentTest-seed#[F9399A2457CF3AC1]-worker) [ ] o.a.s.s.IndexSchema Reading Solr Schema from /home/jenkins/workspace/Lucene-Solr-5.x-Linux/solr/core/src/test-files/solr/collection1/conf/schema.xml
[junit4] 2> 826685 INFO (SUITE-SpellCheckComponentTest-seed#[F9399A2457CF3AC1]-worker) [ ] o.a.s.s.IndexSchema [null] Schema name=test
[junit4] 2> 826759 INFO (SUITE-SpellCheckComponentTest-seed#[F9399A2457CF3AC1]-worker) [ ] o.a.s.s.OpenExchangeRatesOrgProvider Initialized with rates=open-exchange-rates.json, refreshInterval=1440.
[junit4] 2> 826762 INFO (SUITE-SpellCheckComponentTest-seed#[F9399A2457CF3AC1]-worker) [ ] o.a.s.s.IndexSchema default search field in schema is text
[junit4] 2> 826763 INFO (SUITE-SpellCheckComponentTest-seed#[F9399A2457CF3AC1]-worker) [ ] o.a.s.s.IndexSchema unique key field: id
[junit4] 2> 826765 INFO (SUITE-SpellCheckComponentTest-seed#[F9399A2457CF3AC1]-worker) [ ] o.a.s.s.FileExchangeRateProvider Reloading exchange rates from file currency.xml
[junit4] 2> 826766 INFO (SUITE-SpellCheckComponentTest-seed#[F9399A2457CF3AC1]-worker) [ ] o.a.s.s.FileExchangeRateProvider Reloading exchange rates from file currency.xml
[junit4] 2> 826767 INFO (SUITE-SpellCheckComponentTest-seed#[F9399A2457CF3AC1]-worker) [ ] o.a.s.s.OpenExchangeRatesOrgProvider Reloading exchange rates from open-exchange-rates.json
[junit4] 2> 826767 WARN (SUITE-SpellCheckComponentTest-seed#[F9399A2457CF3AC1]-worker) [ ] o.a.s.s.OpenExchangeRatesOrgProvider Unknown key IMPORTANT NOTE
[junit4] 2> 826767 WARN (SUITE-SpellCheckComponentTest-seed#[F9399A2457CF3AC1]-worker) [ ] o.a.s.s.OpenExchangeRatesOrgProvider Expected key, got STRING
[junit4] 2> 826768 INFO (SUITE-SpellCheckComponentTest-seed#[F9399A2457CF3AC1]-worker) [ ] o.a.s.s.OpenExchangeRatesOrgProvider Reloading exchange rates from open-exchange-rates.json
[junit4] 2> 826768 WARN (SUITE-SpellCheckComponentTest-seed#[F9399A2457CF3AC1]-worker) [ ] o.a.s.s.OpenExchangeRatesOrgProvider Unknown key IMPORTANT NOTE
[junit4] 2> 826768 WARN (SUITE-SpellCheckComponentTest-seed#[F9399A2457CF3AC1]-worker) [ ] o.a.s.s.OpenExchangeRatesOrgProvider Expected key, got STRING
[junit4] 2> 826768 INFO (SUITE-SpellCheckComponentTest-seed#[F9399A2457CF3AC1]-worker) [ ] o.a.s.c.SolrResourceLoader JNDI not configured for solr (NoInitialContextEx)
[junit4] 2> 826768 INFO (SUITE-SpellCheckComponentTest-seed#[F9399A2457CF3AC1]-worker) [ ] o.a.s.c.SolrResourceLoader using system property solr.solr.home: /home/jenkins/workspace/Lucene-Solr-5.x-Linux/solr/core/src/test-files/solr
[junit4] 2> 826768 INFO (SUITE-SpellCheckComponentTest-seed#[F9399A2457CF3AC1]-worker) [ ] o.a.s.c.SolrResourceLoader new SolrResourceLoader for directory: '/home/jenkins/workspace/Lucene-Solr-5.x-Linux/solr/core/src/test-files/solr/'
[junit4] 2> 826775 INFO (SUITE-SpellCheckComponentTest-seed#[F9399A2457CF3AC1]-worker) [ ] o.a.s.c.CoreContainer New CoreContainer 814323879
[junit4] 2> 826775 INFO (SUITE-SpellCheckComponentTest-seed#[F9399A2457CF3AC1]-worker) [ ] o.a.s.c.CoreContainer Loading cores into CoreContainer [instanceDir=/home/jenkins/workspace/Lucene-Solr-5.x-Linux/solr/core/src/test-files/solr/]
[junit4] 2> 826775 INFO (SUITE-SpellCheckComponentTest-seed#[F9399A2457CF3AC1]-worker) [ ] o.a.s.c.CoreContainer loading shared library: /home/jenkins/workspace/Lucene-Solr-5.x-Linux/solr/core/src/test-files/solr/lib
[junit4] 2> 826775 WARN (SUITE-SpellCheckComponentTest-seed#[F9399A2457CF3AC1]-worker) [ ] o.a.s.c.SolrResourceLoader Can't find (or read) directory to add to classloader: lib (resolved as: /home/jenkins/workspace/Lucene-Solr-5.x-Linux/solr/core/src/test-files/solr/lib).
[junit4] 2> 826778 INFO (SUITE-SpellCheckComponentTest-seed#[F9399A2457CF3AC1]-worker) [ ] o.a.s.h.c.HttpShardHandlerFactory created with socketTimeout : 600000,connTimeout : 60000,maxConnectionsPerHost : 20,maxConnections : 10000,corePoolSize : 0,maximumPoolSize : 2147483647,maxThreadIdleTime : 5,sizeOfQueue : -1,fairnessPolicy : false,useRetries : false,
[junit4] 2> 826779 INFO (SUITE-SpellCheckComponentTest-seed#[F9399A2457CF3AC1]-worker) [ ] o.a.s.u.UpdateShardHandler Creating UpdateShardHandler HTTP client with params: socketTimeout=30000&connTimeout=30000&retry=true
[junit4] 2> 826779 INFO (SUITE-SpellCheckComponentTest-seed#[F9399A2457CF3AC1]-worker) [ ] o.a.s.l.LogWatcher SLF4J impl is org.slf4j.impl.Log4jLoggerFactory
[junit4] 2> 826779 INFO (SUITE-SpellCheckComponentTest-seed#[F9399A2457CF3AC1]-worker) [ ] o.a.s.l.LogWatcher Registering Log Listener [Log4j (org.slf4j.impl.Log4jLoggerFactory)]
[junit4] 2> 826779 INFO (SUITE-SpellCheckComponentTest-seed#[F9399A2457CF3AC1]-worker) [ ] o.a.s.c.CoreContainer Security conf doesn't exist. Skipping setup for authorization module.
[junit4] 2> 826780 INFO (SUITE-SpellCheckComponentTest-seed#[F9399A2457CF3AC1]-worker) [ ] o.a.s.c.CoreContainer No authentication plugin used.
[junit4] 2> 826780 INFO (SUITE-SpellCheckComponentTest-seed#[F9399A2457CF3AC1]-worker) [ ] o.a.s.c.SolrCore Created CoreDescriptor: {name=collection1, config=solrconfig-spellcheckcomponent.xml, transient=false, schema=schema.xml, loadOnStartup=true, configSetProperties=configsetprops.json, instanceDir=collection1, collection=collection1, absoluteInstDir=/home/jenkins/workspace/Lucene-Solr-5.x-Linux/solr/core/src/test-files/solr/collection1/, dataDir=/home/jenkins/workspace/Lucene-Solr-5.x-Linux/solr/build/solr-core/test/J2/temp/solr.handler.component.SpellCheckComponentTest_F9399A2457CF3AC1-001/init-core-data-001, shard=shard1}
[junit4] 2> 826780 INFO (coreLoadExecutor-3530-thread-1) [ ] o.a.s.c.SolrResourceLoader new SolrResourceLoader for directory: '/home/jenkins/workspace/Lucene-Solr-5.x-Linux/solr/core/src/test-files/solr/collection1/'
[junit4] 2> 826781 INFO (coreLoadExecutor-3530-thread-1) [ ] o.a.s.c.SolrResourceLoader Adding 'file:/home/jenkins/workspace/Lucene-Solr-5.x-Linux/solr/core/src/test-files/solr/collection1/lib/classes/' to classloader
[junit4] 2> 826781 INFO (coreLoadExecutor-3530-thread-1) [ ] o.a.s.c.SolrResourceLoader Adding 'file:/home/jenkins/workspace/Lucene-Solr-5.x-Linux/solr/core/src/test-files/solr/collection1/lib/README' to classloader
[junit4] 2> 826789 INFO (coreLoadExecutor-3530-thread-1) [ ] o.a.s.c.SolrConfig current version of requestparams : -1
[junit4] 2> 826792 INFO (coreLoadExecutor-3530-thread-1) [ ] o.a.s.c.SolrConfig Using Lucene MatchVersion: 5.4.0
[junit4] 2> 826799 INFO (coreLoadExecutor-3530-thread-1) [ ] o.a.s.c.Config Loaded SolrConfig: solrconfig-spellcheckcomponent.xml
[junit4] 2> 826799 INFO (coreLoadExecutor-3530-thread-1) [ ] o.a.s.s.IndexSchema Reading Solr Schema from /home/jenkins/workspace/Lucene-Solr-5.x-Linux/solr/core/src/test-files/solr/collection1/conf/schema.xml
[junit4] 2> 826801 INFO (coreLoadExecutor-3530-thread-1) [ ] o.a.s.s.IndexSchema [collection1] Schema name=test
[junit4] 2> 826871 INFO (coreLoadExecutor-3530-thread-1) [ ] o.a.s.s.OpenExchangeRatesOrgProvider Initialized with rates=open-exchange-rates.json, refreshInterval=1440.
[junit4] 2> 826874 INFO (coreLoadExecutor-3530-thread-1) [ ] o.a.s.s.IndexSchema default search field in schema is text
[junit4] 2> 826875 INFO (coreLoadExecutor-3530-thread-1) [ ] o.a.s.s.IndexSchema unique key field: id
[junit4] 2> 826877 INFO (coreLoadExecutor-3530-thread-1) [ ] o.a.s.s.FileExchangeRateProvider Reloading exchange rates from file currency.xml
[junit4] 2> 826879 INFO (coreLoadExecutor-3530-thread-1) [ ] o.a.s.s.FileExchangeRateProvider Reloading exchange rates from file currency.xml
[junit4] 2> 826879 INFO (coreLoadExecutor-3530-thread-1) [ ] o.a.s.s.OpenExchangeRatesOrgProvider Reloading exchange rates from open-exchange-rates.json
[junit4] 2> 826879 WARN (coreLoadExecutor-3530-thread-1) [ ] o.a.s.s.OpenExchangeRatesOrgProvider Unknown key IMPORTANT NOTE
[junit4] 2> 826880 WARN (coreLoadExecutor-3530-thread-1) [ ] o.a.s.s.OpenExchangeRatesOrgProvider Expected key, got STRING
[junit4] 2> 826880 INFO (coreLoadExecutor-3530-thread-1) [ ] o.a.s.s.OpenExchangeRatesOrgProvider Reloading exchange rates from open-exchange-rates.json
[junit4] 2> 826880 WARN (coreLoadExecutor-3530-thread-1) [ ] o.a.s.s.OpenExchangeRatesOrgProvider Unknown key IMPORTANT NOTE
[junit4] 2> 826880 WARN (coreLoadExecutor-3530-thread-1) [ ] o.a.s.s.OpenExchangeRatesOrgProvider Expected key, got STRING
[junit4] 2> 826880 INFO (coreLoadExecutor-3530-thread-1) [ ] o.a.s.c.ConfigSetProperties Did not find ConfigSet properties, assuming default properties: Can't find resource 'configsetprops.json' in classpath or '/home/jenkins/workspace/Lucene-Solr-5.x-Linux/solr/core/src/test-files/solr/collection1/conf'
[junit4] 2> 826880 INFO (coreLoadExecutor-3530-thread-1) [ ] o.a.s.c.CoreContainer Creating SolrCore 'collection1' using configuration from instancedir /home/jenkins/workspace/Lucene-Solr-5.x-Linux/solr/core/src/test-files/solr/collection1/
[junit4] 2> 826881 INFO (coreLoadExecutor-3530-thread-1) [ x:collection1] o.a.s.c.SolrCore org.apache.solr.core.MockDirectoryFactory
[junit4] 2> 826881 INFO (coreLoadExecutor-3530-thread-1) [ x:collection1] o.a.s.c.SolrCore [[collection1] ] Opening new SolrCore at [/home/jenkins/workspace/Lucene-Solr-5.x-Linux/solr/core/src/test-files/solr/collection1/], dataDir=[null]
[junit4] 2> 826881 INFO (coreLoadExecutor-3530-thread-1) [ x:collection1] o.a.s.c.SolrCore JMX monitoring not detected for core: collection1
[junit4] 2> 826881 INFO (coreLoadExecutor-3530-thread-1) [ x:collection1] o.a.s.c.CachingDirectoryFactory return new directory for /home/jenkins/workspace/Lucene-Solr-5.x-Linux/solr/build/solr-core/test/J2/temp/solr.handler.component.SpellCheckComponentTest_F9399A2457CF3AC1-001/init-core-data-001
[junit4] 2> 826881 INFO (coreLoadExecutor-3530-thread-1) [ x:collection1] o.a.s.c.SolrCore New index directory detected: old=null new=/home/jenkins/workspace/Lucene-Solr-5.x-Linux/solr/build/solr-core/test/J2/temp/solr.handler.component.SpellCheckComponentTest_F9399A2457CF3AC1-001/init-core-data-001/index/
[junit4] 2> 826882 WARN (coreLoadExecutor-3530-thread-1) [ x:collection1] o.a.s.c.SolrCore [collection1] Solr index directory '/home/jenkins/workspace/Lucene-Solr-5.x-Linux/solr/build/solr-core/test/J2/temp/solr.handler.component.SpellCheckComponentTest_F9399A2457CF3AC1-001/init-core-data-001/index' doesn't exist. Creating new index...
[junit4] 2> 826882 INFO (coreLoadExecutor-3530-thread-1) [ x:collection1] o.a.s.c.CachingDirectoryFactory return new directory for /home/jenkins/workspace/Lucene-Solr-5.x-Linux/solr/build/solr-core/test/J2/temp/solr.handler.component.SpellCheckComponentTest_F9399A2457CF3AC1-001/init-core-data-001/index
[junit4] 2> 826882 INFO (coreLoadExecutor-3530-thread-1) [ x:collection1] o.a.s.u.RandomMergePolicy RandomMergePolicy wrapping class org.apache.lucene.index.TieredMergePolicy: [TieredMergePolicy: maxMergeAtOnce=16, maxMergeAtOnceExplicit=15, maxMergedSegmentMB=54.86328125, floorSegmentMB=1.3740234375, forceMergeDeletesPctAllowed=27.58924704211929, segmentsPerTier=16.0, maxCFSSegmentSizeMB=8.796093022207999E12, noCFSRatio=1.0
[junit4] 2> 826883 INFO (coreLoadExecutor-3530-thread-1) [ x:collection1] o.a.s.c.SolrCore SolrDeletionPolicy.onCommit: commits: num=1
[junit4] 2> commit{dir=MockDirectoryWrapper(RAMDirectory@79497990 lockFactory=org.apache.lucene.store.SingleInstanceLockFactory@4f6693c7),segFN=segments_1,generation=1}
[junit4] 2> 826883 INFO (coreLoadExecutor-3530-thread-1) [ x:collection1] o.a.s.c.SolrCore newest commit generation = 1
[junit4] 2> 826883 INFO (OldIndexDirectoryCleanupThreadForCore-collection1) [ x:collection1] o.a.s.c.SolrCore Looking for old index directories to cleanup for core collection1 in /home/jenkins/workspace/Lucene-Solr-5.x-Linux/solr/build/solr-core/test/J2/temp/solr.handler.component.SpellCheckComponentTest_F9399A2457CF3AC1-001/init-core-data-001/
[junit4] 2> 826884 INFO (coreLoadExecutor-3530-thread-1) [ x:collection1] o.a.s.c.SolrCore no updateRequestProcessorChain defined as default, creating implicit default
[junit4] 2> 826885 INFO (coreLoadExecutor-3530-thread-1) [ x:collection1] o.a.s.h.l.XMLLoader xsltCacheLifetimeSeconds=60
[junit4] 2> 826886 INFO (coreLoadExecutor-3530-thread-1) [ x:collection1] o.a.s.h.l.XMLLoader xsltCacheLifetimeSeconds=60
[junit4] 2> 826886 INFO (coreLoadExecutor-3530-thread-1) [ x:collection1] o.a.s.h.l.XMLLoader xsltCacheLifetimeSeconds=60
[junit4] 2> 826887 INFO (coreLoadExecutor-3530-thread-1) [ x:collection1] o.a.s.h.l.XMLLoader xsltCacheLifetimeSeconds=60
[junit4] 2> 826887 INFO (coreLoadExecutor-3530-thread-1) [ x:collection1] o.a.s.c.RequestHandlers Registered paths: /admin/mbeans,standard,spellCheckCompRH,/update/csv,/update/json/docs,/admin/luke,/admin/segments,/get,spellCheckCompRH1,/admin/system,/replication,/admin/properties,/config,/schema,/admin/plugins,/admin/logging,spellCheckWithWordbreak,/update/json,/admin/threads,/admin/ping,/update,/admin/file
[junit4] 2> 826888 INFO (coreLoadExecutor-3530-thread-1) [ x:collection1] o.a.s.c.SolrCore Using default statsCache cache: org.apache.solr.search.stats.LocalStatsCache
[junit4] 2> 826888 INFO (coreLoadExecutor-3530-thread-1) [ x:collection1] o.a.s.c.SolrCore Hard AutoCommit: disabled
[junit4] 2> 826888 INFO (coreLoadExecutor-3530-thread-1) [ x:collection1] o.a.s.c.SolrCore Soft AutoCommit: disabled
[junit4] 2> 826888 INFO (coreLoadExecutor-3530-thread-1) [ x:collection1] o.a.s.u.RandomMergePolicy RandomMergePolicy wrapping class org.apache.lucene.index.LogByteSizeMergePolicy: [LogByteSizeMergePolicy: minMergeSize=1677721, mergeFactor=29, maxMergeSize=2147483648, maxMergeSizeForForcedMerge=9223372036854775807, calibrateSizeByDeletes=true, maxMergeDocs=2147483647, maxCFSSegmentSizeMB=8.796093022207999E12, noCFSRatio=0.3847756481056308]
[junit4] 2> 826888 INFO (coreLoadExecutor-3530-thread-1) [ x:collection1] o.a.s.c.SolrCore SolrDeletionPolicy.onInit: commits: num=1
[junit4] 2> commit{dir=MockDirectoryWrapper(RAMDirectory@79497990 lockFactory=org.apache.lucene.store.SingleInstanceLockFactory@4f6693c7),segFN=segments_1,generation=1}
[junit4] 2> 826888 INFO (coreLoadExecutor-3530-thread-1) [ x:collection1] o.a.s.c.SolrCore newest commit generation = 1
[junit4] 2> 826888 INFO (coreLoadExecutor-3530-thread-1) [ x:collection1] o.a.s.s.SolrIndexSearcher Opening Searcher@7a43f3c4[collection1] main
[junit4] 2> 826889 WARN (coreLoadExecutor-3530-thread-1) [ x:collection1] o.a.s.r.ManagedResourceStorage Cannot write to config directory /home/jenkins/workspace/Lucene-Solr-5.x-Linux/solr/core/src/test-files/solr/collection1/conf; switching to use InMemory storage instead.
[junit4] 2> 826889 INFO (coreLoadExecutor-3530-thread-1) [ x:collection1] o.a.s.r.RestManager Initializing RestManager with initArgs: {}
[junit4] 2> 826889 INFO (coreLoadExecutor-3530-thread-1) [ x:collection1] o.a.s.r.ManagedResourceStorage Reading _rest_managed.json using InMemoryStorage
[junit4] 2> 826889 INFO (coreLoadExecutor-3530-thread-1) [ x:collection1] o.a.s.r.RestManager Initializing 0 registered ManagedResources
[junit4] 2> 826889 INFO (coreLoadExecutor-3530-thread-1) [ x:collection1] o.a.s.h.c.SpellCheckComponent Initializing spell checkers
[junit4] 2> 826907 INFO (coreLoadExecutor-3530-thread-1) [ x:collection1] o.a.s.h.c.SpellCheckComponent Registering newSearcher listener for spellchecker: default
[junit4] 2> 826914 INFO (coreLoadExecutor-3530-thread-1) [ x:collection1] o.a.s.h.c.SpellCheckComponent Registering newSearcher listener for spellchecker: default_teststop
[junit4] 2> 826921 INFO (coreLoadExecutor-3530-thread-1) [ x:collection1] o.a.s.s.DirectSolrSpellChecker init: {name=direct,classname=solr.DirectSolrSpellChecker,minQueryLength=3,maxQueryFrequency=100.0,field=teststop}
[junit4] 2> 826921 INFO (coreLoadExecutor-3530-thread-1) [ x:collection1] o.a.s.s.DirectSolrSpellChecker init: {name=direct_lowerfilt,classname=solr.DirectSolrSpellChecker,minQueryLength=3,maxQueryFrequency=100.0,field=lowerfilt}
[junit4] 2> 826934 INFO (coreLoadExecutor-3530-thread-1) [ x:collection1] o.a.s.h.c.SpellCheckComponent Registering newSearcher listener for spellchecker: threshold
[junit4] 2> 826935 INFO (coreLoadExecutor-3530-thread-1) [ x:collection1] o.a.s.s.DirectSolrSpellChecker init: {name=threshold_direct,classname=solr.DirectSolrSpellChecker,field=lowerfilt,spellcheckIndexDir=spellcheckerThreshold,buildOnCommit=true,thresholdTokenFrequency=0.29}
[junit4] 2> 826935 INFO (coreLoadExecutor-3530-thread-1) [ x:collection1] o.a.s.h.c.SpellCheckComponent Registering newSearcher listener for spellchecker: threshold_direct
[junit4] 2> 826947 INFO (coreLoadExecutor-3530-thread-1) [ x:collection1] o.a.s.h.c.SpellCheckComponent Registering newSearcher listener for spellchecker: multipleFields
[junit4] 2> 826992 INFO (coreLoadExecutor-3530-thread-1) [ x:collection1] o.a.s.h.c.SpellCheckComponent Registering newSearcher listener for spellchecker: freq
[junit4] 2> 827000 INFO (coreLoadExecutor-3530-thread-1) [ x:collection1] o.a.s.h.c.SpellCheckComponent Registering newSearcher listener for spellchecker: fqcn
[junit4] 2> 827000 INFO (coreLoadExecutor-3530-thread-1) [ x:collection1] o.a.s.h.ReplicationHandler Commits will be reserved for 10000
[junit4] 2> 827000 INFO (searcherExecutor-3531-thread-1-processing-x:collection1) [ x:collection1] o.a.s.h.c.SpellCheckComponent Loading spell index for spellchecker: default
[junit4] 2> 827000 INFO (coreLoadExecutor-3530-thread-1) [ x:collection1] o.a.s.c.CoreContainer registering core: collection1
[junit4] 2> 827000 INFO (searcherExecutor-3531-thread-1-processing-x:collection1) [ x:collection1] o.a.s.h.c.SpellCheckComponent Loading spell index for spellchecker: default_teststop
[junit4] 2> 827000 INFO (searcherExecutor-3531-thread-1-processing-x:collection1) [ x:collection1] o.a.s.h.c.SpellCheckComponent Loading spell index for spellchecker: direct
[junit4] 2> 827000 INFO (searcherExecutor-3531-thread-1-processing-x:collection1) [ x:collection1] o.a.s.h.c.SpellCheckComponent Loading spell index for spellchecker: direct_lowerfilt
[junit4] 2> 827000 INFO (searcherExecutor-3531-thread-1-processing-x:collection1) [ x:collection1] o.a.s.h.c.SpellCheckComponent Loading spell index for spellchecker: wordbreak
[junit4] 2> 827001 INFO (searcherExecutor-3531-thread-1-processing-x:collection1) [ x:collection1] o.a.s.h.c.SpellCheckComponent Loading spell index for spellchecker: threshold
[junit4] 2> 827001 INFO (searcherExecutor-3531-thread-1-processing-x:collection1) [ x:collection1] o.a.s.h.c.SpellCheckComponent Loading spell index for spellchecker: threshold_direct
[junit4] 2> 827001 INFO (searcherExecutor-3531-thread-1-processing-x:collection1) [ x:collection1] o.a.s.h.c.SpellCheckComponent Loading spell index for spellchecker: multipleFields
[junit4] 2> 827001 INFO (SUITE-SpellCheckComponentTest-seed#[F9399A2457CF3AC1]-worker) [ ] o.a.s.SolrTestCaseJ4 ####initCore end
[junit4] 2> 827001 INFO (searcherExecutor-3531-thread-1-processing-x:collection1) [ x:collection1] o.a.s.h.c.SpellCheckComponent Loading spell index for spellchecker: jarowinkler
[junit4] 2> 827001 INFO (searcherExecutor-3531-thread-1-processing-x:collection1) [ x:collection1] o.a.s.h.c.SpellCheckComponent Loading spell index for spellchecker: external
[junit4] 2> 827001 INFO (searcherExecutor-3531-thread-1-processing-x:collection1) [ x:collection1] o.a.s.h.c.SpellCheckComponent Loading spell index for spellchecker: freq
[junit4] 2> 827001 INFO (searcherExecutor-3531-thread-1-processing-x:collection1) [ x:collection1] o.a.s.h.c.SpellCheckComponent Loading spell index for spellchecker: fqcn
[junit4] 2> 827003 INFO (TEST-SpellCheckComponentTest.testThresholdTokenFrequency-seed#[F9399A2457CF3AC1]) [ ] o.a.s.SolrTestCaseJ4 ###Starting testThresholdTokenFrequency
[junit4] 2> 827003 INFO (TEST-SpellCheckComponentTest.testThresholdTokenFrequency-seed#[F9399A2457CF3AC1]) [ ] o.a.s.u.p.LogUpdateProcessor [collection1] webapp=null path=null params={} {add=[0]} 0 0
[junit4] 2> 827005 INFO (TEST-SpellCheckComponentTest.testThresholdTokenFrequency-seed#[F9399A2457CF3AC1]) [ ] o.a.s.u.p.LogUpdateProcessor [collection1] webapp=null path=null params={} {add=[1]} 0 0
[junit4] 2> 827005 INFO (TEST-SpellCheckComponentTest.testThresholdTokenFrequency-seed#[F9399A2457CF3AC1]) [ ] o.a.s.u.p.LogUpdateProcessor [collection1] webapp=null path=null params={} {add=[2]} 0 0
[junit4] 2> 827005 INFO (TEST-SpellCheckComponentTest.testThresholdTokenFrequency-seed#[F9399A2457CF3AC1]) [ ] o.a.s.u.p.LogUpdateProcessor [collection1] webapp=null path=null params={} {add=[3]} 0 0
[junit4] 2> 827005 INFO (TEST-SpellCheckComponentTest.testThresholdTokenFrequency-seed#[F9399A2457CF3AC1]) [ ] o.a.s.u.p.LogUpdateProcessor [collection1] webapp=null path=null params={} {add=[4]} 0 0
[junit4] 2> 827006 INFO (TEST-SpellCheckComponentTest.testThresholdTokenFrequency-seed#[F9399A2457CF3AC1]) [ ] o.a.s.u.p.LogUpdateProcessor [collection1] webapp=null path=null params={} {add=[5]} 0 0
[junit4] 2> 827006 INFO (TEST-SpellCheckComponentTest.testThresholdTokenFrequency-seed#[F9399A2457CF3AC1]) [ ] o.a.s.u.p.LogUpdateProcessor [collection1] webapp=null path=null params={} {add=[6]} 0 0
[junit4] 2> 827006 INFO (TEST-SpellCheckComponentTest.testThresholdTokenFrequency-seed#[F9399A2457CF3AC1]) [ ] o.a.s.u.p.LogUpdateProcessor [collection1] webapp=null path=null params={} {add=[7]} 0 0
[junit4] 2> 827006 INFO (TEST-SpellCheckComponentTest.testThresholdTokenFrequency-seed#[F9399A2457CF3AC1]) [ ] o.a.s.u.p.LogUpdateProcessor [collection1] webapp=null path=null params={} {add=[8]} 0 0
[junit4] 2> 827007 INFO (TEST-SpellCheckComponentTest.testThresholdTokenFrequency-seed#[F9399A2457CF3AC1]) [ ] o.a.s.u.p.LogUpdateProcessor [collection1] webapp=null path=null params={} {add=[9]} 0 0
[junit4] 2> 827007 INFO (TEST-SpellCheckComponentTest.testThresholdTokenFrequency-seed#[F9399A2457CF3AC1]) [ ] o.a.s.u.UpdateHandler start commit{,optimize=false,openSearcher=true,waitSearcher=true,expungeDeletes=false,softCommit=false,prepareCommit=false}
[junit4] 2> 827010 INFO (TEST-SpellCheckComponentTest.testThresholdTokenFrequency-seed#[F9399A2457CF3AC1]) [ ] o.a.s.c.SolrCore SolrDeletionPolicy.onCommit: commits: num=2
[junit4] 2> commit{dir=MockDirectoryWrapper(RAMDirectory@79497990 lockFactory=org.apache.lucene.store.SingleInstanceLockFactory@4f6693c7),segFN=segments_1,generation=1}
[junit4] 2> commit{dir=MockDirectoryWrapper(RAMDirectory@79497990 lockFactory=org.apache.lucene.store.SingleInstanceLockFactory@4f6693c7),segFN=segments_2,generation=2}
[junit4] 2> 827010 INFO (TEST-SpellCheckComponentTest.testThresholdTokenFrequency-seed#[F9399A2457CF3AC1]) [ ] o.a.s.c.SolrCore newest commit generation = 2
[junit4] 2> 827010 WARN (TEST-SpellCheckComponentTest.testThresholdTokenFrequency-seed#[F9399A2457CF3AC1]) [ ] o.a.s.c.SolrCore [collection1] PERFORMANCE WARNING: Overlapping onDeckSearchers=2
[junit4] 2> 827011 INFO (TEST-SpellCheckComponentTest.testThresholdTokenFrequency-seed#[F9399A2457CF3AC1]) [ ] o.a.s.s.SolrIndexSearcher Opening Searcher@570458ca[collection1] main
[junit4] 2> 827011 INFO (TEST-SpellCheckComponentTest.testThresholdTokenFrequency-seed#[F9399A2457CF3AC1]) [ ] o.a.s.u.UpdateHandler end_commit_flush
[junit4] 2> 827014 INFO (searcherExecutor-3531-thread-1-processing-x:collection1) [ x:collection1] o.a.s.h.c.SpellCheckComponent Loading spell index for spellchecker: perDict
[junit4] 2> 827014 INFO (searcherExecutor-3531-thread-1-processing-x:collection1) [ x:collection1] o.a.s.c.SolrCore [collection1] Registered new searcher Searcher@7a43f3c4[collection1] main{ExitableDirectoryReader(UninvertingDirectoryReader())}
[junit4] 2> 827014 INFO (searcherExecutor-3531-thread-1) [ ] o.a.s.h.c.SpellCheckComponent Loading spell index for spellchecker: default
[junit4] 2> 827014 INFO (searcherExecutor-3531-thread-1) [ ] o.a.s.h.c.SpellCheckComponent Loading spell index for spellchecker: default_teststop
[junit4] 2> 827014 INFO (searcherExecutor-3531-thread-1) [ ] o.a.s.h.c.SpellCheckComponent Loading spell index for spellchecker: direct
[junit4] 2> 827015 INFO (searcherExecutor-3531-thread-1) [ ] o.a.s.h.c.SpellCheckComponent Loading spell index for spellchecker: direct_lowerfilt
[junit4] 2> 827015 INFO (searcherExecutor-3531-thread-1) [ ] o.a.s.h.c.SpellCheckComponent Loading spell index for spellchecker: wordbreak
[junit4] 2> 827015 INFO (searcherExecutor-3531-thread-1) [ ] o.a.s.h.c.SpellCheckComponent Loading spell index for spellchecker: threshold
[junit4] 2> 827015 INFO (searcherExecutor-3531-thread-1) [ ] o.a.s.h.c.SpellCheckComponent Loading spell index for spellchecker: threshold_direct
[junit4] 2> 827015 INFO (searcherExecutor-3531-thread-1) [ ] o.a.s.h.c.SpellCheckComponent Loading spell index for spellchecker: multipleFields
[junit4] 2> 827015 INFO (searcherExecutor-3531-thread-1) [ ] o.a.s.h.c.SpellCheckComponent Loading spell index for spellchecker: jarowinkler
[junit4] 2> 827015 INFO (searcherExecutor-3531-thread-1) [ ] o.a.s.h.c.SpellCheckComponent Loading spell index for spellchecker: external
[junit4] 2> 827015 INFO (searcherExecutor-3531-thread-1) [ ] o.a.s.h.c.SpellCheckComponent Loading spell index for spellchecker: freq
[junit4] 2> 827015 INFO (searcherExecutor-3531-thread-1) [ ] o.a.s.h.c.SpellCheckComponent Loading spell index for spellchecker: fqcn
[junit4] 2> 827016 INFO (searcherExecutor-3531-thread-1) [ ] o.a.s.h.c.SpellCheckComponent Loading spell index for spellchecker: perDict
[junit4] 2> 827016 INFO (searcherExecutor-3531-thread-1) [ ] o.a.s.c.SolrCore [collection1] Registered new searcher Searcher@570458ca[collection1] main{ExitableDirectoryReader(UninvertingDirectoryReader(Uninverting(_0(5.4.0):C10)))}
[junit4] 2> 827016 INFO (TEST-SpellCheckComponentTest.testThresholdTokenFrequency-seed#[F9399A2457CF3AC1]) [ ] o.a.s.u.p.LogUpdateProcessor [collection1] webapp=null path=null params={} {commit=} 0 9
[junit4] 2> 827018 INFO (TEST-SpellCheckComponentTest.testThresholdTokenFrequency-seed#[F9399A2457CF3AC1]) [ ] o.a.s.c.S.Request [collection1] webapp=null path=null params={q=documenq&qt=spellCheckCompRH&spellcheck.dictionary=threshold&spellcheck=true&spellcheck.count=5&wt=xml&spellcheck.extendedResults=true} hits=0 status=0 QTime=1
[junit4] 2> 827018 ERROR (TEST-SpellCheckComponentTest.testThresholdTokenFrequency-seed#[F9399A2457CF3AC1]) [ ] o.a.s.SolrTestCaseJ4 query failed JSON validation. error=Path not found: /spellcheck/suggestions/[1]/suggestion
[junit4] 2> expected =/spellcheck/suggestions/[1]/suggestion==[{'word':'document','freq':2}]
[junit4] 2> response = {
[junit4] 2> "responseHeader":{
[junit4] 2> "status":0,
[junit4] 2> "QTime":1},
[junit4] 2> "response":{"numFound":0,"start":0,"docs":[]
[junit4] 2> },
[junit4] 2> "spellcheck":{
[junit4] 2> "suggestions":[],
[junit4] 2> "correctlySpelled":false}}
[junit4] 2>
[junit4] 2> request = q=documenq&qt=spellCheckCompRH&spellcheck.dictionary=threshold&spellcheck=true&spellcheck.count=5&wt=xml&spellcheck.extendedResults=true
[junit4] 2> 827018 INFO (TEST-SpellCheckComponentTest.testThresholdTokenFrequency-seed#[F9399A2457CF3AC1]) [ ] o.a.s.SolrTestCaseJ4 ###Ending testThresholdTokenFrequency
[junit4] 2> 827019 INFO (TEST-SpellCheckComponentTest.testThresholdTokenFrequency-seed#[F9399A2457CF3AC1]) [ ] o.a.s.c.SolrCore [collection1] REMOVING ALL DOCUMENTS FROM INDEX
[junit4] 2> 827019 INFO (TEST-SpellCheckComponentTest.testThresholdTokenFrequency-seed#[F9399A2457CF3AC1]) [ ] o.a.s.u.p.LogUpdateProcessor [collection1] webapp=null path=null params={} {deleteByQuery=*:*} 0 0
[junit4] 2> 827019 INFO (TEST-SpellCheckComponentTest.testThresholdTokenFrequency-seed#[F9399A2457CF3AC1]) [ ] o.a.s.u.UpdateHandler start commit{,optimize=false,openSearcher=true,waitSearcher=true,expungeDeletes=false,softCommit=false,prepareCommit=false}
[junit4] 2> 827019 INFO (TEST-SpellCheckComponentTest.testThresholdTokenFrequency-seed#[F9399A2457CF3AC1]) [ ] o.a.s.c.SolrCore SolrDeletionPolicy.onCommit: commits: num=2
[junit4] 2> commit{dir=MockDirectoryWrapper(RAMDirectory@79497990 lockFactory=org.apache.lucene.store.SingleInstanceLockFactory@4f6693c7),segFN=segments_2,generation=2}
[junit4] 2> commit{dir=MockDirectoryWrapper(RAMDirectory@79497990 lockFactory=org.apache.lucene.store.SingleInstanceLockFactory@4f6693c7),segFN=segments_3,generation=3}
[junit4] 2> 827019 INFO (TEST-SpellCheckComponentTest.testThresholdTokenFrequency-seed#[F9399A2457CF3AC1]) [ ] o.a.s.c.SolrCore newest commit generation = 3
[junit4] 2> 827019 INFO (TEST-SpellCheckComponentTest.testThresholdTokenFrequency-seed#[F9399A2457CF3AC1]) [ ] o.a.s.s.SolrIndexSearcher Opening Searcher@1d56730f[collection1] main
[junit4] 2> 827019 INFO (TEST-SpellCheckComponentTest.testThresholdTokenFrequency-seed#[F9399A2457CF3AC1]) [ ] o.a.s.u.UpdateHandler end_commit_flush
[junit4] 2> 827019 INFO (searcherExecutor-3531-thread-1) [ ] o.a.s.h.c.SpellCheckComponent Building spell index for spell checker: default
[junit4] 2> 827050 INFO (searcherExecutor-3531-thread-1) [ ] o.a.s.h.c.SpellCheckComponent Building spell index for spell checker: default_teststop
[junit4] 2> 827064 INFO (searcherExecutor-3531-thread-1) [ ] o.a.s.h.c.SpellCheckComponent Building spell index for spell checker: threshold
[junit4] 2> 827077 INFO (searcherExecutor-3531-thread-1) [ ] o.a.s.h.c.SpellCheckComponent Building spell index for spell checker: threshold_direct
[junit4] 2> 827078 INFO (searcherExecutor-3531-thread-1) [ ] o.a.s.h.c.SpellCheckComponent Building spell index for spell checker: multipleFields
[junit4] 2> 827104 INFO (searcherExecutor-3531-thread-1) [ ] o.a.s.h.c.SpellCheckComponent Building spell index for spell checker: freq
[junit4] 2> 827111 INFO (searcherExecutor-3531-thread-1) [ ] o.a.s.h.c.SpellCheckComponent Building spell index for spell checker: fqcn
[junit4] 2> 827125 INFO (searcherExecutor-3531-thread-1) [ ] o.a.s.c.SolrCore [collection1] Registered new searcher Searcher@1d56730f[collection1] main{ExitableDirectoryReader(UninvertingDirectoryReader())}
[junit4] 2> 827126 INFO (TEST-SpellCheckComponentTest.testThresholdTokenFrequency-seed#[F9399A2457CF3AC1]) [ ] o.a.s.u.p.LogUpdateProcessor [collection1] webapp=null path=null params={} {commit=} 0 106
[junit4] 2> NOTE: reproduce with: ant test -Dtestcase=SpellCheckComponentTest -Dtests.method=testThresholdTokenFrequency -Dtests.seed=F9399A2457CF3AC1 -Dtests.multiplier=3 -Dtests.slow=true -Dtests.locale=ja -Dtests.timezone=Canada/East-Saskatchewan -Dtests.asserts=true -Dtests.file.encoding=US-ASCII
[junit4] ERROR 0.14s J2 | SpellCheckComponentTest.testThresholdTokenFrequency <<<
[junit4] > Throwable #1: java.lang.RuntimeException: Path not found: /spellcheck/suggestions/[1]/suggestion
[junit4] > at __randomizedtesting.SeedInfo.seed([F9399A2457CF3AC1:739E15D5D82403BA]:0)
[junit4] > at org.apache.solr.SolrTestCaseJ4.assertJQ(SolrTestCaseJ4.java:853)
[junit4] > at org.apache.solr.SolrTestCaseJ4.assertJQ(SolrTestCaseJ4.java:800)
[junit4] > at org.apache.solr.handler.component.SpellCheckComponentTest.testThresholdTokenFrequency(SpellCheckComponentTest.java:219)
[junit4] > at java.lang.Thread.run(Thread.java:745)
[junit4] 2> 827140 INFO (TEST-SpellCheckComponentTest.testReloadOnStart-seed#[F9399A2457CF3AC1]) [ ] o.a.s.SolrTestCaseJ4 ###Starting testReloadOnStart
[junit4] 2> 827140 INFO (TEST-SpellCheckComponentTest.testReloadOnStart-seed#[F9399A2457CF3AC1]) [ ] o.a.s.u.p.LogUpdateProcessor [collection1] webapp=null path=null params={} {add=[0]} 0 0
[junit4] 2> 827140 INFO (TEST-SpellCheckComponentTest.testReloadOnStart-seed#[F9399A2457CF3AC1]) [ ] o.a.s.u.p.LogUpdateProcessor [collection1] webapp=null path=null params={} {add=[1]} 0 0
[junit4] 2> 827141 INFO (TEST-SpellCheckComponentTest.testReloadOnStart-seed#[F9399A2457CF3AC1]) [ ] o.a.s.u.p.LogUpdateProcessor [collection1] webapp=null path=null params={} {add=[2]} 0 0
[junit4] 2> 827141 INFO (TEST-SpellCheckComponentTest.testReloadOnStart-seed#[F9399A2457CF3AC1]) [ ] o.a.s.u.p.LogUpdateProcessor [collection1] webapp=null path=null params={} {add=[3]} 0 0
[junit4] 2> 827141 INFO (TEST-SpellCheckComponentTest.testReloadOnStart-seed#[F9399A2457CF3AC1]) [ ] o.a.s.u.p.LogUpdateProcessor [collection1] webapp=null path=null params={} {add=[4]} 0 0
[junit4] 2> 827141 INFO (TEST-SpellCheckComponentTest.testReloadOnStart-seed#[F9399A2457CF3AC1]) [ ] o.a.s.u.p.LogUpdateProcessor [collection1] webapp=null path=null params={} {add=[5]} 0 0
[junit4] 2> 827141 INFO (TEST-SpellCheckComponentTest.testReloadOnStart-seed#[F9399A2457CF3AC1]) [ ] o.a.s.u.p.LogUpdateProcessor [collection1] webapp=null path=null params={} {add=[6]} 0 0
[junit4] 2> 827142 INFO (TEST-SpellCheckComponentTest.testReloadOnStart-seed#[F9399A2457CF3AC1]) [ ] o.a.s.u.p.LogUpdateProcessor [collection1] webapp=null path=null params={} {add=[7]} 0 0
[junit4] 2> 827142 INFO (TEST-SpellCheckComponentTest.testReloadOnStart-seed#[F9399A2457CF3AC1]) [ ] o.a.s.u.p.LogUpdateProcessor [collection1] webapp=null path=null params={} {add=[8]} 0 0
[junit4] 2> 827142 INFO (TEST-SpellCheckComponentTest.testReloadOnStart-seed#[F9399A2457CF3AC1]) [ ] o.a.s.u.p.LogUpdateProcessor [collection1] webapp=null path=null params={} {add=[9]} 0 0
[junit4] 2> 827142 INFO (TEST-SpellCheckComponentTest.testReloadOnStart-seed#[F9399A2457CF3AC1]) [ ] o.a.s.u.UpdateHandler start commit{,optimize=false,openSearcher=true,waitSearcher=true,expungeDeletes=false,softCommit=false,prepareCommit=false}
[junit4] 2> 827144 INFO (TEST-SpellCheckComponentTest.testReloadOnStart-seed#[F9399A2457CF3AC1]) [ ] o.a.s.c.SolrCore SolrDeletionPolicy.onCommit: commits: num=2
[junit4] 2> commit{dir=MockDirectoryWrapper(RAMDirectory@79497990 lockFactory=org.apache.lucene.store.SingleInstanceLockFactory@4f6693c7),segFN=segments_3,generation=3}
[junit4] 2> commit{dir=MockDirectoryWrapper(RAMDirectory@79497990 lockFactory=org.apache.lucene.store.SingleInstanceLockFactory@4f6693c7),segFN=segments_4,generation=4}
[junit4] 2> 827144 INFO (TEST-SpellCheckComponentTest.testReloadOnStart-seed#[F9399A2457CF3AC1]) [ ] o.a.s.c.SolrCore newest commit generation = 4
[junit4] 2> 827145 INFO (TEST-SpellCheckComponentTest.testReloadOnStart-seed#[F9399A2457CF3AC1]) [ ] o.a.s.s.SolrIndexSearcher Opening Searcher@3e247cee[collection1] main
[junit4] 2> 827145 INFO (TEST-SpellCheckComponentTest.testReloadOnStart-seed#[F9399A2457CF3AC1]) [ ] o.a.s.u.UpdateHandler end_commit_flush
[junit4] 2> 827145 INFO (searcherExecutor-3531-thread-1) [ ] o.a.s.h.c.SpellCheckComponent Building spell index for spell checker: default
[junit4] 2> 827208 INFO (searcherExecutor-3531-thread-1) [ ] o.a.s.h.c.SpellCheckComponent Building spell index for spell checker: default_teststop
[junit4] 2> 827229 INFO (searcherExecutor-3531-thread-1) [ ] o.a.s.h.c.SpellCheckComponent Building spell index for spell checker: threshold
[junit4] 2> 827328 INFO (searcherExecutor-3531-thread-1) [ ] o.a.s.h.c.SpellCheckComponent Building spell index for spell checker: threshold_direct
[junit4] 2> 827328 INFO (searcherExecutor-3531-thread-1) [ ] o.a.s.h.c.SpellCheckComponent Building spell index for spell checker: multipleFields
[junit4] 2> 827403 INFO (searcherExecutor-3531-thread-1) [ ] o.a.s.h.c.SpellCheckComponent Building spell index for spell checker: freq
[junit4] 2> 827443 INFO (searcherExecutor-3531-thread-1) [ ] o.a.s.h.c.SpellCheckComponent Building spell index for spell checker: fqcn
[junit4] 2> 827514 INFO (searcherExecutor-3531-thread-1) [ ] o.a.s.c.SolrCore [collection1] Registered new searcher Searcher@3e247cee[collection1] main{ExitableDirectoryReader(UninvertingDirectoryReader(Uninverting(_1(5.4.0):C10)))}
[junit4] 2> 827514 INFO (TEST-SpellCheckComponentTest.testReloadOnStart-seed#[F9399A2457CF3AC1]) [ ] o.a.s.u.p.LogUpdateProcessor [collection1] webapp=null path=null params={} {commit=} 0 371
[junit4] 2> 827515 INFO (TEST-SpellCheckComponentTest.testReloadOnStart-seed#[F9399A2457CF3AC1]) [ ] o.a.s.u.p.LogUpdateProcessor [collection1] webapp=null path=null params={} {add=[0]} 0 0
[junit4] 2> 827516 INFO (TEST-SpellCheckComponentTest.testReloadOnStart-seed#[F9399A2457CF3AC1]) [ ] o.a.s.u.UpdateHandler start commit{,optimize=false,openSearcher=true,waitSearcher=true,expungeDeletes=false,softCommit=false,prepareCommit=false}
[junit4] 2> 827519 INFO (TEST-SpellCheckComponentTest.testReloadOnStart-seed#[F9399A2457CF3AC1]) [ ] o.a.s.c.SolrCore SolrDeletionPolicy.onCommit: commits: num=2
[junit4] 2> commit{dir=MockDirectoryWrapper(RAMDirectory@79497990 lockFactory=org.apache.lucene.store.SingleInstanceLockFactory@4f6693c7),segFN=segments_4,generation=4}
[junit4] 2> commit{dir=MockDirectoryWrapper(RAMDirectory@79497990 lockFactory=org.apache.lucene.store.SingleInstanceLockFactory@4f6693c7),segFN=segments_5,generation=5}
[junit4] 2> 827519 INFO (TEST-SpellCheckComponentTest.testReloadOnStart-seed#[F9399A2457CF3AC1]) [ ] o.a.s.c.SolrCore newest commit generation = 5
[junit4] 2> 827520 INFO (TEST-SpellCheckComponentTest.testReloadOnStart-seed#[F9399A2457CF3AC1]) [ ] o.a.s.s.SolrIndexSearcher Opening Searcher@764dc57e[collection1] main
[junit4] 2> 827520 INFO (TEST-SpellCheckComponentTest.testReloadOnStart-seed#[F9399A2457CF3AC1]) [ ] o.a.s.u.UpdateHandler end_commit_flush
[junit4] 2> 827520 INFO (searcherExecutor-3531-thread-1) [ ] o.a.s.h.c.SpellCheckComponent Building spell index for spell checker: default
[junit4] 2> 827599 INFO (searcherExecutor-3531-thread-1) [ ] o.a.s.h.c.SpellCheckComponent Building spell index for spell checker: default_teststop
[junit4] 2> 827621 INFO (searcherExecutor-3531-thread-1) [ ] o.a.s.h.c.SpellCheckComponent Building spell index for spell checker: threshold
[junit4] 2> 827677 INFO (searcherExecutor-3531-thread-1) [ ] o.a.s.h.c.SpellCheckComponent Building spell index for spell checker: threshold_direct
[junit4] 2> 827677 INFO (searcherExecutor-3531-thread-1) [ ] o.a.s.h.c.SpellCheckComponent Building spell index for spell checker: multipleFields
[junit4] 2> 827751 INFO (searcherExecutor-3531-thread-1) [ ] o.a.s.h.c.SpellCheckComponent Building spell index for spell checker: freq
[junit4] 2> 827804 INFO (searcherExecutor-3531-thread-1) [ ] o.a.s.h.c.SpellCheckComponent Building spell index for spell checker: fqcn
[junit4] 2> 827874 INFO (searcherExecutor-3531-thread-1) [ ] o.a.s.c.SolrCore [collection1] Registered new searcher Searcher@764dc57e[collection1] main{ExitableDirectoryReader(UninvertingDirectoryReader(Uninverting(_1(5.4.0):C10/1:delGen=1) Uninverting(_2(5.4.0):C1)))}
[junit4] 2> 827874 INFO (TEST-SpellCheckComponentTest.testReloadOnStart-seed#[F9399A2457CF3AC1]) [ ] o.a.s.u.p.LogUpdateProcessor [collection1] webapp=null path=null params={} {commit=} 0 358
[junit4] 2> 827955 INFO (TEST-SpellCheckComponentTest.testReloadOnStart-seed#[F9399A2457CF3AC1]) [ ] o.a.s.c.S.Request [collection1] webapp=null path=null params={q=*:*&spellcheck.q=ttle&qt=spellCheckCompRH&spellcheck.dictionary=default&spellcheck=true&wt=xml&spellcheck.build=true} hits=10 status=0 QTime=80
[junit4] 2> 827956 INFO (TEST-SpellCheckComponentTest.testReloadOnStart-seed#[F9399A2457CF3AC1]) [ ] o.a.s.h.c.SpellCheckComponent Initializing spell checkers
[junit4] 2> 827960 INFO (TEST-SpellCheckComponentTest.testReloadOnStart-seed#[F9399A2457CF3AC1]) [ ] o.a.s.SolrTestCaseJ4 ###Ending testReloadOnStart
[junit4] 2> 827960 INFO (TEST-SpellCheckComponentTest.testReloadOnStart-seed#[F9399A2457CF3AC1]) [ ] o.a.s.c.SolrCore [collection1] REMOVING ALL DOCUMENTS FROM INDEX
[junit4] 2> 827960 INFO (TEST-SpellCheckComponentTest.testReloadOnStart-seed#[F9399A2457CF3AC1]) [ ] o.a.s.u.p.LogUpdateProcessor [collection1] webapp=null path=null params={} {deleteByQuery=*:*} 0 0
[junit4] 2> 827961 INFO (TEST-SpellCheckComponentTest.testReloadOnStart-seed#[F9399A2457CF3AC1]) [ ] o.a.s.u.UpdateHandler start commit{,optimize=false,openSearcher=true,waitSearcher=true,expungeDeletes=false,softCommit=false,prepareCommit=false}
[junit4] 2> 827961 INFO (TEST-SpellCheckComponentTest.testReloadOnStart-seed#[F9399A2457CF3AC1]) [ ] o.a.s.c.SolrCore SolrDeletionPolicy.onCommit: commits: num=2
[junit4] 2> commit{dir=MockDirectoryWrapper(RAMDirectory@79497990 lockFactory=org.apache.lucene.store.SingleInstanceLockFactory@4f6693c7),segFN=segments_5,generation=5}
[junit4] 2> commit{dir=MockDirectoryWrapper(RAMDirectory@79497990 lockFactory=org.apache.lucene.store.SingleInstanceLockFactory@4f6693c7),segFN=segments_6,generation=6}
[junit4] 2> 827961 INFO (TEST-SpellCheckComponentTest.testReloadOnStart-seed#[F9399A2457CF3AC1]) [ ] o.a.s.c.SolrCore newest commit generation = 6
[junit4] 2> 827961 INFO (TEST-SpellCheckComponentTest.testReloadOnStart-seed#[F9399A2457CF3AC1]) [ ] o.a.s.s.SolrIndexSearcher Opening Searcher@119450e0[collection1] main
[junit4] 2> 827962 INFO (TEST-SpellCheckComponentTest.testReloadOnStart-seed#[F9399A2457CF3AC1]) [ ] o.a.s.u.UpdateHandler end_commit_flush
[junit4] 2> 827962 INFO (searcherExecutor-3531-thread-1) [ ] o.a.s.h.c.SpellCheckComponent Building spell index for spell checker: default
[junit4] 2> 827977 INFO (searcherExecutor-3531-thread-1) [ ] o.a.s.h.c.SpellCheckComponent Building spell index for spell checker: default_teststop
[junit4] 2> 827989 INFO (searcherExecutor-3531-thread-1) [ ] o.a.s.h.c.SpellCheckComponent Building spell index for spell checker: threshold
[junit4] 2> 828014 INFO (searcherExecutor-3531-thread-1) [ ] o.a.s.h.c.SpellCheckComponent Building spell index for spell checker: threshold_direct
[junit4] 2> 828014 INFO (searcherExecutor-3531-thread-1) [ ] o.a.s.h.c.SpellCheckComponent Building spell index for spell checker: multipleFields
[junit4] 2> 828028 INFO (searcherExecutor-3531-thread-1) [ ] o.a.s.h.c.SpellCheckComponent Building spell index for spell checker: freq
[junit4] 2> 828053 INFO (searcherExecutor-3531-thread-1) [ ] o.a.s.h.c.SpellCheckComponent Building spell index for spell checker: fqcn
[junit4] 2> 828067 INFO (searcherExecutor-3531-thread-1) [ ] o.a.s.c.SolrCore [collection1] Registered new searcher Searcher@119450e0[collection1] main{ExitableDirectoryReader(UninvertingDirectoryReader())}
[junit4] 2> 828067 INFO (TEST-SpellCheckComponentTest.testReloadOnStart-seed#[F9399A2457CF3AC1]) [ ] o.a.s.u.p.LogUpdateProcessor [collection1] webapp=null path=null params={} {commit=} 0 106
[junit4] 2> 828070 INFO (TEST-SpellCheckComponentTest.test-seed#[F9399A2457CF3AC1]) [ ] o.a.s.SolrTestCaseJ4 ###Starting test
[junit4] 2> 828071 INFO (TEST-SpellCheckComponentTest.test-seed#[F9399A2457CF3AC1]) [ ] o.a.s.u.p.LogUpdateProcessor [collection1] webapp=null path=null params={} {add=[0]} 0 0
[junit4] 2> 828071 INFO (TEST-SpellCheckComponentTest.test-seed#[F9399A2457CF3AC1]) [ ] o.a.s.u.p.LogUpdateProcessor [collection1] webapp=null path=null params={} {add=[1]} 0 0
[junit4] 2> 828072 INFO (TEST-SpellCheckComponentTest.test-seed#[F9399A2457CF3AC1]) [ ] o.a.s.u.p.LogUpdateProcessor [collection1] webapp=null path=null params={} {add=[2]} 0 0
[junit4] 2> 828072 INFO (TEST-SpellCheckComponentTest.test-seed#[F9399A2457CF3AC1]) [ ] o.a.s.u.p.LogUpdateProcessor [collection1] webapp=null path=null params={} {add=[3]} 0 0
[junit4] 2> 828072 INFO (TEST-SpellCheckComponentTest.test-seed#[F9399A2457CF3AC1]) [ ] o.a.s.u.p.LogUpdateProcessor [collection1] webapp=null path=null params={} {add=[4]} 0 0
[junit4] 2> 828073 INFO (TEST-SpellCheckComponentTest.test-seed#[F9399A2457CF3AC1]) [ ] o.a.s.u.p.LogUpdateProcessor [collection1] webapp=null path=null params={} {add=[5]} 0 0
[junit4] 2> 828073 INFO (TEST-SpellCheckComponentTest.test-seed#[F9399A2457CF3AC1]) [ ] o.a.s.u.p.LogUpdateProcessor [collection1] webapp=null path=null params={} {add=[6]} 0 0
[junit4] 2> 828074 INFO (TEST-SpellCheckComponentTest.test-seed#[F9399A2457CF3AC1]) [ ] o.a.s.u.p.LogUpdateProcessor [collection1] webapp=null path=null params={} {add=[7]} 0 0
[junit4] 2> 828074 INFO (TEST-SpellCheckComponentTest.test-seed#[F9399A2457CF3AC1]) [ ] o.a.s.u.p.LogUpdateProcessor [collection1] webapp=null path=null params={} {add=[8]} 0 0
[junit4] 2> 828074 INFO (TEST-SpellCheckComponentTest.test-seed#[F9399A2457CF3AC1]) [ ] o.a.s.u.p.LogUpdateProcessor [collection1] webapp=null path=null params={} {add=[9]} 0 0
[junit4] 2> 828074 INFO (TEST-SpellCheckComponentTest.test-seed#[F9399A2457CF3AC1]) [ ] o.a.s.u.UpdateHandler start commit{,optimize=false,openSearcher=true,waitSearcher=true,expungeDeletes=false,softCommit=false,prepareCommit=false}
[junit4] 2> 828077 INFO (TEST-SpellCheckComponentTest.test-seed#[F9399A2457CF3AC1]) [ ] o.a.s.c.SolrCore SolrDeletionPolicy.onCommit: commits: num=2
[junit4] 2> commit{dir=MockDirectoryWrapper(RAMDirectory@79497990 lockFactory=org.apache.lucene.store.SingleInstanceLockFactory@4f6693c7),segFN=segments_6,generation=6}
[junit4] 2> commit{dir=MockDirectoryWrapper(RAMDirectory@79497990 lockFactory=org.apache.lucene.store.SingleInstanceLockFactory@4f6693c7),segFN=segments_7,generation=7}
[junit4] 2> 828078 INFO (TEST-SpellCheckComponentTest.test-seed#[F9399A2457CF3AC1]) [ ] o.a.s.c.SolrCore newest commit generation = 7
[junit4] 2> 828079 INFO (TEST-SpellCheckComponentTest.test-seed#[F9399A2457CF3AC1]) [ ] o.a.s.s.SolrIndexSearcher Opening Searcher@421db3f5[collection1] main
[junit4] 2> 828079 INFO (TEST-SpellCheckComponentTest.test-seed#[F9399A2457CF3AC1]) [ ] o.a.s.u.UpdateHandler end_commit_flush
[junit4] 2> 828079 INFO (searcherExecutor-3531-thread-1) [ ] o.a.s.h.c.SpellCheckComponent Building spell index for spell checker: default
[junit4] 2> 828153 INFO (searcherExecutor-3531-thread-1) [ ] o.a.s.h.c.SpellCheckComponent Building spell index for spell checker: default_teststop
[junit4] 2> 828172 INFO (searcherExecutor-3531-thread-1) [ ] o.a.s.h.c.SpellCheckComponent Building spell index for spell checker: threshold
[junit4] 2> 828248 INFO (searcherExecutor-3531-thread-1) [ ] o.a.s.h.c.SpellCheckComponent Building spell index for spell checker: threshold_direct
[junit4] 2> 828248 INFO (searcherExecutor-3531-thread-1) [ ] o.a.s.h.c.SpellCheckComponent Building spell index for spell checker: multipleFields
[junit4] 2> 828298 INFO (searcherExecutor-3531-thread-1) [ ] o.a.s.h.c.SpellCheckComponent Building spell index for spell checker: freq
[junit4] 2> 828342 INFO (searcherExecutor-3531-thread-1) [ ] o.a.s.h.c.SpellCheckComponent Building spell index for spell checker: fqcn
[junit4] 2> 828416 INFO (searcherExecutor-3531-thread-1) [ ] o.a.s.c.SolrCore [collection1] Registered new searcher Searcher@421db3f5[collection1] main{ExitableDirectoryReader(UninvertingDirectoryReader(Uninverting(_3(5.4.0):C10)))}
[junit4] 2> 828416 INFO (TEST-SpellCheckComponentTest.test-seed#[F9399A2457CF3AC1]) [ ] o.a.s.u.p.LogUpdateProcessor [collection1] webapp=null path=null params={} {commit=} 0 341
[junit4] 2> 828418 INFO (TEST-SpellCheckComponentTest.test-seed#[F9399A2457CF3AC1]) [ ] o.a.s.c.S.Request [collection1] webapp=null path=null params={q=documemt&qt=spellCheckCompRH&spellcheck=true&wt=xml} hits=0 status=0 QTime=1
[junit4] 2> 828418 INFO (TEST-SpellCheckComponentTest.test-seed#[F9399A2457CF3AC1]) [ ] o.a.s.SolrTestCaseJ4 ###Ending test
[junit4] 2> 828418 INFO (TEST-SpellCheckComponentTest.test-seed#[F9399A2457CF3AC1]) [ ] o.a.s.c.SolrCore [collection1] REMOVING ALL DOCUMENTS FROM INDEX
[junit4] 2> 828418 INFO (TEST-SpellCheckComponentTest.test-seed#[F9399A2457CF3AC1]) [ ] o.a.s.u.p.LogUpdateProcessor [collection1] webapp=null path=null params={} {deleteByQuery=*:*} 0 0
[junit4] 2> 828419 INFO (TEST-SpellCheckComponentTest.test-seed#[F9399A2457CF3AC1]) [ ] o.a.s.u.UpdateHandler start commit{,optimize=false,openSearcher=true,waitSearcher=true,expungeDeletes=false,softCommit=false,prepareCommit=false}
[junit4] 2> 828419 INFO (TEST-SpellCheckComponentTest.test-seed#[F9399A2457CF3AC1]) [ ] o.a.s.c.SolrCore SolrDeletionPolicy.onCommit: commits: num=2
[junit4] 2> commit{dir=MockDirectoryWrapper(RAMDirectory@79497990 lockFactory=org.apache.lucene.store.SingleInstanceLockFactory@4f6693c7),segFN=segments_7,generation=7}
[junit4] 2> commit{dir=MockDirectoryWrapper(RAMDirectory@79497990 lockFactory=org.apache.lucene.store.SingleInstanceLockFactory@4f6693c7),segFN=segments_8,generation=8}
[junit4] 2> 828419 INFO (TEST-SpellCheckComponentTest.test-seed#[F9399A2457CF3AC1]) [ ] o.a.s.c.SolrCore newest commit generation = 8
[junit4] 2> 828419 INFO (TEST-SpellCheckComponentTest.test-seed#[F9399A2457CF3AC1]) [ ] o.a.s.s.SolrIndexSearcher Opening Searcher@10972a7[collection1] main
[junit4] 2> 828419 INFO (TEST-SpellCheckComponentTest.test-seed#[F9399A2457CF3AC1]) [ ] o.a.s.u.UpdateHandler end_commit_flush
[junit4] 2> 828419 INFO (searcherExecutor-3531-thread-1) [ ] o.a.s.h.c.SpellCheckComponent Building spell index for spell checker: default
[junit4] 2> 828433 INFO (searcherExecutor-3531-thread-1) [ ] o.a.s.h.c.SpellCheckComponent Building spell index for spell checker: default_teststop
[junit4] 2> 828460 INFO (searcherExecutor-3531-thread-1) [ ] o.a.s.h.c.SpellCheckComponent Building spell index for spell checker: threshold
[junit4] 2> 828475 INFO (searcherExecutor-3531-thread-1) [ ] o.a.s.h.c.SpellCheckComponent Building spell index for spell checker: threshold_direct
[junit4] 2> 828476 INFO (searcherExecutor-3531-thread-1) [ ] o.a.s.h.c.SpellCheckComponent Building spell index for spell checker: multipleFields
[junit4] 2> 828490 INFO (searcherExecutor-3531-thread-1) [ ] o.a.s.h.c.SpellCheckComponent Building spell index for spell checker: freq
[junit4] 2> 828511 INFO (searcherExecutor-3531-thread-1) [ ] o.a.s.h.c.SpellCheckComponent Building spell index for spell checker: fqcn
[junit4] 2> 828529 INFO (searcherExecutor-3531-thread-1) [ ] o.a.s.c.SolrCore [collection1] Registered new searcher Searcher@10972a7[collection1] main{ExitableDirectoryReader(UninvertingDirectoryReader())}
[junit4] 2> 828529 INFO (TEST-SpellCheckComponentTest.test-seed#[F9399A2457CF3AC1]) [ ] o.a.s.u.p.LogUpdateProcessor [collection1] webapp=null path=null params={} {commit=} 0 110
[junit4] 2> 828532 INFO (TEST-SpellCheckComponentTest.testRebuildOnCommit-seed#[F9399A2457CF3AC1]) [ ] o.a.s.SolrTestCaseJ4 ###Starting testRebuildOnCommit
[junit4] 2> 828532 INFO (TEST-SpellCheckComponentTest.testRebuildOnCommit-seed#[F9399A2457CF3AC1]) [ ] o.a.s.u.p.LogUpdateProcessor [collection1] webapp=null path=null params={} {add=[0]} 0 0
[junit4] 2> 828533 INFO (TEST-SpellCheckComponentTest.testRebuildOnCommit-seed#[F9399A2457CF3AC1]) [ ] o.a.s.u.p.LogUpdateProcessor [collection1] webapp=null path=null params={} {add=[1]} 0 0
[junit4] 2> 828533 INFO (TEST-SpellCheckComponentTest.testRebuildOnCommit-seed#[F9399A2457CF3AC1]) [ ] o.a.s.u.p.LogUpdateProcessor [collection1] webapp=null path=null params={} {add=[2]} 0 0
[junit4] 2> 828534 INFO (TEST-SpellCheckComponentTest.testRebuildOnCommit-seed#[F9399A2457CF3AC1]) [ ] o.a.s.u.p.LogUpdateProcessor [collection1] webapp=null path=null params={} {add=[3]} 0 0
[junit4] 2> 828534 INFO (TEST-SpellCheckComponentTest.testRebuildOnCommit-seed#[F9399A2457CF3AC1]) [ ] o.a.s.u.p.LogUpdateProcessor [collection1] webapp=null path=null params={} {add=[4]} 0 0
[junit4] 2> 828534 INFO (TEST-SpellCheckComponentTest.testRebuildOnCommit-seed#[F9399A2457CF3AC1]) [ ] o.a.s.u.p.LogUpdateProcessor [collection1] webapp=null path=null params={} {add=[5]} 0 0
[junit4] 2> 828535 INFO (TEST-SpellCheckComponentTest.testRebuildOnCommit-seed#[F9399A2457CF3AC1]) [ ] o.a.s.u.p.LogUpdateProcessor [collection1] webapp=null path=null params={} {add=[6]} 0 0
[junit4] 2> 828535 INFO (TEST-SpellCheckComponentTest.testRebuildOnCommit-seed#[F9399A2457CF3AC1]) [ ] o.a.s.u.p.LogUpdateProcessor [collection1] webapp=null path=null params={} {add=[7]} 0 0
[junit4] 2> 828535 INFO (TEST-SpellCheckComponentTest.testRebuildOnCommit-seed#[F9399A2457CF3AC1]) [ ] o.a.s.u.p.LogUpdateProcessor [collection1] webapp=null path=null params={} {add=[8]} 0 0
[junit4] 2> 828536 INFO (TEST-SpellCheckComponentTest.testRebuildOnCommit-seed#[F9399A2457CF3AC1]) [ ] o.a.s.u.p.LogUpdateProcessor [collection1] webapp=null path=null params={} {add=[9]} 0 0
[junit4] 2> 828536 INFO (TEST-SpellCheckComponentTest.testRebuildOnCommit-seed#[F9399A2457CF3AC1]) [ ] o.a.s.u.UpdateHandler start commit{,optimize=false,openSearcher=true,waitSearcher=true,expungeDeletes=false,softCommit=false,prepareCommit=false}
[junit4] 2> 828539 INFO (TEST-SpellCheckComponentTest.testRebuildOnCommit-seed#[F9399A2457CF3AC1]) [ ] o.a.s.c.SolrCore SolrDeletionPolicy.onCommit: commits: num=2
[junit4] 2> commit{dir=MockDirectoryWrapper(RAMDirectory@79497990 lockFactory=org.apache.lucene.store.SingleInstanceLockFactory@4f6693c7),segFN=segments_8,generation=8}
[junit4] 2> commit{dir=MockDirectoryWrapper(RAMDirectory@79497990 lockFactory=org.apache.lucene.store.SingleInstanceLockFactory@4f6693c7),segFN=segments_9,generation=9}
[junit4] 2> 828539 INFO (TEST-SpellCheckComponentTest.testRebuildOnCommit-seed#[F9399A2457CF3AC1]) [ ] o.a.s.c.SolrCore newest commit generation = 9
[junit4] 2> 828540 INFO (TEST-SpellCheckComponentTest.testRebuildOnCommit-seed#[F9399A2457CF3AC1]) [ ] o.a.s.s.SolrIndexSearcher Opening Searcher@7cd649bc[collection1] main
[junit4] 2> 828540 INFO (TEST-SpellCheckComponentTest.testRebuildOnCommit-seed#[F9399A2457CF3AC1]) [ ] o.a.s.u.UpdateHandler end_commit_flush
[junit4] 2> 828540 INFO (searcherExecutor-3531-thread-1) [ ] o.a.s.h.c.SpellCheckComponent Building spell index for spell checker: default
[junit4] 2> 828603 INFO (searcherExecutor-3531-thread-1) [ ] o.a.s.h.c.SpellCheckComponent Building spell index for spell checker: default_teststop
[junit4] 2> 828620 INFO (searcherExecutor-3531-thread-1) [ ] o.a.s.h.c.SpellCheckComponent Building spell index for spell checker: threshold
[junit4] 2> 828675 INFO (searcherExecutor-3531-thread-1) [ ] o.a.s.h.c.SpellCheckComponent Building spell index for spell checker: threshold_direct
[junit4] 2> 828675 INFO (searcherExecutor-3531-thread-1) [ ] o.a.s.h.c.SpellCheckComponent Building spell index for spell checker: multipleFields
[junit4] 2> 828782 INFO (searcherExecutor-3531-thread-1) [ ] o.a.s.h.c.SpellCheckComponent Building spell index for spell checker: freq
[junit4] 2> 828860 INFO (searcherExecutor-3531-thread-1) [ ] o.a.s.h.c.SpellCheckComponent Building spell index for spell checker: fqcn
[junit4] 2> 828951 INFO (searcherExecutor-3531-thread-1) [ ] o.a.s.c.SolrCore [collection1] Registered new searcher Searcher@7cd649bc[collection1] main{ExitableDirectoryReader(UninvertingDirectoryReader(Uninverting(_4(5.4.0):C10)))}
[junit4] 2> 828951 INFO (TEST-SpellCheckComponentTest.testRebuildOnCommit-seed#[F9399A2457CF3AC1]) [ ] o.a.s.u.p.LogUpdateProcessor [collection1] webapp=null path=null params={} {commit=} 0 415
[junit4] 2> 828952 INFO (TEST-SpellCheckComponentTest.testRebuildOnCommit-seed#[F9399A2457CF3AC1]) [ ] o.a.s.c.S.Request [collection1] webapp=null path=null params={q=lowerfilt:lucenejavt&qt=spellCheckCompRH&spellcheck=true&wt=xml} hits=0 status=0 QTime=0
[junit4] 2> 828953 INFO (TEST-SpellCheckComponentTest.testRebuildOnCommit-seed#[F9399A2457CF3AC1]) [ ] o.a.s.u.p.LogUpdateProcessor [collection1] webapp=null path=null params={} {add=[11231]} 0 0
[junit4] 2> 828953 INFO (TEST-SpellCheckComponentTest.testRebuildOnCommit-seed#[F9399A2457CF3AC1]) [ ] o.a.s.u.UpdateHandler start commit{,optimize=false,openSearcher=true,waitSearcher=true,expungeDeletes=false,softCommit=false,prepareCommit=false}
[junit4] 2> 828955 INFO (TEST-SpellCheckComponentTest.testRebuildOnCommit-seed#[F9399A2457CF3AC1]) [ ] o.a.s.c.SolrCore SolrDeletionPolicy.onCommit: commits: num=2
[junit4] 2> commit{dir=MockDirectoryWrapper(RAMDirectory@79497990 lockFactory=org.apache.lucene.store.SingleInstanceLockFactory@4f6693c7),segFN=segments_9,generation=9}
[junit4] 2> commit{dir=MockDirectoryWrapper(RAMDirectory@79497990 lockFactory=org.apache.lucene.store.SingleInstanceLockFactory@4f6693c7),segFN=segments_a,generation=10}
[junit4] 2> 828955 INFO (TEST-SpellCheckComponentTest.testRebuildOnCommit-seed#[F9399A2457CF3AC1]) [ ] o.a.s.c.SolrCore newest commit generation = 10
[junit4] 2> 828955 INFO (TEST-SpellCheckComponentTest.testRebuildOnCommit-seed#[F9399A2457CF3AC1]) [ ] o.a.s.s.SolrIndexSearcher Opening Searcher@461be8d8[collection1] main
[junit4] 2> 828956 INFO (TEST-SpellCheckComponentTest.testRebuildOnCommit-seed#[F9399A2457CF3AC1]) [ ] o.a.s.u.UpdateHandler end_commit_flush
[junit4] 2> 828956 INFO (searcherExecutor-3531-thread-1) [ ] o.a.s.h.c.SpellCheckComponent Building spell index for spell checker: default
[junit4] 2> 829080 INFO (searcherExecutor-3531-thread-1) [ ] o.a.s.h.c.SpellCheckComponent Building spell index for spell checker: default_teststop
[junit4] 2> 829102 INFO (searcherExecutor-3531-thread-1) [ ] o.a.s.h.c.SpellCheckComponent Building spell index for spell checker: threshold
[junit4] 2> 829139 INFO (searcherExecutor-3531-thread-1) [ ] o.a.s.h.c.SpellCheckComponent Building spell index for spell checker: threshold_direct
[junit4] 2> 829139 INFO (searcherExecutor-3531-thread-1) [ ] o.a.s.h.c.SpellCheckComponent Building spell index for spell checker: multipleFields
[junit4] 2> 829234 INFO (searcherExecutor-3531-thread-1) [ ] o.a.s.h.c.SpellCheckComponent Building spell index for spell checker: freq
[junit4] 2> 829364 INFO (searcherExecutor-3531-thread-1) [ ] o.a.s.h.c.SpellCheckComponent Building spell index for spell checker: fqcn
[junit4] 2> 829494 INFO (searcherExecutor-3531-thread-1) [ ] o.a.s.c.SolrCore [collection1] Registered new searcher Searcher@461be8d8[collection1] main{ExitableDirectoryReader(UninvertingDirectoryReader(Uninverting(_4(5.4.0):C10) Uninverting(_5(5.4.0):C1)))}
[junit4] 2> 829494 INFO (TEST-SpellCheckComponentTest.testRebuildOnCommit-seed#[F9399A2457CF3AC1]) [ ] o.a.s.u.p.LogUpdateProcessor [collection1] webapp=null path=null params={} {commit=} 0 541
[junit4] 2> 829496 INFO (TEST-SpellCheckComponentTest.testRebuildOnCommit-seed#[F9399A2457CF3AC1]) [ ] o.a.s.c.S.Request [collection1] webapp=null path=null params={q=lowerfilt:lucenejavt&qt=spellCheckCompRH&spellcheck=true&wt=xml} hits=0 status=0 QTime=544
[junit4] 2> 829497 INFO (TEST-SpellCheckComponentTest.testRebuildOnCommit-seed#[F9399A2457CF3AC1]) [ ] o.a.s.SolrTestCaseJ4 ###Ending testRebuildOnCommit
[junit4] 2> 829497 INFO (TEST-SpellCheckComponentTest.testRebuildOnCommit-seed#[F9399A2457CF3AC1]) [ ] o.a.s.c.SolrCore [collection1] REMOVING ALL DOCUMENTS FROM INDEX
[junit4] 2> 829497 INFO (TEST-SpellCheckComponentTest.testRebuildOnCommit-seed#[F9399A2457CF3AC1]) [ ] o.a.s.u.p.LogUpdateProcessor [collection1] webapp=null path=null params={} {deleteByQuery=*:*} 0 0
[junit4] 2> 829497 INFO (TEST-SpellCheckComponentTest.testRebuildOnCommit-seed#[F9399A2457CF3AC1]) [ ] o.a.s.u.UpdateHandler start commit{,optimize=false,openSearcher=true,waitSearcher=true,expungeDeletes=false,softCommit=false,prepareCommit=false}
[junit4] 2> 829498 INFO (TEST-SpellCheckComponentTest.testRebuildOnCommit-seed#[F9399A2457CF3AC1]) [ ] o.a.s.c.SolrCore SolrDeletionPolicy.onCommit: commits: num=2
[junit4] 2> commit{dir=MockDirectoryWrapper(RAMDirectory@79497990 lockFactory=org.apache.lucene.store.SingleInstanceLockFactory@4f6693c7),segFN=segments_a,generation=10}
[junit4] 2> commit{dir=MockDirectoryWrapper(RAMDirectory@79497990 lockFactory=org.apache.lucene.store.SingleInstanceLockFactory@4f6693c7),segFN=segments_b,generation=11}
[junit4] 2> 829498 INFO (TEST-SpellCheckComponentTest.testRebuildOnCommit-seed#[F9399A2457CF3AC1]) [ ] o.a.s.c.SolrCore newest commit generation = 11
[junit4] 2> 829498 INFO (TEST-SpellCheckComponentTest.testRebuildOnCommit-seed#[F9399A2457CF3AC1]) [ ] o.a.s.s.SolrIndexSearcher Opening Searcher@2f7194bb[collection1] main
[junit4] 2> 829498 INFO (searcherExecutor-3531-thread-1) [ ] o.a.s.h.c.SpellCheckComponent Building spell index for spell checker: default
[junit4] 2> 829498 INFO (TEST-SpellCheckComponentTest.testRebuildOnCommit-seed#[F9399A2457CF3AC1]) [ ] o.a.s.u.UpdateHandler end_commit_flush
[junit4] 2> 829525 INFO (searcherExecutor-3531-thread-1) [ ] o.a.s.h.c.SpellCheckComponent Building spell index for spell checker: default_teststop
[junit4] 2> 829550 INFO (searcherExecutor-3531-thread-1) [ ] o.a.s.h.c.SpellCheckComponent Building spell index for spell checker: threshold
[junit4] 2> 829571 INFO (searcherExecutor-3531-thread-1) [ ] o.a.s.h.c.SpellCheckComponent Building spell index for spell checker: threshold_direct
[junit4] 2> 829571 INFO (searcherExecutor-3531-thread-1) [ ] o.a.s.h.c.SpellCheckComponent Building spell index for spell checker: multipleFields
[junit4] 2> 829593 INFO (searcherExecutor-3531-thread-1) [ ] o.a.s.h.c.SpellCheckComponent Building spell index for spell checker: freq
[junit4] 2> 829616 INFO (searcherExecutor-3531-thread-1) [ ] o.a.s.h.c.SpellCheckComponent Building spell index for spell checker: fqcn
[junit4] 2> 829636 INFO (searcherExecutor-3531-thread-1) [ ] o.a.s.c.SolrCore [collection1] Registered new searcher Searcher@2f7194bb[collection1] main{ExitableDirectoryReader(UninvertingDirectoryReader())}
[junit4] 2> 829637 INFO (TEST-SpellCheckComponentTest.testRebuildOnCommit-seed#[F9399A2457CF3AC1]) [ ] o.a.s.u.p.LogUpdateProcessor [collection1] webapp=null path=null params={} {commit=} 0 139
[junit4] 2> 829639 INFO (TEST-SpellCheckComponentTest.testPerDictionary-seed#[F9399A2457CF3AC1]) [ ] o.a.s.SolrTestCaseJ4 ###Starting testPerDictionary
[junit4] 2> 829640 INFO (TEST-SpellCheckComponentTest.testPerDictionary-seed#[F9399A2457CF3AC1]) [ ] o.a.s.u.p.LogUpdateProcessor [collection1] webapp=null path=null params={} {add=[0]} 0 0
[junit4] 2> 829641 INFO (TEST-SpellCheckComponentTest.testPerDictionary-seed#[F9399A2457CF3AC1]) [ ] o.a.s.u.p.LogUpdateProcessor [collection1] webapp=null path=null params={} {add=[1]} 0 0
[junit4] 2> 829641 INFO (TEST-SpellCheckComponentTest.testPerDictionary-seed#[F9399A2457CF3AC1]) [ ] o.a.s.u.p.LogUpdateProcessor [collection1] webapp=null path=null params={} {add=[2]} 0 0
[junit4] 2> 829641 INFO (TEST-SpellCheckComponentTest.testPerDictionary-seed#[F9399A2457CF3AC1]) [ ] o.a.s.u.p.LogUpdateProcessor [collection1] webapp=null path=null params={} {add=[3]} 0 0
[junit4] 2> 829642 INFO (TEST-SpellCheckComponentTest.testPerDictionary-seed#[F9399A2457CF3AC1]) [ ] o.a.s.u.p.LogUpdateProcessor [collection1] webapp=null path=null params={} {add=[4]} 0 0
[junit4] 2> 829642 INFO (TEST-SpellCheckComponentTest.testPerDictionary-seed#[F9399A2457CF3AC1]) [ ] o.a.s.u.p.LogUpdateProcessor [collection1] webapp=null path=null params={} {add=[5]} 0 0
[junit4] 2> 829642 INFO (TEST-SpellCheckComponentTest.testPerDictionary-seed#[F9399A2457CF3AC1]) [ ] o.a.s.u.p.LogUpdateProcessor [collection1] webapp=null path=null params={} {add=[6]} 0 0
[junit4] 2> 829643 INFO (TEST-SpellCheckComponentTest.testPerDictionary-seed#[F9399A2457CF3AC1]) [ ] o.a.s.u.p.LogUpdateProcessor [collection1] webapp=null path=null params={} {add=[7]} 0 0
[junit4] 2> 829643 INFO (TEST-SpellCheckComponentTest.testPerDictionary-seed#[F9399A2457CF3AC1]) [ ] o.a.s.u.p.LogUpdateProcessor [collection1] webapp=null path=null params={} {add=[8]} 0 0
[junit4] 2> 829643 INFO (TEST-SpellCheckComponentTest.testPerDictionary-seed#[F9399A2457CF3AC1]) [ ] o.a.s.u.p.LogUpdateProcessor [collection1] webapp=null path=null params={} {add=[9]} 0 0
[junit4] 2> 829644 INFO (TEST-SpellCheckComponentTest.testPerDictionary-seed#[F9399A2457CF3AC1]) [ ] o.a.s.u.UpdateHandler start commit{,optimize=false,openSearcher=true,waitSearcher=true,expungeDeletes=false,softCommit=false,prepareCommit=false}
[junit4] 2> 829647 INFO (TEST-SpellCheckComponentTest.testPerDictionary-seed#[F9399A2457CF3AC1]) [ ] o.a.s.c.SolrCore SolrDeletionPolicy.onCommit: commits: num=2
[junit4] 2> commit{dir=MockDirectoryWrapper(RAMDirectory@79497990 lockFactory=org.apache.lucene.store.SingleInstanceLockFactory@4f6693c7),segFN=segments_b,generation=11}
[junit4] 2> commit{dir=MockDirectoryWrapper(RAMDirectory@79497990 lockFactory=org.apache.lucene.store.SingleInstanceLockFactory@4f6693c7),segFN=segments_c,generation=12}
[junit4] 2> 829647 INFO (TEST-SpellCheckComponentTest.testPerDictionary-seed#[F9399A2457CF3AC1]) [ ] o.a.s.c.SolrCore newest commit generation = 12
[junit4] 2> 829648 INFO (TEST-SpellCheckComponentTest.testPerDictionary-seed#[F9399A2457CF3AC1]) [ ] o.a.s.s.SolrIndexSearcher Opening Searcher@4d153dc3[collection1] main
[junit4] 2> 829648 INFO (TEST-SpellCheckComponentTest.testPerDictionary-seed#[F9399A2457CF3AC1]) [ ] o.a.s.u.UpdateHandler end_commit_flush
[junit4] 2> 829648 INFO (searcherExecutor-3531-thread-1) [ ] o.a.s.h.c.SpellCheckComponent Building spell index for spell checker: default
[junit4] 2> 829707 INFO (searcherExecutor-3531-thread-1) [ ] o.a.s.h.c.SpellCheckComponent Building spell index for spell checker: default_teststop
[junit4] 2> 829721 INFO (searcherExecutor-3531-thread-1) [ ] o.a.s.h.c.SpellCheckComponent Building spell index for spell checker: threshold
[junit4] 2> 829757 INFO (searcherExecutor-3531-thread-1) [ ] o.a.s.h.c.SpellCheckComponent Building spell index for spell checker: threshold_direct
[junit4] 2> 829757 INFO (searcherExecutor-3531-thread-1) [ ] o.a.s.h.c.SpellCheckComponent Building spell index for spell checker: multipleFields
[junit4] 2> 829818 INFO (searcherExecutor-3531-thread-1) [ ] o.a.s.h.c.SpellCheckComponent Building spell index for spell checker: freq
[junit4] 2> 829891 INFO (searcherExecutor-3531-thread-1) [ ] o.a.s.h.c.SpellCheckComponent Building spell index for spell checker: fqcn
[junit4] 2> 829948 INFO (searcherExecutor-3531-thread-1) [ ] o.a.s.c.SolrCore [collection1] Registered new searcher Searcher@4d153dc3[collection1] main{ExitableDirectoryReader(UninvertingDirectoryReader(Uninverting(_6(5.4.0):C10)))}
[junit4] 2> 829949 INFO (TEST-SpellCheckComponentTest.testPerDictionary-seed#[F9399A2457CF3AC1]) [ ] o.a.s.u.p.LogUpdateProcessor [collection1] webapp=null path=null params={} {commit=} 0 304
[junit4] 2> 829950 INFO (TEST-SpellCheckComponentTest.testPerDictionary-seed#[F9399A2457CF3AC1]) [ ] o.a.s.c.S.Request [collection1] webapp=null path=null params={q=documemt&qt=spellCheckCompRH&spellcheck.dictionary=perDict&json.nl=map&spellcheck..perDict.foo=bar&spellcheck=true&spellcheck..perDict.bar=foo&wt=xml&spellcheck.build=true} hits=0 status=0 QTime=0
[junit4] 2> 829950 INFO (TEST-SpellCheckComponentTest.testPerDictionary-seed#[F9399A2457CF3AC1]) [ ] o.a.s.SolrTestCaseJ4 ###Ending testPerDictionary
[junit4] 2> 829950 INFO (TEST-SpellCheckComponentTest.testPerDictionary-seed#[F9399A2457CF3AC1]) [ ] o.a.s.c.SolrCore [collection1] REMOVING ALL DOCUMENTS FROM INDEX
[junit4] 2> 829950 INFO (TEST-SpellCheckComponentTest.testPerDictionary-seed#[F9399A2457CF3AC1]) [ ] o.a.s.u.p.LogUpdateProcessor [collection1] webapp=null path=null params={} {deleteByQuery=*:*} 0 0
[junit4] 2> 829951 INFO (TEST-SpellCheckComponentTest.testPerDictionary-seed#[F9399A2457CF3AC1]) [ ] o.a.s.u.UpdateHandler start commit{,optimize=false,openSearcher=true,waitSearcher=true,expungeDeletes=false,softCommit=false,prepareCommit=false}
[junit4] 2> 829951 INFO (TEST-SpellCheckComponentTest.testPerDictionary-seed#[F9399A2457CF3AC1]) [ ] o.a.s.c.SolrCore SolrDeletionPolicy.onCommit: commits: num=2
[junit4] 2> commit{dir=MockDirectoryWrapper(RAMDirectory@79497990 lockFactory=org.apache.lucene.store.SingleInstanceLockFactory@4f6693c7),segFN=segments_c,generation=12}
[junit4] 2> commit{dir=MockDirectoryWrapper(RAMDirectory@79497990 lockFactory=org.apache.lucene.store.SingleInstanceLockFactory@4f6693c7),segFN=segments_d,generation=13}
[junit4] 2> 829951 INFO (TEST-SpellCheckComponentTest.testPerDictionary-seed#[F9399A2457CF3AC1]) [ ] o.a.s.c.SolrCore newest commit generation = 13
[junit4] 2> 829951 INFO (TEST-SpellCheckComponentTest.testPerDictionary-seed#[F9399A2457CF3AC1]) [ ] o.a.s.s.SolrIndexSearcher Opening Searcher@4b717295[collection1] main
[junit4] 2> 829952 INFO (TEST-SpellCheckComponentTest.testPerDictionary-seed#[F9399A2457CF3AC1]) [ ] o.a.s.u.UpdateHandler end_commit_flush
[junit4] 2> 829952 INFO (searcherExecutor-3531-thread-1) [ ] o.a.s.h.c.SpellCheckComponent Building spell index for spell checker: default
[junit4] 2> 829966 INFO (searcherExecutor-3531-thread-1) [ ] o.a.s.h.c.SpellCheckComponent Building spell index for spell checker: default_teststop
[junit4] 2> 829980 INFO (searcherExecutor-3531-thread-1) [ ] o.a.s.h.c.SpellCheckComponent Building spell index for spell checker: threshold
[junit4] 2> 829993 INFO (searcherExecutor-3531-thread-1) [ ] o.a.s.h.c.SpellCheckComponent Building spell index for spell checker: threshold_direct
[junit4] 2> 829993 INFO (searcherExecutor-3531-thread-1) [ ] o.a.s.h.c.SpellCheckComponent Building spell index for spell checker: multipleFields
[junit4] 2> 830013 INFO (searcherExecutor-3531-thread-1) [ ] o.a.s.h.c.SpellCheckComponent Building spell index for spell checker: freq
[junit4] 2> 830027 INFO (searcherExecutor-3531-thread-1) [ ] o.a.s.h.c.SpellCheckComponent Building spell index for spell checker: fqcn
[junit4] 2> 830040 INFO (searcherExecutor-3531-thread-1) [ ] o.a.s.c.SolrCore [collection1] Registered new searcher Searcher@4b717295[collection1] main{ExitableDirectoryReader(UninvertingDirectoryReader())}
[junit4] 2> 830041 INFO (TEST-SpellCheckComponentTest.testPerDictionary-seed#[F9399A2457CF3AC1]) [ ] o.a.s.u.p.LogUpdateProcessor [collection1] webapp=null path=null params={} {commit=} 0 89
[junit4] 2> 830043 INFO (TEST-SpellCheckComponentTest.testCollate-seed#[F9399A2457CF3AC1]) [ ] o.a.s.SolrTestCaseJ4 ###Starting testCollate
[junit4] 2> 830044 INFO (TEST-SpellCheckComponentTest.testCollate-seed#[F9399A2457CF3AC1]) [ ] o.a.s.u.p.LogUpdateProcessor [collection1] webapp=null path=null params={} {add=[0]} 0 0
[junit4] 2> 830044 INFO (TEST-SpellCheckComponentTest.testCollate-seed#[F9399A2457CF3AC1]) [ ] o.a.s.u.p.LogUpdateProcessor [collection1] webapp=null path=null params={} {add=[1]} 0 0
[junit4] 2> 830045 INFO (TEST-SpellCheckComponentTest.testCollate-seed#[F9399A2457CF3AC1]) [ ] o.a.s.u.p.LogUpdateProcessor [collection1] webapp=null path=null params={} {add=[2]} 0 0
[junit4] 2> 830045 INFO (TEST-SpellCheckComponentTest.testCollate-seed#[F9399A2457CF3AC1]) [ ] o.a.s.u.p.LogUpdateProcessor [collection1] webapp=null path=null params={} {add=[3]} 0 0
[junit4] 2> 830045 INFO (TEST-SpellCheckComponentTest.testCollate-seed#[F9399A2457CF3AC1]) [ ] o.a.s.u.p.LogUpdateProcessor [collection1] webapp=null path=null params={} {add=[4]} 0 0
[junit4] 2> 830046 INFO (TEST-SpellCheckComponentTest.testCollate-seed#[F9399A2457CF3AC1]) [ ] o.a.s.u.p.LogUpdateProcessor [collection1] webapp=null path=null params={} {add=[5]} 0 0
[junit4] 2> 830046 INFO (TEST-SpellCheckComponentTest.testCollate-seed#[F9399A2457CF3AC1]) [ ] o.a.s.u.p.LogUpdateProcessor [collection1] webapp=null path=null params={} {add=[6]} 0 0
[junit4] 2> 830046 INFO (TEST-SpellCheckComponentTest.testCollate-seed#[F9399A2457CF3AC1]) [ ] o.a.s.u.p.LogUpdateProcessor [collection1] webapp=null path=null params={} {add=[7]} 0 0
[junit4] 2> 830047 INFO (TEST-SpellCheckComponentTest.testCollate-seed#[F9399A2457CF3AC1]) [ ] o.a.s.u.p.LogUpdateProcessor [collection1] webapp=null path=null params={} {add=[8]} 0 0
[junit4] 2> 830047 INFO (TEST-SpellCheckComponentTest.testCollate-seed#[F9399A2457CF3AC1]) [ ] o.a.s.u.p.LogUpdateProcessor [collection1] webapp=null path=null params={} {add=[9]} 0 0
[junit4] 2> 830047 INFO (TEST-SpellCheckComponentTest.testCollate-seed#[F9399A2457CF3AC1]) [ ] o.a.s.u.UpdateHandler start commit{,optimize=false,openSearcher=true,waitSearcher=true,expungeDeletes=false,softCommit=false,prepareCommit=false}
[junit4] 2> 830050 INFO (TEST-SpellCheckComponentTest.testCollate-seed#[F9399A2457CF3AC1]) [ ] o.a.s.c.SolrCore SolrDeletionPolicy.onCommit: commits: num=2
[junit4] 2> commit{dir=MockDirectoryWrapper(RAMDirectory@79497990 lockFactory=org.apache.lucene.store.SingleInstanceLockFactory@4f6693c7),segFN=segments_d,generation=13}
[junit4] 2> commit{dir=MockDirectoryWrapper(RAMDirectory@79497990 lockFactory=org.apache.lucene.store.SingleInstanceLockFactory@4f6693c7),segFN=segments_e,generation=14}
[junit4] 2> 830050 INFO (TEST-SpellCheckComponentTest.testCollate-seed#[F9399A2457CF3AC1]) [ ] o.a.s.c.SolrCore newest commit generation = 14
[junit4] 2> 830051 INFO (TEST-SpellCheckComponentTest.testCollate-seed#[F9399A2457CF3AC1]) [ ] o.a.s.s.SolrIndexSearcher Opening Searcher@14f07075[collection1] main
[junit4] 2> 830051 INFO (TEST-SpellCheckComponentTest.testCollate-seed#[F9399A2457CF3AC1]) [ ] o.a.s.u.UpdateHandler end_commit_flush
[junit4] 2> 830051 INFO (searcherExecutor-3531-thread-1) [ ] o.a.s.h.c.SpellCheckComponent Building spell index for spell checker: default
[junit4] 2> 830132 INFO (searcherExecutor-3531-thread-1) [ ] o.a.s.h.c.SpellCheckComponent Building spell index for spell checker: default_teststop
[junit4] 2> 830149 INFO (searcherExecutor-3531-thread-1) [ ] o.a.s.h.c.SpellCheckComponent Building spell index for spell checker: threshold
[junit4] 2> 830196 INFO (searcherExecutor-3531-thread-1) [ ] o.a.s.h.c.SpellCheckComponent Building spell index for spell checker: threshold_direct
[junit4] 2> 830196 INFO (searcherExecutor-3531-thread-1) [ ] o.a.s.h.c.SpellCheckComponent Building spell index for spell checker: multipleFields
[junit4] 2> 830270 INFO (searcherExecutor-3531-thread-1) [ ] o.a.s.h.c.SpellCheckComponent Building spell index for spell checker: freq
[junit4] 2> 830333 INFO (searcherExecutor-3531-thread-1) [ ] o.a.s.h.c.SpellCheckComponent Building spell index for spell checker: fqcn
[junit4] 2> 830395 INFO (searcherExecutor-3531-thread-1) [ ] o.a.s.c.SolrCore [collection1] Registered new searcher Searcher@14f07075[collection1] main{ExitableDirectoryReader(UninvertingDirectoryReader(Uninverting(_7(5.4.0):C10)))}
[junit4] 2> 830395 INFO (TEST-SpellCheckComponentTest.testCollate-seed#[F9399A2457CF3AC1]) [ ] o.a.s.u.p.LogUpdateProcessor [collection1] webapp=null path=null params={} {commit=} 0 347
[junit4] 2> 830476 INFO (TEST-SpellCheckComponentTest.testCollate-seed#[F9399A2457CF3AC1]) [ ] o.a.s.c.S.Request [collection1] webapp=null path=null params={q=documemt&qt=spellCheckCompRH&json.nl=map&spellcheck=true&wt=xml&spellcheck.build=true&spellcheck.collate=true} hits=0 status=0 QTime=80
[junit4] 2> 830477 INFO (TEST-SpellCheckComponentTest.testCollate-seed#[F9399A2457CF3AC1]) [ ] o.a.s.c.S.Request [collection1] webapp=null path=null params={q=documemt+lowerfilt:broen^4&qt=spellCheckCompRH&json.nl=map&spellcheck=true&wt=xml&spellcheck.collate=true} hits=0 status=0 QTime=1
[junit4] 2> 830478 INFO (TEST-SpellCheckComponentTest.testCollate-seed#[F9399A2457CF3AC1]) [ ] o.a.s.c.S.Request [collection1] webapp=null path=null params={q=documemtsss+broens&qt=spellCheckCompRH&json.nl=map&spellcheck=true&wt=xml&spellcheck.collate=true} hits=0 status=0 QTime=0
[junit4] 2> 830479 INFO (TEST-SpellCheckComponentTest.testCollate-seed#[F9399A2457CF3AC1]) [ ] o.a.s.c.S.Request [collection1] webapp=null path=null params={q=pixma&qt=spellCheckCompRH&json.nl=map&spellcheck=true&wt=xml&spellcheck.collate=true} hits=0 status=0 QTime=0
[junit4] 2> 830479 INFO (TEST-SpellCheckComponentTest.testCollate-seed#[F9399A2457CF3AC1]) [ ] o.a.s.SolrTestCaseJ4 ###Ending testCollate
[junit4] 2> 830479 INFO (TEST-SpellCheckComponentTest.testCollate-seed#[F9399A2457CF3AC1]) [ ] o.a.s.c.SolrCore [collection1] REMOVING ALL DOCUMENTS FROM INDEX
[junit4] 2> 830479 INFO (TEST-SpellCheckComponentTest.testCollate-seed#[F9399A2457CF3AC1]) [ ] o.a.s.u.p.LogUpdateProcessor [collection1] webapp=null path=null params={} {deleteByQuery=*:*} 0 0
[junit4] 2> 830479 INFO (TEST-SpellCheckComponentTest.testCollate-seed#[F9399A2457CF3AC1]) [ ] o.a.s.u.UpdateHandler start commit{,optimize=false,openSearcher=true,waitSearcher=true,expungeDeletes=false,softCommit=false,prepareCommit=false}
[junit4] 2> 830480 INFO (TEST-SpellCheckComponentTest.testCollate-seed#[F9399A2457CF3AC1]) [ ] o.a.s.c.SolrCore SolrDeletionPolicy.onCommit: commits: num=2
[junit4] 2> commit{dir=MockDirectoryWrapper(RAMDirectory@79497990 lockFactory=org.apache.lucene.store.SingleInstanceLockFactory@4f6693c7),segFN=segments_e,generation=14}
[junit4] 2> commit{dir=MockDirectoryWrapper(RAMDirectory@79497990 lockFactory=org.apache.lucene.store.SingleInstanceLockFactory@4f6693c7),segFN=segments_f,generation=15}
[junit4] 2> 830480 INFO (TEST-SpellCheckComponentTest.testCollate-seed#[F9399A2457CF3AC1]) [ ] o.a.s.c.SolrCore newest commit generation = 15
[junit4] 2> 830480 INFO (TEST-SpellCheckComponentTest.testCollate-seed#[F9399A2457CF3AC1]) [ ] o.a.s.s.SolrIndexSearcher Opening Searcher@7921ba32[collection1] main
[junit4] 2> 830480 INFO (TEST-SpellCheckComponentTest.testCollate-seed#[F9399A2457CF3AC1]) [ ] o.a.s.u.UpdateHandler end_commit_flush
[junit4] 2> 830480 INFO (searcherExecutor-3531-thread-1) [ ] o.a.s.h.c.SpellCheckComponent Building spell index for spell checker: default
[junit4] 2> 830498 INFO (searcherExecutor-3531-thread-1) [ ] o.a.s.h.c.SpellCheckComponent Building spell index for spell checker: default_teststop
[junit4] 2> 830525 INFO (searcherExecutor-3531-thread-1) [ ] o.a.s.h.c.SpellCheckComponent Building spell index for spell checker: threshold
[junit4] 2> 830539 INFO (searcherExecutor-3531-thread-1) [ ] o.a.s.h.c.SpellCheckComponent Building spell index for spell checker: threshold_direct
[junit4] 2> 830539 INFO (searcherExecutor-3531-thread-1) [ ] o.a.s.h.c.SpellCheckComponent Building spell index for spell checker: multipleFields
[junit4] 2> 830553 INFO (searcherExecutor-3531-thread-1) [ ] o.a.s.h.c.SpellCheckComponent Building spell index for spell checker: freq
[junit4] 2> 830565 INFO (searcherExecutor-3531-thread-1) [ ] o.a.s.h.c.SpellCheckComponent Building spell index for spell checker: fqcn
[junit4] 2> 830579 INFO (searcherExecutor-3531-thread-1) [ ] o.a.s.c.SolrCore [collection1] Registered new searcher Searcher@7921ba32[collection1] main{ExitableDirectoryReader(UninvertingDirectoryReader())}
[junit4] 2> 830580 INFO (TEST-SpellCheckComponentTest.testCollate-seed#[F9399A2457CF3AC1]) [ ] o.a.s.u.p.LogUpdateProcessor [collection1] webapp=null path=null params={} {commit=} 0 100
[junit4] 2> 830582 INFO (TEST-SpellCheckComponentTest.testCorrectSpelling-seed#[F9399A2457CF3AC1]) [ ] o.a.s.SolrTestCaseJ4 ###Starting testCorrectSpelling
[junit4] 2> 830582 INFO (TEST-SpellCheckComponentTest.testCorrectSpelling-seed#[F9399A2457CF3AC1]) [ ] o.a.s.u.p.LogUpdateProcessor [collection1] webapp=null path=null params={} {add=[0]} 0 0
[junit4] 2> 830583 INFO (TEST-SpellCheckComponentTest.testCorrectSpelling-seed#[F9399A2457CF3AC1]) [ ] o.a.s.u.p.LogUpdateProcessor [collection1] webapp=null path=null params={} {add=[1]} 0 0
[junit4] 2> 830583 INFO (TEST-SpellCheckComponentTest.testCorrectSpelling-seed#[F9399A2457CF3AC1]) [ ] o.a.s.u.p.LogUpdateProcessor [collection1] webapp=null path=null params={} {add=[2]} 0 0
[junit4] 2> 830583 INFO (TEST-SpellCheckComponentTest.testCorrectSpelling-seed#[F9399A2457CF3AC1]) [ ] o.a.s.u.p.LogUpdateProcessor [collection1] webapp=null path=null params={} {add=[3]} 0 0
[junit4] 2> 830584 INFO (TEST-SpellCheckComponentTest.testCorrectSpelling-seed#[F9399A2457CF3AC1]) [ ] o.a.s.u.p.LogUpdateProcessor [collection1] webapp=null path=null params={} {add=[4]} 0 0
[junit4] 2> 830584 INFO (TEST-SpellCheckComponentTest.testCorrectSpelling-seed#[F9399A2457CF3AC1]) [ ] o.a.s.u.p.LogUpdateProcessor [collection1] webapp=null path=null params={} {add=[5]} 0 0
[junit4] 2> 830584 INFO (TEST-SpellCheckComponentTest.testCorrectSpelling-seed#[F9399A2457CF3AC1]) [ ] o.a.s.u.p.LogUpdateProcessor [collection1] webapp=null path=null params={}
[...truncated too long message...]
-seed#[F9399A2457CF3AC1]) [ ] o.a.s.s.SolrIndexSearcher Opening Searcher@4904feb5[collection1] main
[junit4] 2> 833230 INFO (TEST-SpellCheckComponentTest.testRelativeIndexDirLocation-seed#[F9399A2457CF3AC1]) [ ] o.a.s.u.UpdateHandler end_commit_flush
[junit4] 2> 833230 INFO (searcherExecutor-3531-thread-1) [ ] o.a.s.h.c.SpellCheckComponent Building spell index for spell checker: default
[junit4] 2> 833287 INFO (searcherExecutor-3531-thread-1) [ ] o.a.s.h.c.SpellCheckComponent Building spell index for spell checker: default_teststop
[junit4] 2> 833343 INFO (searcherExecutor-3531-thread-1) [ ] o.a.s.h.c.SpellCheckComponent Building spell index for spell checker: threshold
[junit4] 2> 833410 INFO (searcherExecutor-3531-thread-1) [ ] o.a.s.h.c.SpellCheckComponent Building spell index for spell checker: threshold_direct
[junit4] 2> 833410 INFO (searcherExecutor-3531-thread-1) [ ] o.a.s.h.c.SpellCheckComponent Building spell index for spell checker: multipleFields
[junit4] 2> 833460 INFO (searcherExecutor-3531-thread-1) [ ] o.a.s.h.c.SpellCheckComponent Building spell index for spell checker: freq
[junit4] 2> 833511 INFO (searcherExecutor-3531-thread-1) [ ] o.a.s.h.c.SpellCheckComponent Building spell index for spell checker: fqcn
[junit4] 2> 833592 INFO (searcherExecutor-3531-thread-1) [ ] o.a.s.c.SolrCore [collection1] Registered new searcher Searcher@4904feb5[collection1] main{ExitableDirectoryReader(UninvertingDirectoryReader())}
[junit4] 2> 833592 INFO (TEST-SpellCheckComponentTest.testRelativeIndexDirLocation-seed#[F9399A2457CF3AC1]) [ ] o.a.s.u.p.LogUpdateProcessor [collection1] webapp=null path=null params={} {commit=} 0 363
[junit4] 2> 833593 INFO (SUITE-SpellCheckComponentTest-seed#[F9399A2457CF3AC1]-worker) [ ] o.a.s.SolrTestCaseJ4 ###deleteCore
[junit4] 2> 833593 INFO (SUITE-SpellCheckComponentTest-seed#[F9399A2457CF3AC1]-worker) [ ] o.a.s.c.CoreContainer Shutting down CoreContainer instance=814323879
[junit4] 2> 833593 INFO (SUITE-SpellCheckComponentTest-seed#[F9399A2457CF3AC1]-worker) [ x:collection1] o.a.s.c.SolrCore [collection1] CLOSING SolrCore org.apache.solr.core.SolrCore@1279229c
[junit4] 2> 833593 INFO (SUITE-SpellCheckComponentTest-seed#[F9399A2457CF3AC1]-worker) [ x:collection1] o.a.s.u.UpdateHandler closing DirectUpdateHandler2{commits=20,autocommits=0,soft autocommits=0,optimizes=0,rollbacks=0,expungeDeletes=0,docsPending=0,adds=0,deletesById=0,deletesByQuery=0,errors=0,cumulative_adds=92,cumulative_deletesById=0,cumulative_deletesByQuery=9,cumulative_errors=0}
[junit4] 2> 833593 INFO (SUITE-SpellCheckComponentTest-seed#[F9399A2457CF3AC1]-worker) [ x:collection1] o.a.s.u.SolrCoreState Closing SolrCoreState
[junit4] 2> 833594 INFO (SUITE-SpellCheckComponentTest-seed#[F9399A2457CF3AC1]-worker) [ x:collection1] o.a.s.u.DefaultSolrCoreState SolrCoreState ref count has reached 0 - closing IndexWriter
[junit4] 2> 833594 INFO (SUITE-SpellCheckComponentTest-seed#[F9399A2457CF3AC1]-worker) [ x:collection1] o.a.s.u.DefaultSolrCoreState closing IndexWriter with IndexWriterCloser
[junit4] 2> 833594 INFO (SUITE-SpellCheckComponentTest-seed#[F9399A2457CF3AC1]-worker) [ x:collection1] o.a.s.c.SolrCore [collection1] Closing main searcher on request.
[junit4] 2> 833594 INFO (SUITE-SpellCheckComponentTest-seed#[F9399A2457CF3AC1]-worker) [ x:collection1] o.a.s.c.CachingDirectoryFactory Closing MockDirectoryFactory - 2 directories currently being tracked
[junit4] 2> 833594 INFO (SUITE-SpellCheckComponentTest-seed#[F9399A2457CF3AC1]-worker) [ x:collection1] o.a.s.c.CachingDirectoryFactory looking to close /home/jenkins/workspace/Lucene-Solr-5.x-Linux/solr/build/solr-core/test/J2/temp/solr.handler.component.SpellCheckComponentTest_F9399A2457CF3AC1-001/init-core-data-001 [CachedDir<<refCount=0;path=/home/jenkins/workspace/Lucene-Solr-5.x-Linux/solr/build/solr-core/test/J2/temp/solr.handler.component.SpellCheckComponentTest_F9399A2457CF3AC1-001/init-core-data-001;done=false>>]
[junit4] 2> 833594 INFO (SUITE-SpellCheckComponentTest-seed#[F9399A2457CF3AC1]-worker) [ x:collection1] o.a.s.c.CachingDirectoryFactory Closing directory: /home/jenkins/workspace/Lucene-Solr-5.x-Linux/solr/build/solr-core/test/J2/temp/solr.handler.component.SpellCheckComponentTest_F9399A2457CF3AC1-001/init-core-data-001
[junit4] 2> 833595 INFO (SUITE-SpellCheckComponentTest-seed#[F9399A2457CF3AC1]-worker) [ x:collection1] o.a.s.c.CachingDirectoryFactory looking to close /home/jenkins/workspace/Lucene-Solr-5.x-Linux/solr/build/solr-core/test/J2/temp/solr.handler.component.SpellCheckComponentTest_F9399A2457CF3AC1-001/init-core-data-001/index [CachedDir<<refCount=0;path=/home/jenkins/workspace/Lucene-Solr-5.x-Linux/solr/build/solr-core/test/J2/temp/solr.handler.component.SpellCheckComponentTest_F9399A2457CF3AC1-001/init-core-data-001/index;done=false>>]
[junit4] 2> 833595 INFO (SUITE-SpellCheckComponentTest-seed#[F9399A2457CF3AC1]-worker) [ x:collection1] o.a.s.c.CachingDirectoryFactory Closing directory: /home/jenkins/workspace/Lucene-Solr-5.x-Linux/solr/build/solr-core/test/J2/temp/solr.handler.component.SpellCheckComponentTest_F9399A2457CF3AC1-001/init-core-data-001/index
[junit4] 2> NOTE: leaving temporary files on disk at: /home/jenkins/workspace/Lucene-Solr-5.x-Linux/solr/build/solr-core/test/J2/temp/solr.handler.component.SpellCheckComponentTest_F9399A2457CF3AC1-001
[junit4] 2> NOTE: test params are: codec=Asserting(Lucene53): {start1=PostingsFormat(name=Asserting), range_facet_l_dv=PostingsFormat(name=Memory doPackFST= false), multiDefault=FST50, intDefault=FSTOrd50, range_facet_l=FSTOrd50, lowerfilt1and2=FST50, end4=PostingsFormat(name=Asserting), end3=FST50, end2=PostingsFormat(name=Memory doPackFST= false), end1=FSTOrd50, lowerfilt=FST50, gram1=FSTOrd50, id=PostingsFormat(name=Memory doPackFST= false), range_facet_i_dv=FSTOrd50, gram2=PostingsFormat(name=Memory doPackFST= false), gram3=FST50, start3=PostingsFormat(name=Memory doPackFST= false), gram4=PostingsFormat(name=Asserting), start2=FST50, word=FSTOrd50, timestamp=FSTOrd50, start4=FSTOrd50}, docValues:{range_facet_l_dv=DocValuesFormat(name=Direct), range_facet_i_dv=DocValuesFormat(name=Lucene50), timestamp=DocValuesFormat(name=Lucene50)}, sim=DefaultSimilarity, locale=ja, timezone=Canada/East-Saskatchewan
[junit4] 2> NOTE: Linux 3.16.0-44-generic amd64/Oracle Corporation 1.9.0-ea (64-bit)/cpus=12,threads=1,free=247246368,total=518979584
[junit4] 2> NOTE: All tests run in this JVM: [TestRebalanceLeaders, SimpleFacetsTest, TestFreeTextSuggestions, BadIndexSchemaTest, ParsingFieldUpdateProcessorsTest, AnalyticsMergeStrategyTest, DOMUtilTest, TestExtendedDismaxParser, XsltUpdateRequestHandlerTest, TestUtils, PluginInfoTest, PathHierarchyTokenizerFactoryTest, PKIAuthenticationIntegrationTest, DirectUpdateHandlerTest, DistribDocExpirationUpdateProcessorTest, TestCloudManagedSchema, SampleTest, SpatialRPTFieldTypeTest, TestDocBasedVersionConstraints, TestGroupingSearch, TestBinaryResponseWriter, SecurityConfHandlerTest, AutoCommitTest, QueryParsingTest, SolrCoreCheckLockOnStartupTest, DataDrivenBlockJoinTest, CircularListTest, PrimUtilsTest, TestQueryUtils, TestHashQParserPlugin, TestTrie, TestLuceneMatchVersion, BasicDistributedZk2Test, TestCrossCoreJoin, TestObjectReleaseTracker, SortByFunctionTest, TestRawResponseWriter, SolrInfoMBeanTest, AtomicUpdatesTest, TestRecovery, CustomCollectionTest, TestSolrDynamicMBean, TestSolrJ, TestSurroundQueryParser, SoftAutoCommitTest, TestManagedSchemaDynamicFieldResource, TestExactSharedStatsCache, SearchHandlerTest, XmlUpdateRequestHandlerTest, TestCollapseQParserPlugin, StatsComponentTest, CleanupOldIndexTest, TestExpandComponent, TestStressReorder, TestSolrXml, DistributedVersionInfoTest, PolyFieldTest, DistributedDebugComponentTest, CoreMergeIndexesAdminHandlerTest, TestRequestStatusCollectionAPI, DistributedQueryComponentCustomSortTest, TermVectorComponentDistributedTest, SegmentsInfoRequestHandlerTest, TestRestManager, FullSolrCloudDistribCmdsTest, TestSystemIdResolver, TestFastOutputStream, SpatialHeatmapFacetsTest, TestReload, LeaderElectionTest, QueryEqualityTest, TestSolr4Spatial2, TestHighlightDedupGrouping, SuggesterTest, TestCloudInspectUtil, LoggingHandlerTest, DeleteShardTest, MoreLikeThisHandlerTest, DirectUpdateHandlerOptimizeTest, UnloadDistributedZkTest, TestSchemaSimilarityResource, TestDynamicFieldCollectionResource, CursorMarkTest, SyncSliceTest, RecoveryZkTest, HardAutoCommitTest, DistributedTermsComponentTest, SpellCheckComponentTest]
[junit4] Completed [278/533] on J2 in 6.95s, 9 tests, 1 error <<< FAILURES!
[...truncated 795 lines...]
BUILD FAILED
/home/jenkins/workspace/Lucene-Solr-5.x-Linux/build.xml:779: The following error occurred while executing this line:
/home/jenkins/workspace/Lucene-Solr-5.x-Linux/build.xml:723: The following error occurred while executing this line:
/home/jenkins/workspace/Lucene-Solr-5.x-Linux/build.xml:59: The following error occurred while executing this line:
/home/jenkins/workspace/Lucene-Solr-5.x-Linux/solr/build.xml:230: The following error occurred while executing this line:
/home/jenkins/workspace/Lucene-Solr-5.x-Linux/solr/common-build.xml:524: The following error occurred while executing this line:
/home/jenkins/workspace/Lucene-Solr-5.x-Linux/lucene/common-build.xml:1449: The following error occurred while executing this line:
/home/jenkins/workspace/Lucene-Solr-5.x-Linux/lucene/common-build.xml:1003: There were test failures: 533 suites, 2111 tests, 1 error, 67 ignored (31 assumptions)
Total time: 45 minutes 51 seconds
Build step 'Invoke Ant' marked build as failure
Archiving artifacts
[WARNINGS] Skipping publisher since build result is FAILURE
Recording test results
Email was triggered for: Failure - Any
Sending email for trigger: Failure - Any