You are viewing a plain text version of this content. The canonical link for it is here.
Posted to dev@lucene.apache.org by Apache Hudson Server <hu...@hudson.apache.org> on 2011/03/30 16:38:32 UTC
[JENKINS-MAVEN] Lucene-Solr-Maven-trunk #74: POMs out of sync
Build: https://hudson.apache.org/hudson/job/Lucene-Solr-Maven-trunk/74/
1 tests failed.
FAILED: org.apache.solr.schema.TestICUCollationField.org.apache.solr.schema.TestICUCollationField
Error Message:
Cannot find resource: solr-analysis-extras/conf/solrconfig-icucollate.xml
Stack Trace:
java.lang.RuntimeException: Cannot find resource: solr-analysis-extras/conf/solrconfig-icucollate.xml
at org.apache.solr.SolrTestCaseJ4.getFile(SolrTestCaseJ4.java:1056)
at org.apache.solr.schema.TestICUCollationField.setupSolrHome(TestICUCollationField.java:77)
at org.apache.solr.schema.TestICUCollationField.beforeClass(TestICUCollationField.java:41)
at sun.reflect.NativeMethodAccessorImpl.invoke0(Native Method)
at sun.reflect.NativeMethodAccessorImpl.invoke(NativeMethodAccessorImpl.java:57)
at sun.reflect.DelegatingMethodAccessorImpl.invoke(DelegatingMethodAccessorImpl.java:43)
at java.lang.reflect.Method.invoke(Method.java:616)
at org.junit.runners.model.FrameworkMethod$1.runReflectiveCall(FrameworkMethod.java:44)
at org.junit.internal.runners.model.ReflectiveCallable.run(ReflectiveCallable.java:15)
at org.junit.runners.model.FrameworkMethod.invokeExplosively(FrameworkMethod.java:41)
at org.junit.internal.runners.statements.RunBefores.evaluate(RunBefores.java:27)
at org.junit.internal.runners.statements.RunAfters.evaluate(RunAfters.java:31)
at org.junit.runners.ParentRunner.run(ParentRunner.java:236)
at org.apache.maven.surefire.junit4.JUnit4TestSet.execute(JUnit4TestSet.java:35)
at org.apache.maven.surefire.junit4.JUnit4Provider.executeTestSet(JUnit4Provider.java:146)
at org.apache.maven.surefire.junit4.JUnit4Provider.invoke(JUnit4Provider.java:97)
at sun.reflect.NativeMethodAccessorImpl.invoke0(Native Method)
at sun.reflect.NativeMethodAccessorImpl.invoke(NativeMethodAccessorImpl.java:57)
at sun.reflect.DelegatingMethodAccessorImpl.invoke(DelegatingMethodAccessorImpl.java:43)
at java.lang.reflect.Method.invoke(Method.java:616)
at org.apache.maven.surefire.booter.ProviderFactory$ClassLoaderProxy.invoke(ProviderFactory.java:103)
at $Proxy0.invoke(Unknown Source)
at org.apache.maven.surefire.booter.SurefireStarter.invokeProvider(SurefireStarter.java:145)
at org.apache.maven.surefire.booter.SurefireStarter.runSuitesInProcess(SurefireStarter.java:87)
at org.apache.maven.surefire.booter.ForkedBooter.main(ForkedBooter.java:69)
Build Log (for compile errors):
[...truncated 18426 lines...]
---------------------------------------------------------------------
To unsubscribe, e-mail: dev-unsubscribe@lucene.apache.org
For additional commands, e-mail: dev-help@lucene.apache.org
[JENKINS-MAVEN] Lucene-Solr-Maven-trunk #77: POMs out of sync
Posted by Apache Hudson Server <hu...@hudson.apache.org>.
Build: https://hudson.apache.org/hudson/job/Lucene-Solr-Maven-trunk/77/
No tests ran.
Build Log (for compile errors):
[...truncated 14627 lines...]
---------------------------------------------------------------------
To unsubscribe, e-mail: dev-unsubscribe@lucene.apache.org
For additional commands, e-mail: dev-help@lucene.apache.org
RE: [JENKINS-MAVEN] Lucene-Solr-Maven-trunk #76: POMs out of sync
Posted by Steven A Rowe <sa...@syr.edu>.
This build failed because of javadocs warnings under modules/. I committed fixes under LUCENE-3006.
I guess the nightly Ant Lucene trunk build doesn't build modules/ javadocs?
Steve
> -----Original Message-----
> From: Apache Hudson Server [mailto:hudson@hudson.apache.org]
> Sent: Friday, April 01, 2011 10:32 AM
> To: dev@lucene.apache.org
> Subject: [JENKINS-MAVEN] Lucene-Solr-Maven-trunk #76: POMs out of sync
>
> Build: https://hudson.apache.org/hudson/job/Lucene-Solr-Maven-trunk/76/
>
> No tests ran.
>
> Build Log (for compile errors):
> [...truncated 9507 lines...]
>
>
>
> ---------------------------------------------------------------------
> To unsubscribe, e-mail: dev-unsubscribe@lucene.apache.org
> For additional commands, e-mail: dev-help@lucene.apache.org
[JENKINS-MAVEN] Lucene-Solr-Maven-trunk #76: POMs out of sync
Posted by Apache Hudson Server <hu...@hudson.apache.org>.
Build: https://hudson.apache.org/hudson/job/Lucene-Solr-Maven-trunk/76/
No tests ran.
Build Log (for compile errors):
[...truncated 9507 lines...]
---------------------------------------------------------------------
To unsubscribe, e-mail: dev-unsubscribe@lucene.apache.org
For additional commands, e-mail: dev-help@lucene.apache.org
[JENKINS-MAVEN] Lucene-Solr-Maven-trunk #75: POMs out of sync
Posted by Apache Hudson Server <hu...@hudson.apache.org>.
Build: https://hudson.apache.org/hudson/job/Lucene-Solr-Maven-trunk/75/
1 tests failed.
FAILED: org.apache.solr.schema.TestICUCollationField.org.apache.solr.schema.TestICUCollationField
Error Message:
Cannot find resource: solr-analysis-extras/conf/solrconfig-icucollate.xml
Stack Trace:
java.lang.RuntimeException: Cannot find resource: solr-analysis-extras/conf/solrconfig-icucollate.xml
at org.apache.solr.SolrTestCaseJ4.getFile(SolrTestCaseJ4.java:1056)
at org.apache.solr.schema.TestICUCollationField.setupSolrHome(TestICUCollationField.java:77)
at org.apache.solr.schema.TestICUCollationField.beforeClass(TestICUCollationField.java:41)
at sun.reflect.NativeMethodAccessorImpl.invoke0(Native Method)
at sun.reflect.NativeMethodAccessorImpl.invoke(NativeMethodAccessorImpl.java:57)
at sun.reflect.DelegatingMethodAccessorImpl.invoke(DelegatingMethodAccessorImpl.java:43)
at java.lang.reflect.Method.invoke(Method.java:616)
at org.junit.runners.model.FrameworkMethod$1.runReflectiveCall(FrameworkMethod.java:44)
at org.junit.internal.runners.model.ReflectiveCallable.run(ReflectiveCallable.java:15)
at org.junit.runners.model.FrameworkMethod.invokeExplosively(FrameworkMethod.java:41)
at org.junit.internal.runners.statements.RunBefores.evaluate(RunBefores.java:27)
at org.junit.internal.runners.statements.RunAfters.evaluate(RunAfters.java:31)
at org.junit.runners.ParentRunner.run(ParentRunner.java:236)
at org.apache.maven.surefire.junit4.JUnit4TestSet.execute(JUnit4TestSet.java:35)
at org.apache.maven.surefire.junit4.JUnit4Provider.executeTestSet(JUnit4Provider.java:146)
at org.apache.maven.surefire.junit4.JUnit4Provider.invoke(JUnit4Provider.java:97)
at sun.reflect.NativeMethodAccessorImpl.invoke0(Native Method)
at sun.reflect.NativeMethodAccessorImpl.invoke(NativeMethodAccessorImpl.java:57)
at sun.reflect.DelegatingMethodAccessorImpl.invoke(DelegatingMethodAccessorImpl.java:43)
at java.lang.reflect.Method.invoke(Method.java:616)
at org.apache.maven.surefire.booter.ProviderFactory$ClassLoaderProxy.invoke(ProviderFactory.java:103)
at $Proxy0.invoke(Unknown Source)
at org.apache.maven.surefire.booter.SurefireStarter.invokeProvider(SurefireStarter.java:145)
at org.apache.maven.surefire.booter.SurefireStarter.runSuitesInProcess(SurefireStarter.java:87)
at org.apache.maven.surefire.booter.ForkedBooter.main(ForkedBooter.java:69)
Build Log (for compile errors):
[...truncated 18422 lines...]
---------------------------------------------------------------------
To unsubscribe, e-mail: dev-unsubscribe@lucene.apache.org
For additional commands, e-mail: dev-help@lucene.apache.org