You are viewing a plain text version of this content. The canonical link for it is here.
Posted to builds@solr.apache.org by Apache Jenkins Server <je...@builds.apache.org> on 2024/03/07 09:11:19 UTC
[JENKINS] Solr ยป Solr-Smoketest-9.x - Build # 343 - Still Failing!
Build: https://ci-builds.apache.org/job/Solr/job/Solr-Smoketest-9.x/343/
Log:
Started by timer
Running as SYSTEM
[EnvInject] - Loading node environment variables.
Building remotely on lucene-solr-1 (solr lucene) in workspace /home/jenkins/jenkins-slave/workspace/Solr/Solr-Smoketest-9.x
[WS-CLEANUP] Deleting project workspace...
[WS-CLEANUP] Deferred wipeout is used...
[WS-CLEANUP] Done
The recommended git tool is: NONE
No credentials specified
Cloning the remote Git repository
Cloning repository https://github.com/apache/solr.git
> git init /home/jenkins/jenkins-slave/workspace/Solr/Solr-Smoketest-9.x # timeout=10
Fetching upstream changes from https://github.com/apache/solr.git
> git --version # timeout=10
> git --version # 'git version 2.17.1'
> git fetch --tags --progress -- https://github.com/apache/solr.git +refs/heads/*:refs/remotes/origin/* # timeout=10
> git config remote.origin.url https://github.com/apache/solr.git # timeout=10
> git config --add remote.origin.fetch +refs/heads/*:refs/remotes/origin/* # timeout=10
Avoid second fetch
> git rev-parse origin/branch_9x^{commit} # timeout=10
Checking out Revision 7c0fc6f8164ad8ade9db74a1646efd147ee32874 (origin/branch_9x)
> git config core.sparsecheckout # timeout=10
> git checkout -f 7c0fc6f8164ad8ade9db74a1646efd147ee32874 # timeout=10
> git branch -a -v --no-abbrev # timeout=10
> git checkout -b branch_9x 7c0fc6f8164ad8ade9db74a1646efd147ee32874 # timeout=10
Commit message: "SOLR-17190: Replace org.apache.solr.util.LongSet with hppc LongHashSet (#2328)"
> git rev-list --no-walk 7c0fc6f8164ad8ade9db74a1646efd147ee32874 # timeout=10
No emails were triggered.
provisioning config files...
copy managed file [gradle.properties] to file:/home/jenkins/jenkins-slave/workspace/Solr/Solr-Smoketest-9.x/gradle.properties
[Gradle] - Launching build.
[Solr-Smoketest-9.x] $ /home/jenkins/jenkins-slave/workspace/Solr/Solr-Smoketest-9.x/gradlew -Dversion.suffix= -Dgradle.user.home=/home/jenkins/jenkins-slave/workspace/Solr/.gradle -Porg.gradle.daemon=false -Pvalidation.git.failOnModified=false --continue clean assembleRelease
Downloading gradle-wrapper.jar from https://raw.githubusercontent.com/gradle/gradle/v8.4.0/gradle/wrapper/gradle-wrapper.jar
To honour the JVM settings for this build a single-use Daemon process will be forked. For more on this, please refer to https://docs.gradle.org/8.4/userguide/gradle_daemon.html#sec:disabling_the_daemon in the Gradle documentation.
Daemon will be stopped at the end of the build
> Task :buildSrc:compileJava
Note: /home/jenkins/jenkins-slave/workspace/Solr/Solr-Smoketest-9.x/buildSrc/src/main/java/org/apache/lucene/gradle/Checksum.java uses or overrides a deprecated API.
Note: Recompile with -Xlint:deprecation for details.
> Task :buildSrc:compileGroovy NO-SOURCE
> Task :buildSrc:processResources NO-SOURCE
> Task :buildSrc:classes
> Task :buildSrc:jar
> Task :clean
> Task :solr:clean UP-TO-DATE
> Task :solr:api:clean
> Task :solr:benchmark:clean
> Task :solr:core:clean
> Task :solr:distribution:clean UP-TO-DATE
> Task :solr:docker:clean UP-TO-DATE
> Task :solr:documentation:clean UP-TO-DATE
> Task :solr:example:clean UP-TO-DATE
> Task :solr:modules:clean UP-TO-DATE
> Task :solr:packaging:clean UP-TO-DATE
> Task :solr:prometheus-exporter:clean
> Task :solr:server:clean
> Task :solr:solr-ref-guide:clean
> Task :solr:solrj:clean
> Task :solr:solrj-streaming:clean
> Task :solr:solrj-zookeeper:clean
> Task :solr:test-framework:clean
> Task :solr:webapp:clean
> Task :solr:modules:analysis-extras:clean
> Task :solr:modules:analytics:clean
> Task :solr:modules:clustering:clean
> Task :solr:modules:extraction:clean
> Task :solr:modules:gcs-repository:clean
> Task :solr:modules:hadoop-auth:clean
> Task :solr:modules:hdfs:clean
> Task :solr:modules:jaegertracer-configurator:clean
> Task :solr:modules:jwt-auth:clean
> Task :solr:modules:langid:clean
> Task :solr:modules:ltr:clean
> Task :solr:modules:opentelemetry:clean
> Task :solr:modules:s3-repository:clean
> Task :solr:modules:scripting:clean
> Task :solr:modules:sql:clean
> Task :mavenLocalClean UP-TO-DATE
> Task :solr-missing-doclet:compileJava
> Task :solr-missing-doclet:processResources NO-SOURCE
> Task :solr-missing-doclet:classes
> Task :solr-missing-doclet:jar
> Task :gitStatus
> Task :checkJdkInternalsExportedToGradle
> Task :solr:api:compileJava
> Task :solr:api:processResources NO-SOURCE
> Task :solr:api:classes
> Task :solr:api:jar
> Task :solr:api:generateMetadataFileForJarsPublication SKIPPED
> Task :solr:api:generatePomFileForJarsPublication
> Task :solr:api:renderJavadoc
> Task :solr:api:javadoc SKIPPED
> Task :solr:api:javadocJar
> Task :solr:api:sourcesJar
> Task :solr:api:signJarsPublication SKIPPED
> Task :solr:api:publishJarsPublicationToBuildRepository
> Task :solr:api:resolve
SLF4J(W): No SLF4J providers were found.
SLF4J(W): Defaulting to no-operation (NOP) logger implementation
SLF4J(W): See https://www.slf4j.org/codes.html#noProviders for further details.
> Task :solr:solrj:openApiGenerate
################################################################################
# Thanks for using OpenAPI Generator. #
# Please consider donation to help us maintain this project ๐ #
# https://opencollective.com/openapi_generator/donate #
################################################################################
Successfully generated code to /home/jenkins/jenkins-slave/workspace/Solr/Solr-Smoketest-9.x/solr/solrj/build/generated/
> Task :spotlessInternalRegisterDependencies
> Task :solr:solrj:generatedSpotlessHelper
> Task :solr:solrj:generatedSpotless
> Task :solr:solrj:compileJava
Note: Some input files use or override a deprecated API.
Note: Recompile with -Xlint:deprecation for details.
> Task :solr:solrj-streaming:compileJava
Note: Some input files use or override a deprecated API.
Note: Recompile with -Xlint:deprecation for details.
> Task :solr:solrj-zookeeper:compileJava
Note: Some input files use or override a deprecated API.
Note: Recompile with -Xlint:deprecation for details.
> Task :solr:core:compileJava
Note: Some input files use or override a deprecated API.
Note: Recompile with -Xlint:deprecation for details.
> Task :solr:core:processResources
> Task :solr:core:classes
> Task :solr:core:jar
> Task :solr:core:generateMetadataFileForJarsPublication SKIPPED
> Task :solr:core:generatePomFileForJarsPublication
> Task :solr:solrj:renderJavadoc
> Task :solr:solrj-streaming:renderJavadoc
> Task :solr:solrj-zookeeper:renderJavadoc
> Task :solr:core:renderJavadoc
> Task :solr:core:javadoc SKIPPED
> Task :solr:core:javadocJar
> Task :solr:core:sourcesJar
> Task :solr:core:signJarsPublication SKIPPED
> Task :solr:core:publishJarsPublicationToBuildRepository
> Task :solr:prometheus-exporter:compileJava
Note: Some input files use or override a deprecated API.
Note: Recompile with -Xlint:deprecation for details.
> Task :solr:prometheus-exporter:processResources NO-SOURCE
> Task :solr:prometheus-exporter:classes
> Task :solr:prometheus-exporter:jar
> Task :solr:prometheus-exporter:generateMetadataFileForJarsPublication SKIPPED
> Task :solr:prometheus-exporter:generatePomFileForJarsPublication
> Task :solr:prometheus-exporter:renderJavadoc
> Task :solr:prometheus-exporter:javadoc SKIPPED
> Task :solr:prometheus-exporter:javadocJar
> Task :solr:prometheus-exporter:sourcesJar
> Task :solr:prometheus-exporter:signJarsPublication SKIPPED
> Task :solr:prometheus-exporter:publishJarsPublicationToBuildRepository
> Task :solr:solrj:processResources
> Task :solr:solrj:classes
> Task :solr:solrj:jar
> Task :solr:solrj:generateMetadataFileForJarsPublication SKIPPED
> Task :solr:solrj:generatePomFileForJarsPublication
> Task :solr:solrj:javadoc SKIPPED
> Task :solr:solrj:javadocJar
> Task :solr:solrj:sourcesJar
> Task :solr:solrj:signJarsPublication SKIPPED
> Task :solr:solrj:publishJarsPublicationToBuildRepository
> Task :solr:solrj-streaming:processResources
> Task :solr:solrj-streaming:classes
> Task :solr:solrj-streaming:jar
> Task :solr:solrj-streaming:generateMetadataFileForJarsPublication SKIPPED
> Task :solr:solrj-streaming:generatePomFileForJarsPublication
> Task :solr:solrj-streaming:javadoc SKIPPED
> Task :solr:solrj-streaming:javadocJar
> Task :solr:solrj-streaming:sourcesJar
> Task :solr:solrj-streaming:signJarsPublication SKIPPED
> Task :solr:solrj-streaming:publishJarsPublicationToBuildRepository
> Task :solr:solrj-zookeeper:processResources NO-SOURCE
> Task :solr:solrj-zookeeper:classes
> Task :solr:solrj-zookeeper:jar
> Task :solr:solrj-zookeeper:generateMetadataFileForJarsPublication SKIPPED
> Task :solr:solrj-zookeeper:generatePomFileForJarsPublication
> Task :solr:solrj-zookeeper:javadoc SKIPPED
> Task :solr:solrj-zookeeper:javadocJar
> Task :solr:solrj-zookeeper:sourcesJar
> Task :solr:solrj-zookeeper:signJarsPublication SKIPPED
> Task :solr:solrj-zookeeper:publishJarsPublicationToBuildRepository
> Task :solr:test-framework:compileJava
Note: Some input files use or override a deprecated API.
Note: Recompile with -Xlint:deprecation for details.
> Task :solr:test-framework:processResources
> Task :solr:test-framework:classes
> Task :solr:test-framework:jar
> Task :solr:test-framework:generateMetadataFileForJarsPublication SKIPPED
> Task :solr:test-framework:generatePomFileForJarsPublication
> Task :solr:test-framework:renderJavadoc
> Task :solr:test-framework:javadoc SKIPPED
> Task :solr:test-framework:javadocJar
> Task :solr:test-framework:sourcesJar
> Task :solr:test-framework:signJarsPublication SKIPPED
> Task :solr:test-framework:publishJarsPublicationToBuildRepository
> Task :solr:modules:analysis-extras:compileJava
Note: /home/jenkins/jenkins-slave/workspace/Solr/Solr-Smoketest-9.x/solr/modules/analysis-extras/src/java/org/apache/solr/schema/ICUCollationField.java uses or overrides a deprecated API.
Note: Recompile with -Xlint:deprecation for details.
> Task :solr:modules:analysis-extras:processResources NO-SOURCE
> Task :solr:modules:analysis-extras:classes
> Task :solr:modules:analysis-extras:jar
> Task :solr:modules:analysis-extras:generateMetadataFileForJarsPublication SKIPPED
> Task :solr:modules:analysis-extras:generatePomFileForJarsPublication
> Task :solr:modules:analysis-extras:renderJavadoc
> Task :solr:modules:analysis-extras:javadoc SKIPPED
> Task :solr:modules:analysis-extras:javadocJar
> Task :solr:modules:analysis-extras:sourcesJar
> Task :solr:modules:analysis-extras:signJarsPublication SKIPPED
> Task :solr:modules:analysis-extras:publishJarsPublicationToBuildRepository
> Task :solr:modules:analytics:compileJava
Note: Some input files use or override a deprecated API.
Note: Recompile with -Xlint:deprecation for details.
> Task :solr:modules:analytics:processResources NO-SOURCE
> Task :solr:modules:analytics:classes
> Task :solr:modules:analytics:jar
> Task :solr:modules:analytics:generateMetadataFileForJarsPublication SKIPPED
> Task :solr:modules:analytics:generatePomFileForJarsPublication
> Task :solr:modules:analytics:renderJavadoc
> Task :solr:modules:analytics:javadoc SKIPPED
> Task :solr:modules:analytics:javadocJar
> Task :solr:modules:analytics:sourcesJar
> Task :solr:modules:analytics:signJarsPublication SKIPPED
> Task :solr:modules:analytics:publishJarsPublicationToBuildRepository
> Task :solr:modules:clustering:compileJava
> Task :solr:modules:clustering:processResources NO-SOURCE
> Task :solr:modules:clustering:classes
> Task :solr:modules:clustering:jar
> Task :solr:modules:clustering:generateMetadataFileForJarsPublication SKIPPED
> Task :solr:modules:clustering:generatePomFileForJarsPublication
> Task :solr:modules:clustering:renderJavadoc
> Task :solr:modules:clustering:javadoc SKIPPED
> Task :solr:modules:clustering:javadocJar
> Task :solr:modules:clustering:sourcesJar
> Task :solr:modules:clustering:signJarsPublication SKIPPED
> Task :solr:modules:clustering:publishJarsPublicationToBuildRepository
> Task :solr:modules:extraction:compileJava
Note: /home/jenkins/jenkins-slave/workspace/Solr/Solr-Smoketest-9.x/solr/modules/extraction/src/java/org/apache/solr/handler/extraction/ExtractingDocumentLoader.java uses or overrides a deprecated API.
Note: Recompile with -Xlint:deprecation for details.
> Task :solr:modules:extraction:processResources
> Task :solr:modules:extraction:classes
> Task :solr:modules:extraction:jar
> Task :solr:modules:extraction:generateMetadataFileForJarsPublication SKIPPED
> Task :solr:modules:extraction:generatePomFileForJarsPublication
> Task :solr:modules:extraction:renderJavadoc
> Task :solr:modules:extraction:javadoc SKIPPED
> Task :solr:modules:extraction:javadocJar
> Task :solr:modules:extraction:sourcesJar
> Task :solr:modules:extraction:signJarsPublication SKIPPED
> Task :solr:modules:extraction:publishJarsPublicationToBuildRepository
> Task :solr:modules:gcs-repository:compileJava
Note: /home/jenkins/jenkins-slave/workspace/Solr/Solr-Smoketest-9.x/solr/modules/gcs-repository/src/java/org/apache/solr/gcs/GCSConfigParser.java uses or overrides a deprecated API.
Note: Recompile with -Xlint:deprecation for details.
> Task :solr:modules:gcs-repository:processResources NO-SOURCE
> Task :solr:modules:gcs-repository:classes
> Task :solr:modules:gcs-repository:jar
> Task :solr:modules:gcs-repository:generateMetadataFileForJarsPublication SKIPPED
> Task :solr:modules:gcs-repository:generatePomFileForJarsPublication
> Task :solr:modules:gcs-repository:renderJavadoc
> Task :solr:modules:gcs-repository:javadoc SKIPPED
> Task :solr:modules:gcs-repository:javadocJar
> Task :solr:modules:gcs-repository:sourcesJar
> Task :solr:modules:gcs-repository:signJarsPublication SKIPPED
> Task :solr:modules:gcs-repository:publishJarsPublicationToBuildRepository
> Task :solr:modules:hadoop-auth:compileJava
Note: Some input files use or override a deprecated API.
Note: Recompile with -Xlint:deprecation for details.
> Task :solr:modules:hadoop-auth:processResources NO-SOURCE
> Task :solr:modules:hadoop-auth:classes
> Task :solr:modules:hadoop-auth:jar
> Task :solr:modules:hadoop-auth:generateMetadataFileForJarsPublication SKIPPED
> Task :solr:modules:hadoop-auth:generatePomFileForJarsPublication
> Task :solr:modules:hadoop-auth:renderJavadoc
> Task :solr:modules:hadoop-auth:javadoc SKIPPED
> Task :solr:modules:hadoop-auth:javadocJar
> Task :solr:modules:hadoop-auth:sourcesJar
> Task :solr:modules:hadoop-auth:signJarsPublication SKIPPED
> Task :solr:modules:hadoop-auth:publishJarsPublicationToBuildRepository
> Task :solr:modules:hdfs:compileJava
Note: Some input files use or override a deprecated API.
Note: Recompile with -Xlint:deprecation for details.
> Task :solr:modules:hdfs:processResources NO-SOURCE
> Task :solr:modules:hdfs:classes
> Task :solr:modules:hdfs:jar
> Task :solr:modules:hdfs:generateMetadataFileForJarsPublication SKIPPED
> Task :solr:modules:hdfs:generatePomFileForJarsPublication
> Task :solr:modules:hdfs:renderJavadoc
> Task :solr:modules:hdfs:javadoc SKIPPED
> Task :solr:modules:hdfs:javadocJar
> Task :solr:modules:hdfs:sourcesJar
> Task :solr:modules:hdfs:signJarsPublication SKIPPED
> Task :solr:modules:hdfs:publishJarsPublicationToBuildRepository
> Task :solr:modules:jaegertracer-configurator:compileJava
> Task :solr:modules:jaegertracer-configurator:processResources NO-SOURCE
> Task :solr:modules:jaegertracer-configurator:classes
> Task :solr:modules:jaegertracer-configurator:jar
> Task :solr:modules:jaegertracer-configurator:generateMetadataFileForJarsPublication SKIPPED
> Task :solr:modules:jaegertracer-configurator:generatePomFileForJarsPublication
> Task :solr:modules:jaegertracer-configurator:renderJavadoc
> Task :solr:modules:jaegertracer-configurator:javadoc SKIPPED
> Task :solr:modules:jaegertracer-configurator:javadocJar
> Task :solr:modules:jaegertracer-configurator:sourcesJar
> Task :solr:modules:jaegertracer-configurator:signJarsPublication SKIPPED
> Task :solr:modules:jaegertracer-configurator:publishJarsPublicationToBuildRepository
> Task :solr:modules:jwt-auth:compileJava
> Task :solr:modules:jwt-auth:processResources NO-SOURCE
> Task :solr:modules:jwt-auth:classes
> Task :solr:modules:jwt-auth:jar
> Task :solr:modules:jwt-auth:generateMetadataFileForJarsPublication SKIPPED
> Task :solr:modules:jwt-auth:generatePomFileForJarsPublication
> Task :solr:modules:jwt-auth:renderJavadoc
> Task :solr:modules:jwt-auth:javadoc SKIPPED
> Task :solr:modules:jwt-auth:javadocJar
> Task :solr:modules:jwt-auth:sourcesJar
> Task :solr:modules:jwt-auth:signJarsPublication SKIPPED
> Task :solr:modules:jwt-auth:publishJarsPublicationToBuildRepository
> Task :solr:modules:langid:compileJava
Note: Some input files use or override a deprecated API.
Note: Recompile with -Xlint:deprecation for details.
> Task :solr:modules:langid:processResources
> Task :solr:modules:langid:classes
> Task :solr:modules:langid:jar
> Task :solr:modules:langid:generateMetadataFileForJarsPublication SKIPPED
> Task :solr:modules:langid:generatePomFileForJarsPublication
> Task :solr:modules:langid:renderJavadoc
> Task :solr:modules:langid:javadoc SKIPPED
> Task :solr:modules:langid:javadocJar
> Task :solr:modules:langid:sourcesJar
> Task :solr:modules:langid:signJarsPublication SKIPPED
> Task :solr:modules:langid:publishJarsPublicationToBuildRepository
> Task :solr:modules:ltr:compileJava
Note: Some input files use or override a deprecated API.
Note: Recompile with -Xlint:deprecation for details.
> Task :solr:modules:ltr:processResources NO-SOURCE
> Task :solr:modules:ltr:classes
> Task :solr:modules:ltr:jar
> Task :solr:modules:ltr:generateMetadataFileForJarsPublication SKIPPED
> Task :solr:modules:ltr:generatePomFileForJarsPublication
> Task :solr:modules:ltr:renderJavadoc
> Task :solr:modules:ltr:javadoc SKIPPED
> Task :solr:modules:ltr:javadocJar
> Task :solr:modules:ltr:sourcesJar
> Task :solr:modules:ltr:signJarsPublication SKIPPED
> Task :solr:modules:ltr:publishJarsPublicationToBuildRepository
> Task :solr:modules:opentelemetry:compileJava
> Task :solr:modules:opentelemetry:processResources NO-SOURCE
> Task :solr:modules:opentelemetry:classes
> Task :solr:modules:opentelemetry:jar
> Task :solr:modules:opentelemetry:generateMetadataFileForJarsPublication SKIPPED
> Task :solr:modules:opentelemetry:generatePomFileForJarsPublication
> Task :solr:modules:opentelemetry:renderJavadoc
> Task :solr:modules:opentelemetry:javadoc SKIPPED
> Task :solr:modules:opentelemetry:javadocJar
> Task :solr:modules:opentelemetry:sourcesJar
> Task :solr:modules:opentelemetry:signJarsPublication SKIPPED
> Task :solr:modules:opentelemetry:publishJarsPublicationToBuildRepository
> Task :solr:modules:s3-repository:compileJava
> Task :solr:modules:s3-repository:processResources NO-SOURCE
> Task :solr:modules:s3-repository:classes
> Task :solr:modules:s3-repository:jar
> Task :solr:modules:s3-repository:generateMetadataFileForJarsPublication SKIPPED
> Task :solr:modules:s3-repository:generatePomFileForJarsPublication
> Task :solr:modules:s3-repository:renderJavadoc
> Task :solr:modules:s3-repository:javadoc SKIPPED
> Task :solr:modules:s3-repository:javadocJar
> Task :solr:modules:s3-repository:sourcesJar
> Task :solr:modules:s3-repository:signJarsPublication SKIPPED
> Task :solr:modules:s3-repository:publishJarsPublicationToBuildRepository
> Task :solr:modules:scripting:compileJava
Note: /home/jenkins/jenkins-slave/workspace/Solr/Solr-Smoketest-9.x/solr/modules/scripting/src/java/org/apache/solr/scripting/xslt/XSLTUpdateRequestHandler.java uses or overrides a deprecated API.
Note: Recompile with -Xlint:deprecation for details.
> Task :solr:modules:scripting:processResources NO-SOURCE
> Task :solr:modules:scripting:classes
> Task :solr:modules:scripting:jar
> Task :solr:modules:scripting:generateMetadataFileForJarsPublication SKIPPED
> Task :solr:modules:scripting:generatePomFileForJarsPublication
> Task :solr:modules:scripting:renderJavadoc
> Task :solr:modules:scripting:javadoc SKIPPED
> Task :solr:modules:scripting:javadocJar
> Task :solr:modules:scripting:sourcesJar
> Task :solr:modules:scripting:signJarsPublication SKIPPED
> Task :solr:modules:scripting:publishJarsPublicationToBuildRepository
> Task :solr:modules:sql:compileJava
Note: Some input files use or override a deprecated API.
Note: Recompile with -Xlint:deprecation for details.
> Task :solr:modules:sql:processResources
> Task :solr:modules:sql:classes
> Task :solr:modules:sql:jar
> Task :solr:modules:sql:generateMetadataFileForJarsPublication SKIPPED
> Task :solr:modules:sql:generatePomFileForJarsPublication
> Task :solr:modules:sql:renderJavadoc
> Task :solr:modules:sql:javadoc SKIPPED
> Task :solr:modules:sql:javadocJar
> Task :solr:modules:sql:sourcesJar
> Task :solr:modules:sql:signJarsPublication SKIPPED
> Task :solr:modules:sql:publishJarsPublicationToBuildRepository
> Task :mavenToLocalFolder
Local maven artifacts (poms, jars) created at: /home/jenkins/jenkins-slave/workspace/Solr/Solr-Smoketest-9.x/build/maven-local
> Task :checkWorkingCopyClean
> Task :solr:distribution:assembleSourceTgz
> Task :solr:docker:createBodySnippetDockerfile
> Task :solr:docker:createDockerfileLocal
> Task :solr:docker:assemblePackaging
> Task :solr:documentation:changesToHtml
> Task :solr:documentation:copyDocumentationAssets
> Task :solr:documentation:markdownToHtml
> Task :solr:documentation:copyChangesToHtmlForMiniSite
> Task :solr:documentation:copyMiniDocumentationAssets
> Task :solr:documentation:createMiniDocumentationIndex
> Task :solr:documentation:documentationMinimal
> Task :solr:core:assemblePostJar
> Task :solr:example:assemblePackaging
> Task :solr:prometheus-exporter:assemblePackaging
> Task :solr:webapp:compileJava NO-SOURCE
> Task :solr:webapp:processResources NO-SOURCE
> Task :solr:webapp:classes UP-TO-DATE
> Task :solr:api:buildJSClient
################################################################################
# Thanks for using OpenAPI Generator. #
# Please consider donation to help us maintain this project ๐ #
# https://opencollective.com/openapi_generator/donate #
################################################################################
Successfully generated code to /home/jenkins/jenkins-slave/workspace/Solr/Solr-Smoketest-9.x/solr/api/build/generated/js
> Task :solr:webapp:nodeSetup
> Task :solr:webapp:npmSetup SKIPPED
> Task :solr:webapp:downloadBrowserify
added 163 packages, changed 1 package, and audited 165 packages in 5s
31 packages are looking for funding
run `npm fund` for details
found 0 vulnerabilities
> Task :solr:webapp:syncJSClientSourceCode
> Task :solr:webapp:jsClientDownloadDeps
npm WARN deprecated @babel/plugin-proposal-numeric-separator@7.18.6: This proposal has been merged to the ECMAScript standard and thus this plugin is no longer maintained. Please use @babel/plugin-transform-numeric-separator instead.
npm WARN deprecated @babel/plugin-proposal-nullish-coalescing-operator@7.18.6: This proposal has been merged to the ECMAScript standard and thus this plugin is no longer maintained. Please use @babel/plugin-transform-nullish-coalescing-operator instead.
npm WARN deprecated @babel/plugin-proposal-json-strings@7.18.6: This proposal has been merged to the ECMAScript standard and thus this plugin is no longer maintained. Please use @babel/plugin-transform-json-strings instead.
npm WARN deprecated @babel/plugin-proposal-export-namespace-from@7.18.9: This proposal has been merged to the ECMAScript standard and thus this plugin is no longer maintained. Please use @babel/plugin-transform-export-namespace-from instead.
npm WARN deprecated @babel/plugin-proposal-class-properties@7.18.6: This proposal has been merged to the ECMAScript standard and thus this plugin is no longer maintained. Please use @babel/plugin-transform-class-properties instead.
npm WARN deprecated @babel/plugin-proposal-logical-assignment-operators@7.20.7: This proposal has been merged to the ECMAScript standard and thus this plugin is no longer maintained. Please use @babel/plugin-transform-logical-assignment-operators instead.
npm WARN deprecated @babel/plugin-proposal-optional-chaining@7.21.0: This proposal has been merged to the ECMAScript standard and thus this plugin is no longer maintained. Please use @babel/plugin-transform-optional-chaining instead.
npm WARN deprecated formidable@1.2.6: Please upgrade to latest, formidable@v2 or formidable@v3! Check these notes: https://bit.ly/2ZEqIau
npm WARN deprecated superagent@5.3.1: Please upgrade to v7.0.2+ of superagent. We have fixed numerous issues with streams, form-data, attach(), filesystem errors not bubbling up (ENOENT on attach()), and all tests are now passing. See the releases tab for more information at <https://github.com/visionmedia/superagent/releases>.
npm WARN deprecated sinon@7.5.0: 16.1.1
> v2_api@9.6.0 prepare
> npm run build
> v2_api@9.6.0 build
> babel src -d dist
Successfully compiled 80 files with Babel (2146ms).
added 356 packages, and audited 357 packages in 16s
41 packages are looking for funding
run `npm fund` for details
3 vulnerabilities (1 moderate, 2 high)
To address all issues (including breaking changes), run:
npm audit fix --force
Run `npm audit` for details.
> Task :solr:webapp:jsClientBuild
> v2_api@9.6.0 build
> babel src -d dist
Successfully compiled 80 files with Babel (2200ms).
> Task :solr:webapp:generateJsClientBundle
> Task :solr:webapp:finalizeJsBundleDir
> Task :solr:webapp:war
> Task :solr:server:assemblePackaging
> Task :solr:modules:analysis-extras:assemblePackaging
> Task :solr:modules:analytics:assemblePackaging
> Task :solr:modules:clustering:assemblePackaging
> Task :solr:modules:extraction:assemblePackaging
> Task :solr:modules:gcs-repository:assemblePackaging
> Task :solr:modules:hadoop-auth:assemblePackaging
> Task :solr:modules:hdfs:assemblePackaging
> Task :solr:modules:jaegertracer-configurator:assemblePackaging
> Task :solr:modules:jwt-auth:assemblePackaging
> Task :solr:modules:langid:assemblePackaging
> Task :solr:modules:ltr:assemblePackaging
> Task :solr:modules:opentelemetry:assemblePackaging
> Task :solr:modules:s3-repository:assemblePackaging
> Task :solr:modules:scripting:assemblePackaging
> Task :solr:modules:sql:assemblePackaging
> Task :solr:packaging:fullDistTar
> Task :solr:packaging:slimDistTar
> Task :solr:distribution:computeChecksums
> Task :solr:distribution:prepareGitRev
> Task :solr:docker:createDockerfileOfficialFull
> Task :solr:docker:createDockerfileOfficialSlim
> Task :solr:distribution:assembleRelease
Deprecated Gradle features were used in this build, making it incompatible with Gradle 9.0.
You can use '--warning-mode all' to show the individual deprecation warnings and determine if they come from your own scripts or plugins.
For more on this, please refer to https://docs.gradle.org/8.4/userguide/command_line_interface.html#sec:command_line_warnings in the Gradle documentation.
BUILD SUCCESSFUL in 5m 16s
254 actionable tasks: 246 executed, 8 up-to-date
Publishing build scan...
https://ge.apache.org/s/snrmogzuak4qk
Build step 'Invoke Gradle script' changed build result to SUCCESS
Run condition [Always] enabling perform for step [Execute shell]
[Solr-Smoketest-9.x] $ /bin/bash /tmp/jenkins17752188363649629204.sh
Installing Python script requirements
Defaulting to user installation because normal site-packages is not writeable
Collecting six~=1.16.0
Using cached six-1.16.0-py2.py3-none-any.whl (11 kB)
ERROR: Could not find a version that satisfies the requirement Jinja2~=3.1.1 (from versions: 2.0rc1, 2.0, 2.1, 2.1.1, 2.2, 2.2.1, 2.3, 2.3.1, 2.4, 2.4.1, 2.5, 2.5.1, 2.5.2, 2.5.3, 2.5.4, 2.5.5, 2.6, 2.7, 2.7.1, 2.7.2, 2.7.3, 2.8, 2.8.1, 2.9, 2.9.1, 2.9.2, 2.9.3, 2.9.4, 2.9.5, 2.9.6, 2.10, 2.10.1, 2.10.2, 2.10.3, 2.11.0, 2.11.1, 2.11.2, 2.11.3, 3.0.0a1, 3.0.0rc1, 3.0.0rc2, 3.0.0, 3.0.1, 3.0.2, 3.0.3)
ERROR: No matching distribution found for Jinja2~=3.1.1
Starting Smoke tester in folder /home/jenkins/jenkins-slave/workspace/Solr/Solr-Smoketest-9.x
Java 11 JAVA_HOME=/home/jenkins/tools/java/latest11
NOTE: output encoding is UTF-8
NOTE: Not running @Nightly or @BadApple tests. Please verify that recent Jenkins runs have passed.
Load release URL "file:///home/jenkins/jenkins-slave/workspace/Solr/Solr-Smoketest-9.x/solr/distribution/build/release"...
Get KEYS...
Downloading online KEYS file https://archive.apache.org/dist/solr/KEYS
Downloading https://archive.apache.org/dist/solr/KEYS
0.3 MB in 1.63 sec (0.2 MB/sec)
Test Solr...
test basics...
check changes HTML...
check OpenAPI specification...
download solr-9.6.0-slim.tgz...
Downloading file:///home/jenkins/jenkins-slave/workspace/Solr/Solr-Smoketest-9.x/solr/distribution/build/release/solr-9.6.0-slim.tgz
61.2 MB in 0.05 sec (1201.0 MB/sec)
verify sha512 digest
download solr-9.6.0-src.tgz...
Downloading file:///home/jenkins/jenkins-slave/workspace/Solr/Solr-Smoketest-9.x/solr/distribution/build/release/solr-9.6.0-src.tgz
86.0 MB in 0.07 sec (1162.7 MB/sec)
verify sha512 digest
download solr-9.6.0.tgz...
Downloading file:///home/jenkins/jenkins-slave/workspace/Solr/Solr-Smoketest-9.x/solr/distribution/build/release/solr-9.6.0.tgz
269.0 MB in 0.22 sec (1226.0 MB/sec)
verify sha512 digest
unpack solr-9.6.0.tgz...
solr-9.6.0.tgz
Checking LICENSE.txt
Checking NOTICE.txt
Checking README.txt
Checking CHANGES.txt
Checking bin
Checking modules
Checking docker
Checking prometheus-exporter
Checking docs
Checking example
Checking licenses
Checking server
Checking lib
verify JAR metadata/identity/no javax.* or java.* classes...
**WARNING**: skipping check of /home/jenkins/jenkins-slave/workspace/Solr/Solr-Smoketest-9.x/_tmp/smoke_1709799712/unpack/solr-9.6.0/server/solr-webapp/webapp/WEB-INF/lib/jakarta.ws.rs-api-3.1.0.jar: it has javax.* classes
**WARNING**: skipping check of /home/jenkins/jenkins-slave/workspace/Solr/Solr-Smoketest-9.x/_tmp/smoke_1709799712/unpack/solr-9.6.0/server/solr-webapp/webapp/WEB-INF/lib/jakarta.annotation-api-2.1.1.jar: it has javax.* classes
**WARNING**: skipping check of /home/jenkins/jenkins-slave/workspace/Solr/Solr-Smoketest-9.x/_tmp/smoke_1709799712/unpack/solr-9.6.0/server/solr-webapp/webapp/WEB-INF/lib/jakarta.validation-api-3.0.2.jar: it has javax.* classes
**WARNING**: skipping check of /home/jenkins/jenkins-slave/workspace/Solr/Solr-Smoketest-9.x/_tmp/smoke_1709799712/unpack/solr-9.6.0/server/solr-webapp/webapp/WEB-INF/lib/jakarta.inject-api-2.0.1.jar: it has javax.* classes
**WARNING**: skipping check of /home/jenkins/jenkins-slave/workspace/Solr/Solr-Smoketest-9.x/_tmp/smoke_1709799712/unpack/solr-9.6.0/server/lib/ext/jetty-servlet-api-4.0.6.jar: it has javax.* classes
**WARNING**: skipping check of /home/jenkins/jenkins-slave/workspace/Solr/Solr-Smoketest-9.x/_tmp/smoke_1709799712/unpack/solr-9.6.0/modules/extraction/lib/jakarta.activation-1.2.2.jar: it has javax.* classes
**WARNING**: skipping check of /home/jenkins/jenkins-slave/workspace/Solr/Solr-Smoketest-9.x/_tmp/smoke_1709799712/unpack/solr-9.6.0/modules/extraction/lib/jakarta.xml.bind-api-2.3.3.jar: it has javax.* classes
**WARNING**: skipping check of /home/jenkins/jenkins-slave/workspace/Solr/Solr-Smoketest-9.x/_tmp/smoke_1709799712/unpack/solr-9.6.0/modules/extraction/lib/jakarta.activation-api-1.2.2.jar: it has javax.* classes
**WARNING**: skipping check of /home/jenkins/jenkins-slave/workspace/Solr/Solr-Smoketest-9.x/_tmp/smoke_1709799712/unpack/solr-9.6.0/modules/extraction/lib/unit-api-1.0.jar: it has javax.* classes
copying unpacked distribution for Java 11 ...
test solr example w/ Java 11...
start Solr instance (log=/home/jenkins/jenkins-slave/workspace/Solr/Solr-Smoketest-9.x/_tmp/smoke_1709799712/unpack/solr-9.6.0-java11/solr-example.log)...
No process found for Solr node running on port 8983
Running techproducts example on port 8983 from /home/jenkins/jenkins-slave/workspace/Solr/Solr-Smoketest-9.x/_tmp/smoke_1709799712/unpack/solr-9.6.0-java11
*** [WARN] *** Your open file limit is currently 60000.
It should be set to 65000 to avoid operational disruption.
If you no longer wish to see this warning, set SOLR_ULIMIT_CHECKS to false in your profile or solr.in.sh
*** [WARN] *** Your Max Processes Limit is currently 30000.
It should be set to 65000 to avoid operational disruption.
If you no longer wish to see this warning, set SOLR_ULIMIT_CHECKS to false in your profile or solr.in.sh
Creating Solr home directory /home/jenkins/jenkins-slave/workspace/Solr/Solr-Smoketest-9.x/_tmp/smoke_1709799712/unpack/solr-9.6.0-java11/example/techproducts/solr
Starting up Solr on port 8983 using command:
"bin/solr" start -p 8983 -s "example/techproducts/solr"
*** [WARN] *** Your open file limit is currently 60000.
It should be set to 65000 to avoid operational disruption.
If you no longer wish to see this warning, set SOLR_ULIMIT_CHECKS to false in your profile or solr.in.sh
*** [WARN] *** Your Max Processes Limit is currently 30000.
It should be set to 65000 to avoid operational disruption.
If you no longer wish to see this warning, set SOLR_ULIMIT_CHECKS to false in your profile or solr.in.sh
Waiting up to 180 seconds to see Solr running on port 8983 [|] [/] [-] [\] [|]
Started Solr server on port 8983 (pid=24878). Happy searching!
Created new core 'techproducts'
Indexing tech product example docs from /home/jenkins/jenkins-slave/workspace/Solr/Solr-Smoketest-9.x/_tmp/smoke_1709799712/unpack/solr-9.6.0-java11/example/exampledocs
Posting files to [base] url http://localhost:8983/solr/techproducts/update using content-type application/xml...
POSTing file mp500.xml to [base]
POSTing file ipod_video.xml to [base]
POSTing file monitor2.xml to [base]
POSTing file gb18030-example.xml to [base]
POSTing file vidcard.xml to [base]
POSTing file money.xml to [base]
POSTing file hd.xml to [base]
POSTing file ipod_other.xml to [base]
POSTing file sd500.xml to [base]
POSTing file solr.xml to [base]
POSTing file utf8-example.xml to [base]
POSTing file monitor.xml to [base]
POSTing file manufacturers.xml to [base]
POSTing file mem.xml to [base]
14 files indexed.
COMMITting Solr index changes to http://localhost:8983/solr/techproducts/update...
Time spent: 0:00:00.679
test utf8...
run query...
stop server using: bin/solr stop -p 8983
Sending stop command to Solr running on port 8983 ... waiting up to 180 seconds to allow Jetty process 24878 to stop gracefully.
[|] [/] [-] [\] unpack solr-9.6.0-slim.tgz...
solr-9.6.0-slim.tgz
Checking LICENSE.txt
Checking NOTICE.txt
Checking README.txt
Checking CHANGES.txt
Checking bin
Checking docker
Checking docs
Checking example
Checking licenses
Checking server
Checking lib
verify JAR metadata/identity/no javax.* or java.* classes...
**WARNING**: skipping check of /home/jenkins/jenkins-slave/workspace/Solr/Solr-Smoketest-9.x/_tmp/smoke_1709799712/unpack/solr-9.6.0-slim/server/solr-webapp/webapp/WEB-INF/lib/jakarta.ws.rs-api-3.1.0.jar: it has javax.* classes
**WARNING**: skipping check of /home/jenkins/jenkins-slave/workspace/Solr/Solr-Smoketest-9.x/_tmp/smoke_1709799712/unpack/solr-9.6.0-slim/server/solr-webapp/webapp/WEB-INF/lib/jakarta.annotation-api-2.1.1.jar: it has javax.* classes
**WARNING**: skipping check of /home/jenkins/jenkins-slave/workspace/Solr/Solr-Smoketest-9.x/_tmp/smoke_1709799712/unpack/solr-9.6.0-slim/server/solr-webapp/webapp/WEB-INF/lib/jakarta.validation-api-3.0.2.jar: it has javax.* classes
**WARNING**: skipping check of /home/jenkins/jenkins-slave/workspace/Solr/Solr-Smoketest-9.x/_tmp/smoke_1709799712/unpack/solr-9.6.0-slim/server/solr-webapp/webapp/WEB-INF/lib/jakarta.inject-api-2.0.1.jar: it has javax.* classes
**WARNING**: skipping check of /home/jenkins/jenkins-slave/workspace/Solr/Solr-Smoketest-9.x/_tmp/smoke_1709799712/unpack/solr-9.6.0-slim/server/lib/ext/jetty-servlet-api-4.0.6.jar: it has javax.* classes
copying unpacked distribution for Java 11 ...
test solr example w/ Java 11...
start Solr instance (log=/home/jenkins/jenkins-slave/workspace/Solr/Solr-Smoketest-9.x/_tmp/smoke_1709799712/unpack/solr-9.6.0-slim-java11/solr-example.log)...
No process found for Solr node running on port 8983
Running techproducts example on port 8983 from /home/jenkins/jenkins-slave/workspace/Solr/Solr-Smoketest-9.x/_tmp/smoke_1709799712/unpack/solr-9.6.0-slim-java11
*** [WARN] *** Your open file limit is currently 60000.
It should be set to 65000 to avoid operational disruption.
If you no longer wish to see this warning, set SOLR_ULIMIT_CHECKS to false in your profile or solr.in.sh
*** [WARN] *** Your Max Processes Limit is currently 30000.
It should be set to 65000 to avoid operational disruption.
If you no longer wish to see this warning, set SOLR_ULIMIT_CHECKS to false in your profile or solr.in.sh
Creating Solr home directory /home/jenkins/jenkins-slave/workspace/Solr/Solr-Smoketest-9.x/_tmp/smoke_1709799712/unpack/solr-9.6.0-slim-java11/example/techproducts/solr
Starting up Solr on port 8983 using command:
"bin/solr" start -p 8983 -s "example/techproducts/solr"
*** [WARN] *** Your open file limit is currently 60000.
It should be set to 65000 to avoid operational disruption.
If you no longer wish to see this warning, set SOLR_ULIMIT_CHECKS to false in your profile or solr.in.sh
*** [WARN] *** Your Max Processes Limit is currently 30000.
It should be set to 65000 to avoid operational disruption.
If you no longer wish to see this warning, set SOLR_ULIMIT_CHECKS to false in your profile or solr.in.sh
Waiting up to 180 seconds to see Solr running on port 8983 [|] [/] [-] [\] [|]
Started Solr server on port 8983 (pid=25307). Happy searching!
Created new core 'techproducts'
Indexing tech product example docs from /home/jenkins/jenkins-slave/workspace/Solr/Solr-Smoketest-9.x/_tmp/smoke_1709799712/unpack/solr-9.6.0-slim-java11/example/exampledocs
Posting files to [base] url http://localhost:8983/solr/techproducts/update using content-type application/xml...
POSTing file mp500.xml to [base]
POSTing file ipod_video.xml to [base]
POSTing file monitor2.xml to [base]
POSTing file gb18030-example.xml to [base]
POSTing file vidcard.xml to [base]
POSTing file money.xml to [base]
POSTing file hd.xml to [base]
POSTing file ipod_other.xml to [base]
POSTing file sd500.xml to [base]
POSTing file solr.xml to [base]
POSTing file utf8-example.xml to [base]
POSTing file monitor.xml to [base]
POSTing file manufacturers.xml to [base]
POSTing file mem.xml to [base]
14 files indexed.
COMMITting Solr index changes to http://localhost:8983/solr/techproducts/update...
Time spent: 0:00:00.659
test utf8...
run query...
stop server using: bin/solr stop -p 8983
Sending stop command to Solr running on port 8983 ... waiting up to 180 seconds to allow Jetty process 25307 to stop gracefully.
[|] [/] [-] [\] unpack solr-9.6.0-src.tgz...
solr-9.6.0-src.tgz
Checking LICENSE.txt
Checking NOTICE.txt
Checking README.md
Checking CONTRIBUTING.md
Checking CHANGES.txt
Checking README.adoc
Checking buildSrc
Checking dev-docs
Checking dev-tools
Checking gradle
Checking help
Checking solr
Checking build.gradle
Checking gradlew
Checking gradlew.bat
Checking settings.gradle
Checking versions.lock
Checking versions.props
Checking benchmark
Checking bin
Checking modules
Checking api
Checking core
Checking docker
Checking documentation
Checking example
Checking licenses
Checking packaging
Checking distribution
Checking prometheus-exporter
Checking server
Checking solr-ref-guide
Checking solrj
Checking solrj-streaming
Checking solrj-zookeeper
Checking test-framework
Checking webapp
Checking .gitignore
Checking .gitattributes
Checking build.gradle
make sure no JARs/WARs in src dist...
run "./gradlew --no-daemon check -p solr/documentation"
run tests w/ Java 11 and testArgs='-Dtests.nightly=false -Dtests.badapples=false '...
command "export JAVA_HOME="/home/jenkins/tools/java/latest11" PATH="/home/jenkins/tools/java/latest11/bin:$PATH" JAVACMD="/home/jenkins/tools/java/latest11/bin/java"; ./gradlew --no-daemon test -Dtests.nightly=false -Dtests.badapples=false " failed:
To honour the JVM settings for this build a single-use Daemon process will be forked. For more on this, please refer to https://docs.gradle.org/8.4/userguide/gradle_daemon.html#sec:disabling_the_daemon in the Gradle documentation.
Daemon will be stopped at the end of the build
Gradle Enterprise plugins resolution: https://plugins.gradle.org/m2
Enforcing Gradle Enterprise: https://ge.apache.org, allowUntrustedServer: false
> Task :buildSrc:compileJava UP-TO-DATE
> Task :buildSrc:compileGroovy NO-SOURCE
> Task :buildSrc:processResources NO-SOURCE
> Task :buildSrc:classes UP-TO-DATE
> Task :buildSrc:jar UP-TO-DATE
> Task :solr:api:processResources NO-SOURCE
> Task :solr:api:processTestResources
> Task :solr:core:processResources UP-TO-DATE
> Task :solr:solrj:processResources UP-TO-DATE
> Task :solr:solrj-streaming:processResources UP-TO-DATE
> Task :solr:solrj-zookeeper:processResources NO-SOURCE
> Task :solr:test-framework:processResources
> Task :solr:benchmark:processResources
> Task :solr:benchmark:processTestResources
> Task :gitStatus
> Task :checkJdkInternalsExportedToGradle
> Task :solr:api:compileJava UP-TO-DATE
> Task :solr:api:classes UP-TO-DATE
> Task :solr:api:jar UP-TO-DATE
> Task :ensureJdkSupported
> Task :randomizationInfo
Running tests with randomization seed: tests.seed=50577A9902B29581
> Task :solr:api:resolve UP-TO-DATE
> Task :solr:core:processTestResources
> Task :solr:modules:analysis-extras:processResources NO-SOURCE
> Task :solr:prometheus-exporter:processResources NO-SOURCE
> Task :solr:prometheus-exporter:processTestResources
> Task :solr:server:compileJava SKIPPED
> Task :solr:server:processResources NO-SOURCE
> Task :solr:server:classes UP-TO-DATE
> Task :solr:server:compileTestJava NO-SOURCE
> Task :solr:server:processTestResources NO-SOURCE
> Task :solr:server:testClasses UP-TO-DATE
> Task :solr:server:test NO-SOURCE
> Task :solr:server:wipeTaskTemp
> Task :solr:solr-ref-guide:compileJava NO-SOURCE
> Task :solr:solr-ref-guide:processResources NO-SOURCE
> Task :solr:solr-ref-guide:classes UP-TO-DATE
> Task :solr:solr-ref-guide:copySolrjTestResources
> Task :solr:solr-ref-guide:processTestResources NO-SOURCE
> Task :solr:solrj-streaming:processTestResources
> Task :solr:modules:sql:processResources
> Task :solr:solrj-zookeeper:processTestResources
> Task :solr:test-framework:processTestResources
> Task :solr:webapp:processResources NO-SOURCE
> Task :solr:webapp:processTestResources NO-SOURCE
> Task :solr:modules:analysis-extras:processTestResources
> Task :solr:modules:analytics:processResources NO-SOURCE
> Task :solr:modules:analytics:processTestResources
> Task :solr:modules:clustering:processResources NO-SOURCE
> Task :solr:modules:clustering:processTestResources
> Task :solr:modules:extraction:processResources
> Task :solr:modules:extraction:processTestResources
> Task :solr:modules:gcs-repository:processResources NO-SOURCE
> Task :solr:modules:gcs-repository:processTestResources
> Task :solr:modules:hadoop-auth:processResources NO-SOURCE
> Task :solr:modules:hadoop-auth:copySolrCoreTestResources
> Task :solr:modules:hadoop-auth:processTestResources
> Task :solr:modules:hdfs:processResources NO-SOURCE
> Task :solr:modules:hdfs:copySolrCoreTestResources
> Task :solr:modules:hdfs:processTestResources
> Task :solr:modules:jaegertracer-configurator:processResources NO-SOURCE
> Task :solr:modules:jaegertracer-configurator:processTestResources
> Task :solr:modules:jwt-auth:processResources NO-SOURCE
> Task :solr:modules:jwt-auth:processTestResources
> Task :solr:modules:langid:processResources
> Task :solr:modules:langid:processTestResources
> Task :solr:modules:ltr:processResources NO-SOURCE
> Task :solr:modules:ltr:processTestResources
> Task :solr:modules:opentelemetry:processResources NO-SOURCE
> Task :solr:modules:opentelemetry:processTestResources
> Task :solr:modules:s3-repository:processResources NO-SOURCE
> Task :solr:modules:s3-repository:processTestResources
> Task :solr:modules:scripting:processResources NO-SOURCE
> Task :solr:modules:scripting:processTestResources
> Task :solr:modules:sql:copySolrCoreTestResources
> Task :solr:modules:sql:processTestResources
> Task :solr:solrj:openApiGenerate
################################################################################
# Thanks for using OpenAPI Generator. #
# Please consider donation to help us maintain this project ๐ #
# https://opencollective.com/openapi_generator/donate #
################################################################################
Successfully generated code to /home/jenkins/jenkins-slave/workspace/Solr/Solr-Smoketest-9.x/_tmp/smoke_1709799712/unpack/solr-9.6.0/solr/solrj/build/generated/
> Task :spotlessInternalRegisterDependencies UP-TO-DATE
> Task :solr:solrj:generatedSpotlessHelper
> Task :solr:solrj:generatedSpotless
> Task :solr:solrj:compileJava UP-TO-DATE
> Task :solr:solrj-streaming:compileJava UP-TO-DATE
> Task :solr:solrj:classes UP-TO-DATE
> Task :solr:solrj-zookeeper:compileJava UP-TO-DATE
> Task :solr:solrj:jar UP-TO-DATE
> Task :solr:solrj-streaming:classes UP-TO-DATE
> Task :solr:solrj-streaming:jar UP-TO-DATE
> Task :solr:solrj-zookeeper:classes UP-TO-DATE
> Task :solr:solrj-zookeeper:jar UP-TO-DATE
> Task :solr:core:compileJava UP-TO-DATE
> Task :solr:test-framework:compileJava UP-TO-DATE
> Task :solr:api:compileTestJava
> Task :solr:api:testClasses
> Task :solr:core:classes UP-TO-DATE
> Task :solr:core:jar UP-TO-DATE
> Task :solr:test-framework:classes
> Task :solr:test-framework:jar
> Task :solr:prometheus-exporter:compileJava
Note: Some input files use or override a deprecated API.
Note: Recompile with -Xlint:deprecation for details.
> Task :solr:api:test
:solr:api:test (SUCCESS): 6 test(s)
> Task :solr:api:wipeTaskTemp
> Task :solr:benchmark:compileJava
Note: /home/jenkins/jenkins-slave/workspace/Solr/Solr-Smoketest-9.x/_tmp/smoke_1709799712/unpack/solr-9.6.0/solr/benchmark/src/java/org/apache/solr/bench/search/StreamingSearch.java uses or overrides a deprecated API.
Note: Recompile with -Xlint:deprecation for details.
> Task :solr:benchmark:classes
> Task :solr:benchmark:compileTestJava
> Task :solr:benchmark:testClasses
> Task :solr:benchmark:test
:solr:benchmark:test (SUCCESS): 11 test(s)
> Task :solr:benchmark:wipeTaskTemp
> Task :solr:modules:analysis-extras:compileJava
Note: /home/jenkins/jenkins-slave/workspace/Solr/Solr-Smoketest-9.x/_tmp/smoke_1709799712/unpack/solr-9.6.0/solr/modules/analysis-extras/src/java/org/apache/solr/schema/ICUCollationField.java uses or overrides a deprecated API.
Note: Recompile with -Xlint:deprecation for details.
> Task :solr:modules:analysis-extras:classes
> Task :solr:modules:analysis-extras:jar
> Task :solr:prometheus-exporter:classes
> Task :solr:prometheus-exporter:compileTestJava
Note: /home/jenkins/jenkins-slave/workspace/Solr/Solr-Smoketest-9.x/_tmp/smoke_1709799712/unpack/solr-9.6.0/solr/prometheus-exporter/src/test/org/apache/solr/prometheus/exporter/MetricsQueryTemplateTest.java uses or overrides a deprecated API.
Note: Recompile with -Xlint:deprecation for details.
> Task :solr:prometheus-exporter:testClasses
> Task :solr:core:compileTestJava
> Task :solr:prometheus-exporter:test
:solr:prometheus-exporter:test (SUCCESS): 23 test(s)
> Task :solr:prometheus-exporter:wipeTaskTemp
> Task :solr:solr-ref-guide:compileTestJava
Note: Some input files use or override a deprecated API.
Note: Recompile with -Xlint:deprecation for details.
> Task :solr:solr-ref-guide:testClasses
> Task :solr:core:compileTestJava
Note: Some input files use or override a deprecated API.
Note: Recompile with -Xlint:deprecation for details.
> Task :solr:core:testClasses
> Task :solr:solr-ref-guide:test
> Task :solr:core:test
org.apache.solr.TestGroupingSearch > testGroupingWithTimeAllowed FAILED
java.lang.RuntimeException: Path not found: /responseHeader/partialResults
at __randomizedtesting.SeedInfo.seed([50577A9902B29581:17ABE7FF2A710A]:0)
at org.apache.solr.SolrTestCaseJ4.assertJQ(SolrTestCaseJ4.java:1113)
at org.apache.solr.SolrTestCaseJ4.assertJQ(SolrTestCaseJ4.java:1059)
at org.apache.solr.TestGroupingSearch.testGroupingWithTimeAllowed(TestGroupingSearch.java:464)
at java.base/jdk.internal.reflect.NativeMethodAccessorImpl.invoke0(Native Method)
at java.base/jdk.internal.reflect.NativeMethodAccessorImpl.invoke(NativeMethodAccessorImpl.java:62)
at java.base/jdk.internal.reflect.DelegatingMethodAccessorImpl.invoke(DelegatingMethodAccessorImpl.java:43)
at java.base/java.lang.reflect.Method.invoke(Method.java:566)
at com.carrotsearch.randomizedtesting.RandomizedRunner.invoke(RandomizedRunner.java:1758)
at com.carrotsearch.randomizedtesting.RandomizedRunner$8.evaluate(RandomizedRunner.java:946)
at com.carrotsearch.randomizedtesting.RandomizedRunner$9.evaluate(RandomizedRunner.java:982)
at com.carrotsearch.randomizedtesting.RandomizedRunner$10.evaluate(RandomizedRunner.java:996)
at com.carrotsearch.randomizedtesting.rules.SystemPropertiesRestoreRule$1.evaluate(SystemPropertiesRestoreRule.java:80)
at org.junit.rules.RunRules.evaluate(RunRules.java:20)
at org.apache.lucene.tests.util.TestRuleSetupTeardownChained$1.evaluate(TestRuleSetupTeardownChained.java:48)
at org.apache.lucene.tests.util.AbstractBeforeAfterRule$1.evaluate(AbstractBeforeAfterRule.java:43)
at org.apache.lucene.tests.util.TestRuleThreadAndTestName$1.evaluate(TestRuleThreadAndTestName.java:45)
at org.apache.lucene.tests.util.TestRuleIgnoreAfterMaxFailures$1.evaluate(TestRuleIgnoreAfterMaxFailures.java:60)
at org.apache.lucene.tests.util.TestRuleMarkFailure$1.evaluate(TestRuleMarkFailure.java:44)
at org.junit.rules.RunRules.evaluate(RunRules.java:20)
at com.carrotsearch.randomizedtesting.rules.StatementAdapter.evaluate(StatementAdapter.java:36)
at com.carrotsearch.randomizedtesting.ThreadLeakControl$StatementRunner.run(ThreadLeakControl.java:390)
at com.carrotsearch.randomizedtesting.ThreadLeakControl.forkTimeoutingTask(ThreadLeakControl.java:843)
at com.carrotsearch.randomizedtesting.ThreadLeakControl$3.evaluate(ThreadLeakControl.java:490)
at com.carrotsearch.randomizedtesting.RandomizedRunner.runSingleTest(RandomizedRunner.java:955)
at com.carrotsearch.randomizedtesting.RandomizedRunner$5.evaluate(RandomizedRunner.java:840)
at com.carrotsearch.randomizedtesting.RandomizedRunner$6.evaluate(RandomizedRunner.java:891)
at com.carrotsearch.randomizedtesting.RandomizedRunner$7.evaluate(RandomizedRunner.java:902)
at com.carrotsearch.randomizedtesting.rules.StatementAdapter.evaluate(StatementAdapter.java:36)
at com.carrotsearch.randomizedtesting.rules.StatementAdapter.evaluate(StatementAdapter.java:36)
at org.apache.lucene.tests.util.AbstractBeforeAfterRule$1.evaluate(AbstractBeforeAfterRule.java:43)
at org.apache.lucene.tests.util.AbstractBeforeAfterRule$1.evaluate(AbstractBeforeAfterRule.java:43)
at com.carrotsearch.randomizedtesting.rules.SystemPropertiesRestoreRule$1.evaluate(SystemPropertiesRestoreRule.java:80)
at org.junit.rules.RunRules.evaluate(RunRules.java:20)
at org.apache.lucene.tests.util.AbstractBeforeAfterRule$1.evaluate(AbstractBeforeAfterRule.java:43)
at com.carrotsearch.randomizedtesting.rules.StatementAdapter.evaluate(StatementAdapter.java:36)
at org.apache.lucene.tests.util.TestRuleStoreClassName$1.evaluate(TestRuleStoreClassName.java:38)
at com.carrotsearch.randomizedtesting.rules.NoShadowingOrOverridesOnMethodsRule$1.evaluate(NoShadowingOrOverridesOnMethodsRule.java:40)
at com.carrotsearch.randomizedtesting.rules.NoShadowingOrOverridesOnMethodsRule$1.evaluate(NoShadowingOrOverridesOnMethodsRule.java:40)
at com.carrotsearch.randomizedtesting.rules.StatementAdapter.evaluate(StatementAdapter.java:36)
at com.carrotsearch.randomizedtesting.rules.StatementAdapter.evaluate(StatementAdapter.java:36)
at org.apache.lucene.tests.util.TestRuleAssertionsRequired$1.evaluate(TestRuleAssertionsRequired.java:53)
at org.apache.lucene.tests.util.AbstractBeforeAfterRule$1.evaluate(AbstractBeforeAfterRule.java:43)
at org.apache.lucene.tests.util.TestRuleMarkFailure$1.evaluate(TestRuleMarkFailure.java:44)
at org.apache.lucene.tests.util.TestRuleIgnoreAfterMaxFailures$1.evaluate(TestRuleIgnoreAfterMaxFailures.java:60)
at org.apache.lucene.tests.util.TestRuleIgnoreTestSuites$1.evaluate(TestRuleIgnoreTestSuites.java:47)
at org.junit.rules.RunRules.evaluate(RunRules.java:20)
at com.carrotsearch.randomizedtesting.rules.StatementAdapter.evaluate(StatementAdapter.java:36)
at com.carrotsearch.randomizedtesting.ThreadLeakControl$StatementRunner.run(ThreadLeakControl.java:390)
at com.carrotsearch.randomizedtesting.ThreadLeakControl.lambda$forkTimeoutingTask$0(ThreadLeakControl.java:850)
at java.base/java.lang.Thread.run(Thread.java:829)
org.apache.solr.TestGroupingSearch > test suite's output saved to /home/jenkins/jenkins-slave/workspace/Solr/Solr-Smoketest-9.x/_tmp/smoke_1709799712/unpack/solr-9.6.0/solr/core/build/test-results/test/outputs/OUTPUT-org.apache.solr.TestGroupingSearch.txt, copied below:
2> 46923 INFO (SUITE-TestGroupingSearch-seed#[50577A9902B29581]-worker) [n: c: s: r: x: t:] o.a.s.SolrTestCase Setting 'solr.default.confdir' system property to test-framework derived value of '/home/jenkins/jenkins-slave/workspace/Solr/Solr-Smoketest-9.x/_tmp/smoke_1709799712/unpack/solr-9.6.0/solr/server/solr/configsets/_default/conf'
2> 46923 INFO (SUITE-TestGroupingSearch-seed#[50577A9902B29581]-worker) [n: c: s: r: x: t:] o.a.s.SolrTestCaseJ4 SecureRandom sanity checks: test.solr.allowed.securerandom=null & java.security.egd=file:/dev/./urandom
2> 46925 INFO (SUITE-TestGroupingSearch-seed#[50577A9902B29581]-worker) [n: c: s: r: x: t:] o.a.s.u.ErrorLogMuter Closing ErrorLogMuter-regex-35 after mutting 0 log messages
2> 46925 INFO (SUITE-TestGroupingSearch-seed#[50577A9902B29581]-worker) [n: c: s: r: x: t:] o.a.s.u.ErrorLogMuter Creating ErrorLogMuter-regex-36 for ERROR logs matching regex: ignore_exception
2> 46925 INFO (SUITE-TestGroupingSearch-seed#[50577A9902B29581]-worker) [n: c: s: r: x: t:] o.a.s.SolrTestCaseJ4 Created dataDir: /home/jenkins/jenkins-slave/workspace/Solr/Solr-Smoketest-9.x/_tmp/smoke_1709799712/unpack/solr-9.6.0/solr/core/build/tmp/tests-tmp/solr.TestGroupingSearch_50577A9902B29581-001/data-dir-12-001
2> 46926 WARN (SUITE-TestGroupingSearch-seed#[50577A9902B29581]-worker) [n: c: s: r: x: t:] o.a.s.SolrTestCaseJ4 startTrackingSearchers: numOpens=23 numCloses=23
2> 46926 INFO (SUITE-TestGroupingSearch-seed#[50577A9902B29581]-worker) [n: c: s: r: x: t:] o.a.s.SolrTestCaseJ4 Using PointFields (NUMERIC_POINTS_SYSPROP=true) w/NUMERIC_DOCVALUES_SYSPROP=true
2> 46927 INFO (SUITE-TestGroupingSearch-seed#[50577A9902B29581]-worker) [n: c: s: r: x: t:] o.a.s.SolrTestCaseJ4 Randomized ssl (false) and clientAuth (false) via: @org.apache.solr.util.RandomizeSSL(reason="", ssl=0.0/0.0, value=0.0/0.0, clientAuth=0.0/0.0)
2> 46928 INFO (SUITE-TestGroupingSearch-seed#[50577A9902B29581]-worker) [n: c: s: r: x: t:] o.a.s.SolrTestCaseJ4 ####initCore
2> 46933 INFO (SUITE-TestGroupingSearch-seed#[50577A9902B29581]-worker) [n: c: s: r: x: t:] o.a.s.c.SolrResourceLoader Added 2 libs to classloader, from paths: [/home/jenkins/jenkins-slave/workspace/Solr/Solr-Smoketest-9.x/_tmp/smoke_1709799712/unpack/solr-9.6.0/solr/core/build/resources/test/solr/collection1/lib, /home/jenkins/jenkins-slave/workspace/Solr/Solr-Smoketest-9.x/_tmp/smoke_1709799712/unpack/solr-9.6.0/solr/core/build/resources/test/solr/collection1/lib/classes]
2> 46947 INFO (SUITE-TestGroupingSearch-seed#[50577A9902B29581]-worker) [n: c: s: r: x: t:] o.a.s.c.SolrConfig Using Lucene MatchVersion: 9.9.2
2> 46947 WARN (SUITE-TestGroupingSearch-seed#[50577A9902B29581]-worker) [n: c: s: r: x: t:] o.a.s.c.SolrConfig solrconfig.xml: <boolTofilterOptimizer> is currently not implemented and has no effect.
2> 46951 INFO (SUITE-TestGroupingSearch-seed#[50577A9902B29581]-worker) [n: c: s: r: x: t:] o.a.s.s.IndexSchema Schema name=test
2> 46955 WARN (SUITE-TestGroupingSearch-seed#[50577A9902B29581]-worker) [n: c: s: r: x: t:] o.a.s.s.IndexSchema Field text is not multivalued and destination for multiple copyFields (2)
2> 46987 INFO (SUITE-TestGroupingSearch-seed#[50577A9902B29581]-worker) [n: c: s: r: x: t:] o.a.s.s.IndexSchema Loaded schema test/1.4 with uniqueid field id
2> 47594 INFO (SUITE-TestGroupingSearch-seed#[50577A9902B29581]-worker) [n: c: s: r: x: t:] o.a.s.u.t.SimplePropagator Always-on trace id generation enabled.
2> 47600 WARN (SUITE-TestGroupingSearch-seed#[50577A9902B29581]-worker) [n: c: s: r: x: t:] o.a.s.c.CoreContainer Not all security plugins configured! authentication=disabled authorization=disabled. Solr is only as secure as you make it. Consider configuring authentication/authorization before exposing Solr to users internal or external. See https://s.apache.org/solrsecurity for more info
2> 47626 INFO (coreLoadExecutor-324-thread-1) [n: c: s: r: x:collection1 t:] o.a.s.c.SolrResourceLoader Added 2 libs to classloader, from paths: [/home/jenkins/jenkins-slave/workspace/Solr/Solr-Smoketest-9.x/_tmp/smoke_1709799712/unpack/solr-9.6.0/solr/core/build/resources/test/solr/collection1/lib, /home/jenkins/jenkins-slave/workspace/Solr/Solr-Smoketest-9.x/_tmp/smoke_1709799712/unpack/solr-9.6.0/solr/core/build/resources/test/solr/collection1/lib/classes]
2> 47642 INFO (coreLoadExecutor-324-thread-1) [n: c: s: r: x:collection1 t:] o.a.s.c.SolrConfig Using Lucene MatchVersion: 9.9.2
2> 47643 WARN (coreLoadExecutor-324-thread-1) [n: c: s: r: x:collection1 t:] o.a.s.c.SolrConfig solrconfig.xml: <boolTofilterOptimizer> is currently not implemented and has no effect.
2> 47646 INFO (coreLoadExecutor-324-thread-1) [n: c: s: r: x:collection1 t:] o.a.s.s.IndexSchema Schema name=test
2> 47650 WARN (coreLoadExecutor-324-thread-1) [n: c: s: r: x:collection1 t:] o.a.s.s.IndexSchema Field text is not multivalued and destination for multiple copyFields (2)
2> 47672 INFO (coreLoadExecutor-324-thread-1) [n: c: s: r: x:collection1 t:] o.a.s.s.IndexSchema Loaded schema test/1.4 with uniqueid field id
2> 47708 INFO (coreLoadExecutor-324-thread-1) [n: c: s: r: x:collection1 t:] o.a.s.c.CoreContainer Creating SolrCore 'collection1' using configuration from instancedir /home/jenkins/jenkins-slave/workspace/Solr/Solr-Smoketest-9.x/_tmp/smoke_1709799712/unpack/solr-9.6.0/solr/core/build/resources/test/solr/collection1, trusted=true
2> 47709 INFO (coreLoadExecutor-324-thread-1) [n: c: s: r: x:collection1 t:] o.a.s.c.SolrCore Opening new SolrCore at [/home/jenkins/jenkins-slave/workspace/Solr/Solr-Smoketest-9.x/_tmp/smoke_1709799712/unpack/solr-9.6.0/solr/core/build/resources/test/solr/collection1], dataDir=[/home/jenkins/jenkins-slave/workspace/Solr/Solr-Smoketest-9.x/_tmp/smoke_1709799712/unpack/solr-9.6.0/solr/core/build/tmp/tests-tmp/solr.TestGroupingSearch_50577A9902B29581-001/data-dir-12-001/]
2> 47747 INFO (coreLoadExecutor-324-thread-1) [n: c: s: r: x:collection1 t:] o.a.s.j.SolrRequestAuthorizer Creating a new SolrRequestAuthorizer
2> 47751 INFO (coreLoadExecutor-324-thread-1) [n: c: s: r: x:collection1 t:] o.a.s.u.CommitTracker Hard AutoCommit: disabled
2> 47751 INFO (coreLoadExecutor-324-thread-1) [n: c: s: r: x:collection1 t:] o.a.s.u.CommitTracker Soft AutoCommit: disabled
2> 47777 INFO (coreLoadExecutor-324-thread-1) [n: c: s: r: x:collection1 t:] o.a.s.s.DirectSolrSpellChecker init: {minQueryLength=3, name=direct, classname=DirectSolrSpellChecker, field=lowerfilt}
2> 47777 INFO (coreLoadExecutor-324-thread-1) [n: c: s: r: x:collection1 t:] o.a.s.s.DirectSolrSpellChecker init: {minQueryLength=3, maxQueryFrequency=2, name=directMQF2, classname=DirectSolrSpellChecker, field=lowerfilt}
2> 47856 INFO (coreLoadExecutor-324-thread-1) [n: c: s: r: x:collection1 t:] o.a.s.h.ReplicationHandler Commits will be reserved for 10000 ms
2> 47857 INFO (searcherExecutor-326-thread-1-processing-collection1) [n: c: s: r: x:collection1 t:] o.a.s.h.c.SpellCheckComponent Loading spell index for spellchecker: default
2> 47857 INFO (searcherExecutor-326-thread-1-processing-collection1) [n: c: s: r: x:collection1 t:] o.a.s.h.c.SpellCheckComponent Loading spell index for spellchecker: direct
2> 47858 INFO (searcherExecutor-326-thread-1-processing-collection1) [n: c: s: r: x:collection1 t:] o.a.s.h.c.SpellCheckComponent Loading spell index for spellchecker: directMQF2
2> 47858 INFO (searcherExecutor-326-thread-1-processing-collection1) [n: c: s: r: x:collection1 t:] o.a.s.h.c.SpellCheckComponent Loading spell index for spellchecker: wordbreak
2> 47858 INFO (searcherExecutor-326-thread-1-processing-collection1) [n: c: s: r: x:collection1 t:] o.a.s.h.c.SpellCheckComponent Loading spell index for spellchecker: multipleFields
2> 47858 INFO (searcherExecutor-326-thread-1-processing-collection1) [n: c: s: r: x:collection1 t:] o.a.s.h.c.SpellCheckComponent Loading spell index for spellchecker: jarowinkler
2> 47859 INFO (searcherExecutor-326-thread-1-processing-collection1) [n: c: s: r: x:collection1 t:] o.a.s.h.c.SpellCheckComponent Loading spell index for spellchecker: external
2> 47859 INFO (searcherExecutor-326-thread-1-processing-collection1) [n: c: s: r: x:collection1 t:] o.a.s.h.c.SpellCheckComponent Loading spell index for spellchecker: freq
2> 47860 INFO (searcherExecutor-326-thread-1-processing-collection1) [n: c: s: r: x:collection1 t:] o.a.s.h.c.SpellCheckComponent Loading spell index for spellchecker: fqcn
2> 47861 INFO (searcherExecutor-326-thread-1-processing-collection1) [n: c: s: r: x:collection1 t:] o.a.s.h.c.SpellCheckComponent Loading spell index for spellchecker: perDict
2> 47863 INFO (searcherExecutor-326-thread-1-processing-collection1) [n: c: s: r: x:collection1 t:] o.a.s.c.SolrCore Registered new searcher autowarm time: 0 ms
2> 47886 INFO (SUITE-TestGroupingSearch-seed#[50577A9902B29581]-worker) [n: c: s: r: x: t:] o.a.s.j.SolrRequestAuthorizer Creating a new SolrRequestAuthorizer
2> 47896 INFO (SUITE-TestGroupingSearch-seed#[50577A9902B29581]-worker) [n: c: s: r: x: t:] o.a.s.SolrTestCaseJ4 ####initCore end
2> 47900 INFO (TEST-TestGroupingSearch.testGroupingOnDateField-seed#[50577A9902B29581]) [n: c: s: r: x: t:] o.a.s.SolrTestCaseJ4 ###Starting testGroupingOnDateField
2> 47901 INFO (TEST-TestGroupingSearch.testGroupingOnDateField-seed#[50577A9902B29581]) [n: c: s: r: x:collection1 t:] o.a.s.u.DirectUpdateHandler2 REMOVING ALL DOCUMENTS FROM INDEX
2> 47902 INFO (TEST-TestGroupingSearch.testGroupingOnDateField-seed#[50577A9902B29581]) [n: c: s: r: x:collection1 t:] o.a.s.u.p.LogUpdateProcessorFactory webapp=null path=null params={}{deleteByQuery=*:*} 0 1
2> 47908 INFO (searcherExecutor-326-thread-1-processing-collection1) [n: c: s: r: x:collection1 t:] o.a.s.c.SolrCore Registered new searcher autowarm time: 0 ms
2> 47908 INFO (TEST-TestGroupingSearch.testGroupingOnDateField-seed#[50577A9902B29581]) [n: c: s: r: x:collection1 t:] o.a.s.u.p.LogUpdateProcessorFactory webapp=null path=null params={}{commit=} 0 4
2> 47909 INFO (TEST-TestGroupingSearch.testGroupingOnDateField-seed#[50577A9902B29581]) [n: c: s: r: x:collection1 t:] o.a.s.u.p.LogUpdateProcessorFactory webapp=null path=null params={}{add=[1]} 0 0
2> 47910 INFO (TEST-TestGroupingSearch.testGroupingOnDateField-seed#[50577A9902B29581]) [n: c: s: r: x:collection1 t:] o.a.s.u.p.LogUpdateProcessorFactory webapp=null path=null params={}{add=[2]} 0 0
2> 47915 INFO (searcherExecutor-326-thread-1-processing-collection1) [n: c: s: r: x:collection1 t:] o.a.s.c.SolrCore Registered new searcher autowarm time: 0 ms
2> 47916 INFO (TEST-TestGroupingSearch.testGroupingOnDateField-seed#[50577A9902B29581]) [n: c: s: r: x:collection1 t:] o.a.s.u.p.LogUpdateProcessorFactory webapp=null path=null params={}{commit=} 0 5
2> 47916 INFO (TEST-TestGroupingSearch.testGroupingOnDateField-seed#[50577A9902B29581]) [n: c: s: r: x:collection1 t:] o.a.s.u.p.LogUpdateProcessorFactory webapp=null path=null params={}{add=[3]} 0 0
2> 47917 INFO (TEST-TestGroupingSearch.testGroupingOnDateField-seed#[50577A9902B29581]) [n: c: s: r: x:collection1 t:] o.a.s.u.p.LogUpdateProcessorFactory webapp=null path=null params={}{add=[4]} 0 0
2> 47917 INFO (TEST-TestGroupingSearch.testGroupingOnDateField-seed#[50577A9902B29581]) [n: c: s: r: x:collection1 t:] o.a.s.u.p.LogUpdateProcessorFactory webapp=null path=null params={}{add=[5]} 0 0
2> 47923 INFO (searcherExecutor-326-thread-1-processing-collection1) [n: c: s: r: x:collection1 t:] o.a.s.c.SolrCore Registered new searcher autowarm time: 0 ms
2> 47923 INFO (TEST-TestGroupingSearch.testGroupingOnDateField-seed#[50577A9902B29581]) [n: c: s: r: x:collection1 t:] o.a.s.u.p.LogUpdateProcessorFactory webapp=null path=null params={}{commit=} 0 5
2> 47925 INFO (TEST-TestGroupingSearch.testGroupingOnDateField-seed#[50577A9902B29581]) [n: c: s: r: x: t:] o.a.s.c.S.Request webapp=null path=null params={q=*:*&group.limit=10&group=true&fl=id&group.ngroups=true&group.field=date_dt&sort=id+asc} hits=5 status=0 QTime=1
2> 47926 INFO (TEST-TestGroupingSearch.testGroupingOnDateField-seed#[50577A9902B29581]) [n: c: s: r: x: t:] o.a.s.SolrTestCaseJ4 ###Ending testGroupingOnDateField
2> 47930 INFO (TEST-TestGroupingSearch.testGroupAPI-seed#[50577A9902B29581]) [n: c: s: r: x: t:] o.a.s.SolrTestCaseJ4 ###Starting testGroupAPI
2> 47931 INFO (TEST-TestGroupingSearch.testGroupAPI-seed#[50577A9902B29581]) [n: c: s: r: x:collection1 t:] o.a.s.u.DirectUpdateHandler2 REMOVING ALL DOCUMENTS FROM INDEX
2> 47931 INFO (TEST-TestGroupingSearch.testGroupAPI-seed#[50577A9902B29581]) [n: c: s: r: x:collection1 t:] o.a.s.u.p.LogUpdateProcessorFactory webapp=null path=null params={}{deleteByQuery=*:*} 0 0
2> 47934 INFO (searcherExecutor-326-thread-1-processing-collection1) [n: c: s: r: x:collection1 t:] o.a.s.c.SolrCore Registered new searcher autowarm time: 0 ms
2> 47935 INFO (TEST-TestGroupingSearch.testGroupAPI-seed#[50577A9902B29581]) [n: c: s: r: x:collection1 t:] o.a.s.u.p.LogUpdateProcessorFactory webapp=null path=null params={}{commit=} 0 4
2> 47936 INFO (TEST-TestGroupingSearch.testGroupAPI-seed#[50577A9902B29581]) [n: c: s: r: x:collection1 t:] o.a.s.u.p.LogUpdateProcessorFactory webapp=null path=null params={}{add=[1]} 0 0
2> 47936 INFO (TEST-TestGroupingSearch.testGroupAPI-seed#[50577A9902B29581]) [n: c: s: r: x:collection1 t:] o.a.s.u.p.LogUpdateProcessorFactory webapp=null path=null params={}{add=[2]} 0 0
2> 47937 INFO (TEST-TestGroupingSearch.testGroupAPI-seed#[50577A9902B29581]) [n: c: s: r: x:collection1 t:] o.a.s.u.p.LogUpdateProcessorFactory webapp=null path=null params={}{add=[3]} 0 0
2> 47942 INFO (searcherExecutor-326-thread-1-processing-collection1) [n: c: s: r: x:collection1 t:] o.a.s.c.SolrCore Registered new searcher autowarm time: 0 ms
2> 47943 INFO (TEST-TestGroupingSearch.testGroupAPI-seed#[50577A9902B29581]) [n: c: s: r: x:collection1 t:] o.a.s.u.p.LogUpdateProcessorFactory webapp=null path=null params={}{commit=} 0 5
2> 47943 INFO (TEST-TestGroupingSearch.testGroupAPI-seed#[50577A9902B29581]) [n: c: s: r: x:collection1 t:] o.a.s.u.p.LogUpdateProcessorFactory webapp=null path=null params={}{add=[4]} 0 0
2> 47944 INFO (TEST-TestGroupingSearch.testGroupAPI-seed#[50577A9902B29581]) [n: c: s: r: x:collection1 t:] o.a.s.u.p.LogUpdateProcessorFactory webapp=null path=null params={}{add=[5]} 0 0
2> 47944 INFO (TEST-TestGroupingSearch.testGroupAPI-seed#[50577A9902B29581]) [n: c: s: r: x:collection1 t:] o.a.s.u.p.LogUpdateProcessorFactory webapp=null path=null params={}{add=[6]} 0 0
2> 47945 INFO (TEST-TestGroupingSearch.testGroupAPI-seed#[50577A9902B29581]) [n: c: s: r: x:collection1 t:] o.a.s.u.p.LogUpdateProcessorFactory webapp=null path=null params={}{add=[7]} 0 0
2> 47950 INFO (searcherExecutor-326-thread-1-processing-collection1) [n: c: s: r: x:collection1 t:] o.a.s.c.SolrCore Registered new searcher autowarm time: 0 ms
2> 47951 INFO (TEST-TestGroupingSearch.testGroupAPI-seed#[50577A9902B29581]) [n: c: s: r: x:collection1 t:] o.a.s.u.p.LogUpdateProcessorFactory webapp=null path=null params={}{commit=} 0 5
2> 47951 INFO (TEST-TestGroupingSearch.testGroupAPI-seed#[50577A9902B29581]) [n: c: s: r: x:collection1 t:] o.a.s.u.p.LogUpdateProcessorFactory webapp=null path=null params={}{add=[8]} 0 0
2> 47952 INFO (TEST-TestGroupingSearch.testGroupAPI-seed#[50577A9902B29581]) [n: c: s: r: x:collection1 t:] o.a.s.u.p.LogUpdateProcessorFactory webapp=null path=null params={}{add=[9]} 0 0
2> 47958 INFO (searcherExecutor-326-thread-1-processing-collection1) [n: c: s: r: x:collection1 t:] o.a.s.c.SolrCore Registered new searcher autowarm time: 0 ms
2> 47958 INFO (TEST-TestGroupingSearch.testGroupAPI-seed#[50577A9902B29581]) [n: c: s: r: x:collection1 t:] o.a.s.u.p.LogUpdateProcessorFactory webapp=null path=null params={}{commit=} 0 5
2> 47959 INFO (TEST-TestGroupingSearch.testGroupAPI-seed#[50577A9902B29581]) [n: c: s: r: x:collection1 t:] o.a.s.u.p.LogUpdateProcessorFactory webapp=null path=null params={}{add=[10]} 0 0
2> 47965 INFO (searcherExecutor-326-thread-1-processing-collection1) [n: c: s: r: x:collection1 t:] o.a.s.c.SolrCore Registered new searcher autowarm time: 0 ms
2> 47965 INFO (TEST-TestGroupingSearch.testGroupAPI-seed#[50577A9902B29581]) [n: c: s: r: x:collection1 t:] o.a.s.u.p.LogUpdateProcessorFactory webapp=null path=null params={}{commit=} 0 5
2> 47966 INFO (TEST-TestGroupingSearch.testGroupAPI-seed#[50577A9902B29581]) [n: c: s: r: x: t:] o.a.s.c.S.Request webapp=null path=null params={q={!func}foo2_i&fq=foo_i:[*+TO+*]&wt=xml&group.field=foo_i&group=true} hits=10 status=0 QTime=0
2> 47967 INFO (TEST-TestGroupingSearch.testGroupAPI-seed#[50577A9902B29581]) [n: c: s: r: x: t:] o.a.s.c.S.Request webapp=null path=null params={q={!func}foo2_i&fl=id&fq=foo_i:[*+TO+*]&wt=xml&group.field=foo_i&group=true} hits=10 status=0 QTime=0
2> 47979 INFO (TEST-TestGroupingSearch.testGroupAPI-seed#[50577A9902B29581]) [n: c: s: r: x: t:] o.a.s.c.S.Request webapp=null path=null params={q={!func}foo2_i&fl=id&fq=foo_i:[*+TO+*]&fq=foo_i:2&wt=xml&group.field=foo_i&group=true} hits=3 status=0 QTime=11
2> 47980 INFO (TEST-TestGroupingSearch.testGroupAPI-seed#[50577A9902B29581]) [n: c: s: r: x: t:] o.a.s.c.S.Request webapp=null path=null params={q={!func}foo2_i&fl=id&fq=foo_i:[*+TO+*]&rows=2&wt=xml&group.field=foo_i&group=true} hits=10 status=0 QTime=0
2> 47981 INFO (TEST-TestGroupingSearch.testGroupAPI-seed#[50577A9902B29581]) [n: c: s: r: x: t:] o.a.s.c.S.Request webapp=null path=null params={q={!func}foo2_i&fl=id&start=1&fq=foo_i:[*+TO+*]&rows=1&wt=xml&group.field=foo_i&group=true} hits=10 status=0 QTime=0
2> 47981 INFO (TEST-TestGroupingSearch.testGroupAPI-seed#[50577A9902B29581]) [n: c: s: r: x: t:] o.a.s.c.S.Request webapp=null path=null params={q={!func}foo2_i&fl=id&start=100&fq=foo_i:[*+TO+*]&rows=1&wt=xml&group.field=foo_i&group=true} hits=10 status=0 QTime=0
2> 47982 INFO (TEST-TestGroupingSearch.testGroupAPI-seed#[50577A9902B29581]) [n: c: s: r: x: t:] o.a.s.c.S.Request webapp=null path=null params={q={!func}foo2_i&fl=id&group.limit=3&fq=foo_i:[*+TO+*]&rows=2&wt=xml&group.field=foo_i&group=true} hits=10 status=0 QTime=0
2> 47982 INFO (TEST-TestGroupingSearch.testGroupAPI-seed#[50577A9902B29581]) [n: c: s: r: x: t:] o.a.s.c.S.Request webapp=null path=null params={q={!func}foo2_i&fl=id&group.limit=3&fq=foo_i:[*+TO+*]&group.offset=1&rows=2&wt=xml&group.field=foo_i&group=true} hits=10 status=0 QTime=0
2> 47983 INFO (TEST-TestGroupingSearch.testGroupAPI-seed#[50577A9902B29581]) [n: c: s: r: x: t:] o.a.s.c.S.Request webapp=null path=null params={q={!func}foo2_i&fl=id&group.limit=3&fq=foo_i:[*+TO+*]&group.offset=10&rows=2&wt=xml&group.field=foo_i&group=true} hits=10 status=0 QTime=0
2> 47984 INFO (TEST-TestGroupingSearch.testGroupAPI-seed#[50577A9902B29581]) [n: c: s: r: x: t:] o.a.s.c.S.Request webapp=null path=null params={q={!func}foo2_i&indent=off&fl=id,score&group.limit=2&fq=foo_i:[*+TO+*]&rows=2&wt=xml&group.field=foo_i&group=true} hits=10 status=0 QTime=0
2> 47985 INFO (TEST-TestGroupingSearch.testGroupAPI-seed#[50577A9902B29581]) [n: c: s: r: x: t:] o.a.s.c.S.Request webapp=null path=null params={q={!func}foo2_i&fl=id&fq=foo_i:[*+TO+*]&group.func=add(foo_i,foo_i)&rows=2&wt=xml&group=true} hits=10 status=0 QTime=0
2> 47986 WARN (TEST-TestGroupingSearch.testGroupAPI-seed#[50577A9902B29581]) [n: c: s: r: x: t:] o.a.s.r.SimpleFacets Raising facet.mincount from 0 to 1, because field foo_i is Points-based.
2> 47986 INFO (TEST-TestGroupingSearch.testGroupAPI-seed#[50577A9902B29581]) [n: c: s: r: x: t:] o.a.s.c.S.Request webapp=null path=null params={q={!func}foo2_i&facet.field=foo_i&fl=id&fq=foo_i:[*+TO+*]&facet=true&wt=xml&group.field=foo_i&group=true} hits=10 status=0 QTime=0
2> 47987 INFO (TEST-TestGroupingSearch.testGroupAPI-seed#[50577A9902B29581]) [n: c: s: r: x: t:] o.a.s.c.S.Request webapp=null path=null params={q={!func}foo2_i&fl=id&fq=foo_i:[*+TO+*]&wt=xml&group.field=foo_i&debugQuery=true&group=true} hits=10 status=0 QTime=0
2> 47989 INFO (TEST-TestGroupingSearch.testGroupAPI-seed#[50577A9902B29581]) [n: c: s: r: x: t:] o.a.s.c.S.Request webapp=null path=null params={q={!func}foo2_i&fl=id&group.limit=3&fq=foo_i:[*+TO+*]&group.query=id:[2+TO+5]&wt=xml&group=true} hits=10 status=0 QTime=0
2> 47989 INFO (TEST-TestGroupingSearch.testGroupAPI-seed#[50577A9902B29581]) [n: c: s: r: x: t:] o.a.s.c.S.Request webapp=null path=null params={q={!func}foo2_i&fl=id&group.limit=3&fq=foo_i:[*+TO+*]&group.query=id:[2+TO+5]&group.query=id:1000&wt=xml&group=true} hits=10 status=0 QTime=0
2> 47990 INFO (TEST-TestGroupingSearch.testGroupAPI-seed#[50577A9902B29581]) [n: c: s: r: x: t:] o.a.s.c.S.Request webapp=null path=null params={q={!func}foo2_i&indent=off&fl=id,score&group.limit=2&fq=foo_i:[*+TO+*]&sort=foo_i+desc,+score+desc&group.query=foo_i:1&rows=2&wt=xml&group=true} hits=10 status=0 QTime=0
2> 47991 INFO (TEST-TestGroupingSearch.testGroupAPI-seed#[50577A9902B29581]) [n: c: s: r: x: t:] o.a.s.c.S.Request webapp=null path=null params={q={!func}foo2_i&indent=off&fl=id,score&group.limit=2&fq=foo_i:[*+TO+*]&sort=score+desc&group.query=foo_i:1&rows=2&wt=xml&group=true} hits=10 status=0 QTime=0
2> 47991 INFO (TEST-TestGroupingSearch.testGroupAPI-seed#[50577A9902B29581]) [n: c: s: r: x: t:] o.a.s.c.S.Request webapp=null path=null params={q={!func}foo2_i&indent=off&fl=id&group.limit=2&fq=foo_i:[*+TO+*]&group.query=foo_i:1&rows=2&wt=xml&group=true} hits=10 status=0 QTime=0
2> 47992 INFO (TEST-TestGroupingSearch.testGroupAPI-seed#[50577A9902B29581]) [n: c: s: r: x: t:] o.a.s.c.S.Request webapp=null path=null params={q={!func}foo2_i&fl=id&group.limit=3&fq=foo_i:[*+TO+*]&group.offset=2&group.query=id:[2+TO+5]&wt=xml&group=true} hits=10 status=0 QTime=0
2> 47992 INFO (TEST-TestGroupingSearch.testGroupAPI-seed#[50577A9902B29581]) [n: c: s: r: x: t:] o.a.s.c.S.Request webapp=null path=null params={q={!func}foo2_i&fl=id&group.limit=3&fq=foo_i:[*+TO+*]&group.offset=10&group.query=id:[2+TO+5]&wt=xml&group=true} hits=10 status=0 QTime=0
2> 47993 INFO (TEST-TestGroupingSearch.testGroupAPI-seed#[50577A9902B29581]) [n: c: s: r: x: t:] o.a.s.c.S.Request webapp=null path=null params={q={!func}foo2_i&group.main=true&fl=id&fq=foo_i:[*+TO+*]&group.query=id:[2+TO+5]&rows=3&wt=xml&group=true} hits=4 status=0 QTime=0
2> 47993 INFO (TEST-TestGroupingSearch.testGroupAPI-seed#[50577A9902B29581]) [n: c: s: r: x: t:] o.a.s.c.S.Request webapp=null path=null params={q={!func}foo2_i&group.main=true&fl=id&start=2&fq=foo_i:[*+TO+*]&group.query=id:[2+TO+5]&rows=3&wt=xml&group=true} hits=4 status=0 QTime=0
2> 47994 INFO (TEST-TestGroupingSearch.testGroupAPI-seed#[50577A9902B29581]) [n: c: s: r: x: t:] o.a.s.c.S.Request webapp=null path=null params={q={!func}foo2_i&group.main=true&fl=id&start=10&fq=foo_i:[*+TO+*]&group.query=id:[2+TO+5]&rows=3&wt=xml&group=true} hits=4 status=0 QTime=0
2> 47994 INFO (TEST-TestGroupingSearch.testGroupAPI-seed#[50577A9902B29581]) [n: c: s: r: x: t:] o.a.s.c.S.Request webapp=null path=null params={q={!func}foo2_i&fl=id&group.limit=2&fq=foo_i:[*+TO+*]&group.query=id:[2+TO+5]&group.query=id:[5+TO+5]&rows=1&wt=xml&group.field=foo_i&group=true} hits=10 status=0 QTime=0
2> 47995 INFO (TEST-TestGroupingSearch.testGroupAPI-seed#[50577A9902B29581]) [n: c: s: r: x: t:] o.a.s.c.S.Request webapp=null path=null params={q={!func}foo2_i&group.main=true&fl=id&fq=foo_i:[*+TO+*]&wt=xml&group.field=foo_i&group=true} hits=10 status=0 QTime=0
2> 47996 INFO (TEST-TestGroupingSearch.testGroupAPI-seed#[50577A9902B29581]) [n: c: s: r: x: t:] o.a.s.c.S.Request webapp=null path=null params={q={!func}foo2_i&group.main=true&fl=id&fq=foo_i:[*+TO+*]&rows=3&wt=xml&group.field=foo_i&group=true} hits=10 status=0 QTime=0
2> 47996 INFO (TEST-TestGroupingSearch.testGroupAPI-seed#[50577A9902B29581]) [n: c: s: r: x: t:] o.a.s.c.S.Request webapp=null path=null params={q={!func}foo2_i&group.main=true&fl=id&start=1&fq=foo_i:[*+TO+*]&rows=2&wt=xml&group.field=foo_i&group=true} hits=10 status=0 QTime=0
2> 47997 INFO (TEST-TestGroupingSearch.testGroupAPI-seed#[50577A9902B29581]) [n: c: s: r: x: t:] o.a.s.c.S.Request webapp=null path=null params={q={!func}foo2_i&group.main=true&fl=id&start=20&fq=foo_i:[*+TO+*]&rows=2&wt=xml&group.field=foo_i&group=true} hits=10 status=0 QTime=0
2> 47997 INFO (TEST-TestGroupingSearch.testGroupAPI-seed#[50577A9902B29581]) [n: c: s: r: x: t:] o.a.s.c.S.Request webapp=null path=null params={q={!func}foo2_i&group.main=true&fl=id&group.limit=2&fq=foo_i:[*+TO+*]&rows=3&wt=xml&group.field=foo_i&group=true} hits=10 status=0 QTime=0
2> 47998 INFO (TEST-TestGroupingSearch.testGroupAPI-seed#[50577A9902B29581]) [n: c: s: r: x: t:] o.a.s.c.S.Request webapp=null path=null params={q={!func}foo2_i&group.main=true&fl=id&group.limit=2&start=1&fq=foo_i:[*+TO+*]&rows=3&wt=xml&group.field=foo_i&group=true} hits=10 status=0 QTime=0
2> 47998 INFO (TEST-TestGroupingSearch.testGroupAPI-seed#[50577A9902B29581]) [n: c: s: r: x: t:] o.a.s.c.S.Request webapp=null path=null params={q={!func}foo2_i&group.format=simple&fl=id&group.limit=2&start=1&fq=foo_i:[*+TO+*]&rows=3&wt=xml&group.field=foo_i&group=true} hits=10 status=0 QTime=0
2> 47999 INFO (TEST-TestGroupingSearch.testGroupAPI-seed#[50577A9902B29581]) [n: c: s: r: x: t:] o.a.s.c.S.Request webapp=null path=null params={q=bogus_s:nothing&group.format=simple&fl=id&group.limit=2&fq=foo_i:[*+TO+*]&wt=xml&group.field=foo_i&group=true} hits=0 status=0 QTime=0
2> 47999 INFO (TEST-TestGroupingSearch.testGroupAPI-seed#[50577A9902B29581]) [n: c: s: r: x: t:] o.a.s.c.S.Request webapp=null path=null params={q=bogus_s:nothing&fl=id&group.limit=2&fq=foo_i:[*+TO+*]&group.query=id:[2+TO+5]&group.query=id:[5+TO+5]&rows=1&wt=xml&group.field=foo_i&group=true} hits=0 status=0 QTime=0
2> 48000 INFO (TEST-TestGroupingSearch.testGroupAPI-seed#[50577A9902B29581]) [n: c: s: r: x: t:] o.a.s.c.S.Request webapp=null path=null params={q=bogus_s:nothing&fl=id&group.limit=3&fq=foo_i:[*+TO+*]&group.query=id:[2+TO+5]&group.query=id:1000&wt=xml&group=true} hits=0 status=0 QTime=0
2> 48000 INFO (TEST-TestGroupingSearch.testGroupAPI-seed#[50577A9902B29581]) [n: c: s: r: x: t:] o.a.s.SolrTestCaseJ4 ###Ending testGroupAPI
2> 48005 INFO (TEST-TestGroupingSearch.testGroupingSortByFunction-seed#[50577A9902B29581]) [n: c: s: r: x: t:] o.a.s.SolrTestCaseJ4 ###Starting testGroupingSortByFunction
2> 48005 INFO (TEST-TestGroupingSearch.testGroupingSortByFunction-seed#[50577A9902B29581]) [n: c: s: r: x:collection1 t:] o.a.s.u.DirectUpdateHandler2 REMOVING ALL DOCUMENTS FROM INDEX
2> 48005 INFO (TEST-TestGroupingSearch.testGroupingSortByFunction-seed#[50577A9902B29581]) [n: c: s: r: x:collection1 t:] o.a.s.u.p.LogUpdateProcessorFactory webapp=null path=null params={}{deleteByQuery=*:*} 0 0
2> 48009 INFO (searcherExecutor-326-thread-1-processing-collection1) [n: c: s: r: x:collection1 t:] o.a.s.c.SolrCore Registered new searcher autowarm time: 0 ms
2> 48010 INFO (TEST-TestGroupingSearch.testGroupingSortByFunction-seed#[50577A9902B29581]) [n: c: s: r: x:collection1 t:] o.a.s.u.p.LogUpdateProcessorFactory webapp=null path=null params={}{commit=} 0 5
2> 48021 INFO (TEST-TestGroupingSearch.testGroupingSortByFunction-seed#[50577A9902B29581]) [n: c: s: r: x:collection1 t:] o.a.s.u.p.LogUpdateProcessorFactory webapp=null path=null params={}{add=[1]} 0 10
2> 48022 INFO (TEST-TestGroupingSearch.testGroupingSortByFunction-seed#[50577A9902B29581]) [n: c: s: r: x:collection1 t:] o.a.s.u.p.LogUpdateProcessorFactory webapp=null path=null params={}{add=[2]} 0 0
2> 48022 INFO (TEST-TestGroupingSearch.testGroupingSortByFunction-seed#[50577A9902B29581]) [n: c: s: r: x:collection1 t:] o.a.s.u.p.LogUpdateProcessorFactory webapp=null path=null params={}{add=[3]} 0 0
2> 48023 INFO (TEST-TestGroupingSearch.testGroupingSortByFunction-seed#[50577A9902B29581]) [n: c: s: r: x:collection1 t:] o.a.s.u.p.LogUpdateProcessorFactory webapp=null path=null params={}{add=[4]} 0 0
2> 48023 INFO (TEST-TestGroupingSearch.testGroupingSortByFunction-seed#[50577A9902B29581]) [n: c: s: r: x:collection1 t:] o.a.s.u.p.LogUpdateProcessorFactory webapp=null path=null params={}{add=[5]} 0 0
2> 48031 INFO (searcherExecutor-326-thread-1-processing-collection1) [n: c: s: r: x:collection1 t:] o.a.s.c.SolrCore Registered new searcher autowarm time: 0 ms
2> 48031 INFO (TEST-TestGroupingSearch.testGroupingSortByFunction-seed#[50577A9902B29581]) [n: c: s: r: x:collection1 t:] o.a.s.u.p.LogUpdateProcessorFactory webapp=null path=null params={}{commit=} 0 8
2> 48032 INFO (TEST-TestGroupingSearch.testGroupingSortByFunction-seed#[50577A9902B29581]) [n: c: s: r: x: t:] o.a.s.c.S.Request webapp=null path=null params={q=*:*&fl=id&sort=sum(value1_i,+value2_i)+desc&rows=1&wt=xml&group.field=id&group=true} hits=5 status=0 QTime=0
2> 48067 INFO (TEST-TestGroupingSearch.testGroupingSortByFunction-seed#[50577A9902B29581]) [n: c: s: r: x: t:] o.a.s.c.S.Request webapp=null path=null params={q=*:*&fl=id&sort=geodist(45.18014,-93.87742)+asc&sfield=store&rows=1&wt=xml&group.field=id&group=true} hits=5 status=0 QTime=34
2> 48068 INFO (TEST-TestGroupingSearch.testGroupingSortByFunction-seed#[50577A9902B29581]) [n: c: s: r: x: t:] o.a.s.SolrTestCaseJ4 ###Ending testGroupingSortByFunction
2> 48072 INFO (TEST-TestGroupingSearch.testRandomGrouping-seed#[50577A9902B29581]) [n: c: s: r: x: t:] o.a.s.SolrTestCaseJ4 ###Starting testRandomGrouping
2> 48072 INFO (TEST-TestGroupingSearch.testRandomGrouping-seed#[50577A9902B29581]) [n: c: s: r: x:collection1 t:] o.a.s.u.DirectUpdateHandler2 REMOVING ALL DOCUMENTS FROM INDEX
2> 48072 INFO (TEST-TestGroupingSearch.testRandomGrouping-seed#[50577A9902B29581]) [n: c: s: r: x:collection1 t:] o.a.s.u.p.LogUpdateProcessorFactory webapp=null path=null params={}{deleteByQuery=*:*} 0 0
2> 48076 INFO (searcherExecutor-326-thread-1-processing-collection1) [n: c: s: r: x:collection1 t:] o.a.s.c.SolrCore Registered new searcher autowarm time: 0 ms
2> 48077 INFO (TEST-TestGroupingSearch.testRandomGrouping-seed#[50577A9902B29581]) [n: c: s: r: x:collection1 t:] o.a.s.u.p.LogUpdateProcessorFactory webapp=null path=null params={}{commit=} 0 3
2> 48082 INFO (TEST-TestGroupingSearch.testRandomGrouping-seed#[50577A9902B29581]) [n: c: s: r: x: t:] o.a.s.u.DirectUpdateHandler2 REMOVING ALL DOCUMENTS FROM INDEX
2> 48082 INFO (TEST-TestGroupingSearch.testRandomGrouping-seed#[50577A9902B29581]) [n: c: s: r: x: t:] o.a.s.u.p.LogUpdateProcessorFactory webapp=null path=null params={_version_=-9223372036854775807&update.distrib=FROMLEADER&versions=true&wt=json&indent=true}{deleteByQuery=*:*} 0 4
2> 48083 INFO (TEST-TestGroupingSearch.testRandomGrouping-seed#[50577A9902B29581]) [n: c: s: r: x: t:] o.a.s.u.p.LogUpdateProcessorFactory webapp=null path=null params={wt=json&indent=true}{add=[UIXQ]} 0 0
2> 48084 INFO (TEST-TestGroupingSearch.testRandomGrouping-seed#[50577A9902B29581]) [n: c: s: r: x: t:] o.a.s.u.p.LogUpdateProcessorFactory webapp=null path=null params={wt=json&indent=true}{add=[UIXQ]} 0 0
2> 48084 INFO (TEST-TestGroupingSearch.testRandomGrouping-seed#[50577A9902B29581]) [n: c: s: r: x: t:] o.a.s.u.p.LogUpdateProcessorFactory webapp=null path=null params={wt=json&indent=true}{add=[GRKL]} 0 0
2> 48085 INFO (TEST-TestGroupingSearch.testRandomGrouping-seed#[50577A9902B29581]) [n: c: s: r: x: t:] o.a.s.u.p.LogUpdateProcessorFactory webapp=null path=null params={wt=json&indent=true}{add=[DJAT]} 0 0
2> 48085 INFO (TEST-TestGroupingSearch.testRandomGrouping-seed#[50577A9902B29581]) [n: c: s: r: x: t:] o.a.s.u.p.LogUpdateProcessorFactory webapp=null path=null params={wt=json&indent=true}{add=[ZEGP]} 0 0
2> 48085 INFO (TEST-TestGroupingSearch.testRandomGrouping-seed#[50577A9902B29581]) [n: c: s: r: x: t:] o.a.s.u.p.LogUpdateProcessorFactory webapp=null path=null params={wt=json&indent=true}{add=[BCZE]} 0 0
2> 48086 INFO (TEST-TestGroupingSearch.testRandomGrouping-seed#[50577A9902B29581]) [n: c: s: r: x: t:] o.a.s.u.p.LogUpdateProcessorFactory webapp=null path=null params={wt=json&indent=true}{add=[YPQJ]} 0 0
2> 48086 INFO (TEST-TestGroupingSearch.testRandomGrouping-seed#[50577A9902B29581]) [n: c: s: r: x: t:] o.a.s.u.p.LogUpdateProcessorFactory webapp=null path=null params={wt=json&indent=true}{add=[AJRE]} 0 0
2> 48086 INFO (TEST-TestGroupingSearch.testRandomGrouping-seed#[50577A9902B29581]) [n: c: s: r: x: t:] o.a.s.u.p.LogUpdateProcessorFactory webapp=null path=null params={wt=json&indent=true}{add=[HERJ]} 0 0
2> 48087 INFO (TEST-TestGroupingSearch.testRandomGrouping-seed#[50577A9902B29581]) [n: c: s: r: x: t:] o.a.s.u.p.LogUpdateProcessorFactory webapp=null path=null params={wt=json&indent=true}{add=[PEFR]} 0 0
2> 48094 INFO (searcherExecutor-326-thread-1-processing-collection1) [n: c: s: r: x:collection1 t:] o.a.s.c.SolrCore Registered new searcher autowarm time: 0 ms
2> 48094 INFO (TEST-TestGroupingSearch.testRandomGrouping-seed#[50577A9902B29581]) [n: c: s: r: x:collection1 t:] o.a.s.u.p.LogUpdateProcessorFactory webapp=null path=null params={}{commit=} 0 6
2> 48095 INFO (TEST-TestGroupingSearch.testRandomGrouping-seed#[50577A9902B29581]) [n: c: s: r: x: t:] o.a.s.u.p.LogUpdateProcessorFactory webapp=null path=null params={wt=json&indent=true}{add=[CETU]} 0 0
2> 48095 INFO (TEST-TestGroupingSearch.testRandomGrouping-seed#[50577A9902B29581]) [n: c: s: r: x: t:] o.a.s.u.p.LogUpdateProcessorFactory webapp=null path=null params={wt=json&indent=true}{add=[PEXP]} 0 0
2> 48096 INFO (TEST-TestGroupingSearch.testRandomGrouping-seed#[50577A9902B29581]) [n: c: s: r: x: t:] o.a.s.u.p.LogUpdateProcessorFactory webapp=null path=null params={wt=json&indent=true}{add=[TKTE]} 0 0
2> 48096 INFO (TEST-TestGroupingSearch.testRandomGrouping-seed#[50577A9902B29581]) [n: c: s: r: x: t:] o.a.s.u.p.LogUpdateProcessorFactory webapp=null path=null params={wt=json&indent=true}{add=[LXVO]} 0 0
2> 48103 INFO (searcherExecutor-326-thread-1-processing-collection1) [n: c: s: r: x:collection1 t:] o.a.s.c.SolrCore Registered new searcher autowarm time: 0 ms
2> 48103 INFO (TEST-TestGroupingSearch.testRandomGrouping-seed#[50577A9902B29581]) [n: c: s: r: x:collection1 t:] o.a.s.u.p.LogUpdateProcessorFactory webapp=null path=null params={}{commit=} 0 6
2> 48104 INFO (TEST-TestGroupingSearch.testRandomGrouping-seed#[50577A9902B29581]) [n: c: s: r: x: t:] o.a.s.u.p.LogUpdateProcessorFactory webapp=null path=null params={wt=json&indent=true}{add=[FJEU]} 0 0
2> 48104 INFO (TEST-TestGroupingSearch.testRandomGrouping-seed#[50577A9902B29581]) [n: c: s: r: x: t:] o.a.s.u.p.LogUpdateProcessorFactory webapp=null path=null params={wt=json&indent=true}{add=[OIMS]} 0 0
2> 48110 INFO (searcherExecutor-326-thread-1-processing-collection1) [n: c: s: r: x:collection1 t:] o.a.s.c.SolrCore Registered new searcher autowarm time: 0 ms
2> 48111 INFO (TEST-TestGroupingSearch.testRandomGrouping-seed#[50577A9902B29581]) [n: c: s: r: x:collection1 t:] o.a.s.u.p.LogUpdateProcessorFactory webapp=null path=null params={}{commit=} 0 6
2> 48112 INFO (TEST-TestGroupingSearch.testRandomGrouping-seed#[50577A9902B29581]) [n: c: s: r: x: t:] o.a.s.c.S.Request webapp=null path=null params={q=*:*&indent=true&fl=id&sort=_docid_+asc&rows=30&wt=json} hits=15 status=0 QTime=0
2> 48116 WARN (TEST-TestGroupingSearch.testRandomGrouping-seed#[50577A9902B29581]) [n: c: s: r: x: t:] o.a.s.s.Grouping The gr
[...truncated too long message...]
ection1 t:] o.a.s.u.p.LogUpdateProcessorFactory webapp=null path=null params={}{commit=} 0 6
2> 49596 INFO (TEST-TestGroupingSearch.testGroupingGroupedBasedFaceting-seed#[50577A9902B29581]) [n: c: s: r: x:collection1 t:] o.a.s.u.p.LogUpdateProcessorFactory webapp=null path=null params={}{add=[3]} 0 0
2> 49596 INFO (TEST-TestGroupingSearch.testGroupingGroupedBasedFaceting-seed#[50577A9902B29581]) [n: c: s: r: x:collection1 t:] o.a.s.u.p.LogUpdateProcessorFactory webapp=null path=null params={}{add=[4]} 0 0
2> 49597 INFO (TEST-TestGroupingSearch.testGroupingGroupedBasedFaceting-seed#[50577A9902B29581]) [n: c: s: r: x:collection1 t:] o.a.s.u.p.LogUpdateProcessorFactory webapp=null path=null params={}{add=[5]} 0 0
2> 49603 INFO (searcherExecutor-326-thread-1-processing-testNode-935 collection1) [n: c: s: r: x:collection1 t:] o.a.s.c.SolrCore Registered new searcher autowarm time: 0 ms
2> 49604 INFO (TEST-TestGroupingSearch.testGroupingGroupedBasedFaceting-seed#[50577A9902B29581]) [n: c: s: r: x:collection1 t:] o.a.s.u.p.LogUpdateProcessorFactory webapp=null path=null params={}{commit=} 0 6
2> 49605 INFO (TEST-TestGroupingSearch.testGroupingGroupedBasedFaceting-seed#[50577A9902B29581]) [n: c: s: r: x: t:] o.a.s.c.S.Request webapp=null path=null params={q=*:*&facet.field=value3_s1&group.truncate=false&fl=id&sort=value2_i+asc&rows=1&facet=true&wt=xml&group.field=value1_s1&group=true} hits=5 status=0 QTime=1
2> 49606 INFO (TEST-TestGroupingSearch.testGroupingGroupedBasedFaceting-seed#[50577A9902B29581]) [n: c: s: r: x: t:] o.a.s.c.S.Request webapp=null path=null params={q=*:*&facet.field=value3_s1&group.truncate=true&fl=id&sort=value2_i+asc&rows=1&facet=true&wt=xml&group.field=value1_s1&group=true} hits=5 status=0 QTime=0
2> 49607 INFO (TEST-TestGroupingSearch.testGroupingGroupedBasedFaceting-seed#[50577A9902B29581]) [n: c: s: r: x: t:] o.a.s.c.S.Request webapp=null path=null params={q=*:*&facet.field=value3_s1&group.truncate=true&fl=id&sort=value2_i+asc&group.func=strdist(1,value1_s1,edit)&rows=1&facet=true&wt=xml&group=true} hits=5 status=0 QTime=1
2> 49608 INFO (TEST-TestGroupingSearch.testGroupingGroupedBasedFaceting-seed#[50577A9902B29581]) [n: c: s: r: x: t:] o.a.s.c.S.Request webapp=null path=null params={q=*:*&facet.field=value3_s1&group.truncate=true&fl=id&rows=1&facet=true&wt=xml&group.field=value4_i&group=true} hits=5 status=0 QTime=0
2> 49608 INFO (TEST-TestGroupingSearch.testGroupingGroupedBasedFaceting-seed#[50577A9902B29581]) [n: c: s: r: x: t:] o.a.s.c.S.Request webapp=null path=null params={q=*:*&facet.field={!ex%3Dv}value3_s1&group.truncate=true&fl=id&fq={!tag%3Dv}value3_s1:b&rows=1&facet=true&wt=xml&group.field=value4_i&group=true} hits=2 status=0 QTime=0
2> 49609 INFO (TEST-TestGroupingSearch.testGroupingGroupedBasedFaceting-seed#[50577A9902B29581]) [n: c: s: r: x: t:] o.a.s.c.S.Request webapp=null path=null params={q=*:*&facet.field={!ex%3Dv}value3_s1&group.truncate=false&fl=id&fq={!tag%3Dv}value3_s1:b&rows=1&facet=true&wt=xml&group.field=value4_i&group=true} hits=2 status=0 QTime=0
2> 49610 INFO (TEST-TestGroupingSearch.testGroupingGroupedBasedFaceting-seed#[50577A9902B29581]) [n: c: s: r: x: t:] o.a.s.c.S.Request webapp=null path=null params={q=*:*&facet.field={!ex%3Dv}value3_s1&group.truncate=true&fl=id&group.func=sub(value4_i,1)&fq={!tag%3Dv}value3_s1:b&rows=1&facet=true&wt=xml&group=true} hits=2 status=0 QTime=0
2> 49611 INFO (TEST-TestGroupingSearch.testGroupingGroupedBasedFaceting-seed#[50577A9902B29581]) [n: c: s: r: x: t:] o.a.s.SolrTestCaseJ4 ###Ending testGroupingGroupedBasedFaceting
2> 49611 INFO (SUITE-TestGroupingSearch-seed#[50577A9902B29581]-worker) [n: c: s: r: x: t:] o.a.s.SolrTestCaseJ4 ###deleteCore
2> 49611 INFO (SUITE-TestGroupingSearch-seed#[50577A9902B29581]-worker) [n: c: s: r: x: t:] o.a.s.c.CoreContainer Shutting down CoreContainer instance=284349108
2> 49611 INFO (coreCloseExecutor-331-thread-1-processing-testNode-935) [n: c: s: r: x:collection1 t:] o.a.s.c.SolrCore CLOSING SolrCore org.apache.solr.core.SolrCore@48661a0d collection1
2> 49612 INFO (coreCloseExecutor-331-thread-1-processing-testNode-935) [n: c: s: r: x:collection1 t:] o.a.s.m.SolrMetricManager Closing metric reporters for registry=solr.core.collection1 tag=SolrCore@48661a0d
2> 49628 INFO (coreCloseExecutor-331-thread-1-processing-testNode-935) [n: c: s: r: x:collection1 t:] o.a.s.u.DirectUpdateHandler2 Committing on IndexWriter.close() ... SKIPPED (unnecessary).
2> 49629 INFO (SUITE-TestGroupingSearch-seed#[50577A9902B29581]-worker) [n: c: s: r: x: t:] o.a.s.m.SolrMetricManager Closing metric reporters for registry=solr.node tag=null
2> 49634 INFO (SUITE-TestGroupingSearch-seed#[50577A9902B29581]-worker) [n: c: s: r: x: t:] o.a.s.m.SolrMetricManager Closing metric reporters for registry=solr.jvm tag=null
2> 49637 INFO (SUITE-TestGroupingSearch-seed#[50577A9902B29581]-worker) [n: c: s: r: x: t:] o.a.s.m.SolrMetricManager Closing metric reporters for registry=solr.jetty tag=null
2> 49640 INFO (SUITE-TestGroupingSearch-seed#[50577A9902B29581]-worker) [n: c: s: r: x: t:] o.a.s.u.ErrorLogMuter Closing ErrorLogMuter-regex-36 after mutting 0 log messages
2> 49640 INFO (SUITE-TestGroupingSearch-seed#[50577A9902B29581]-worker) [n: c: s: r: x: t:] o.a.s.u.ErrorLogMuter Creating ErrorLogMuter-regex-37 for ERROR logs matching regex: ignore_exception
2> NOTE: leaving temporary files on disk at: /home/jenkins/jenkins-slave/workspace/Solr/Solr-Smoketest-9.x/_tmp/smoke_1709799712/unpack/solr-9.6.0/solr/core/build/tmp/tests-tmp/solr.TestGroupingSearch_50577A9902B29581-001
2> NOTE: test params are: codec=Asserting(Lucene99): {}, docValues:{}, maxPointsInLeafNode=1508, maxMBSortInHeap=5.064919131403087, sim=Asserting(RandomSimilarity(queryNorm=false): {}), locale=en-GU, timezone=US/Samoa
2> NOTE: Linux 4.15.0-213-generic amd64/Eclipse Adoptium 11.0.16.1 (64-bit)/cpus=1,threads=1,free=125006592,total=344457216
2> NOTE: All tests run in this JVM: [AnalysisAfterCoreReloadTest, ConvertedLegacyTest, DisMaxRequestHandlerTest, EchoParamsTest, MinimalSchemaTest, SampleTest, SolrTestCaseJ4DeleteCoreTest, TestCrossCoreJoin, TestDistributedGrouping, TestDistributedSearch, TestGroupingSearch]
WARNING: Test org.apache.solr.TestRandomFaceting wrote 11,447,074 bytes of output.
WARNING: Test org.apache.solr.schema.DocValuesTest wrote 11,900,859 bytes of output.
WARNING: Test org.apache.solr.schema.TestCloudSchemaless wrote 13,434,802 bytes of output.
WARNING: Test org.apache.solr.search.facet.TestCloudJSONFacetSKGEquiv wrote 15,401,642 bytes of output.
WARNING: Test org.apache.solr.search.facet.TestCloudJSONFacetSKG wrote 26,722,049 bytes of output.
> Task :solr:solr-ref-guide:test
:solr:solr-ref-guide:test (SUCCESS): 32 test(s)
> Task :solr:solr-ref-guide:wipeTaskTemp
> Task :solr:solrj:compileTestJava
Note: Some input files use or override a deprecated API.
Note: Recompile with -Xlint:deprecation for details.
> Task :solr:solrj:processTestResources
> Task :solr:solrj:testClasses
> Task :solr:solrj:test
> Task :solr:core:test
:solr:core:test (FAILURE): 5003 test(s), 1 failure(s), 217 skipped
5003 tests completed, 1 failed, 217 skipped
> Task :solr:core:test FAILED
> Task :solr:core:wipeTaskTemp
> Task :solr:solrj:test
:solr:solrj:test (SUCCESS): 1168 test(s), 40 skipped
> Task :solr:solrj:wipeTaskTemp
ERROR: The following test(s) have failed:
- org.apache.solr.TestGroupingSearch.testGroupingWithTimeAllowed (:solr:core)
Test output: /home/jenkins/jenkins-slave/workspace/Solr/Solr-Smoketest-9.x/_tmp/smoke_1709799712/unpack/solr-9.6.0/solr/core/build/test-results/test/outputs/OUTPUT-org.apache.solr.TestGroupingSearch.txt
Reproduce with: gradlew :solr:core:test --tests "org.apache.solr.TestGroupingSearch.testGroupingWithTimeAllowed" -Ptests.jvms=2 "-Ptests.jvmargs=-XX:TieredStopAtLevel=1 -XX:+UseParallelGC -XX:ActiveProcessorCount=1 -XX:ReservedCodeCacheSize=120m" -Ptests.seed=50577A9902B29581 -Ptests.badapples=false -Ptests.file.encoding=UTF-8
FAILURE: Build failed with an exception.
* What went wrong:
Execution failed for task ':solr:core:test'.
> There were failing tests. See the results at: file:///home/jenkins/jenkins-slave/workspace/Solr/Solr-Smoketest-9.x/_tmp/smoke_1709799712/unpack/solr-9.6.0/solr/core/build/test-results/test/
BUILD FAILED in 45m 24s
81 actionable tasks: 63 executed, 18 up-to-date
Publishing build scan...
https://ge.apache.org/s/mon7xolxgvpbw
Traceback (most recent call last):
File "dev-tools/scripts/smokeTestRelease.py", line 1196, in <module>
main()
File "dev-tools/scripts/smokeTestRelease.py", line 1123, in main
downloadOnly=c.download_only)
File "dev-tools/scripts/smokeTestRelease.py", line 1184, in smokeTest
unpackAndVerify(java, tmpDir, 'solr-%s-src.tgz' % version, gitRevision, version, testArgs)
File "dev-tools/scripts/smokeTestRelease.py", line 575, in unpackAndVerify
verifyUnpacked(java, artifact, unpackPath, gitRevision, version, testArgs)
File "dev-tools/scripts/smokeTestRelease.py", line 666, in verifyUnpacked
java.run_java11('./gradlew --no-daemon test %s' % testArgs, '%s/test.log' % unpackPath)
File "dev-tools/scripts/smokeTestRelease.py", line 1032, in run_java
run('%s; %s' % (cmd_prefix, cmd), logfile)
File "dev-tools/scripts/smokeTestRelease.py", line 505, in run
raise RuntimeError('command "%s" failed; see log file %s' % (command, logPath))
RuntimeError: command "export JAVA_HOME="/home/jenkins/tools/java/latest11" PATH="/home/jenkins/tools/java/latest11/bin:$PATH" JAVACMD="/home/jenkins/tools/java/latest11/bin/java"; ./gradlew --no-daemon test -Dtests.nightly=false -Dtests.badapples=false " failed; see log file /home/jenkins/jenkins-slave/workspace/Solr/Solr-Smoketest-9.x/_tmp/smoke_1709799712/unpack/solr-9.6.0/test.log
Build step 'Run with timeout' marked build as failure
Email was triggered for: Failure - Any
Sending email for trigger: Failure - Any
[JENKINS] Solr ยป Solr-Smoketest-9.x - Build # 345 - Still Failing!
Posted by Apache Jenkins Server <je...@builds.apache.org>.
Build: https://ci-builds.apache.org/job/Solr/job/Solr-Smoketest-9.x/345/
Log:
Started by timer
Running as SYSTEM
[EnvInject] - Loading node environment variables.
Building remotely on lucene-solr-1 (solr lucene) in workspace /home/jenkins/jenkins-slave/workspace/Solr/Solr-Smoketest-9.x
[WS-CLEANUP] Deleting project workspace...
[WS-CLEANUP] Deferred wipeout is used...
[WS-CLEANUP] Done
The recommended git tool is: NONE
No credentials specified
Cloning the remote Git repository
Cloning repository https://github.com/apache/solr.git
> git init /home/jenkins/jenkins-slave/workspace/Solr/Solr-Smoketest-9.x # timeout=10
Fetching upstream changes from https://github.com/apache/solr.git
> git --version # timeout=10
> git --version # 'git version 2.17.1'
> git fetch --tags --progress -- https://github.com/apache/solr.git +refs/heads/*:refs/remotes/origin/* # timeout=10
> git config remote.origin.url https://github.com/apache/solr.git # timeout=10
> git config --add remote.origin.fetch +refs/heads/*:refs/remotes/origin/* # timeout=10
Avoid second fetch
> git rev-parse origin/branch_9x^{commit} # timeout=10
Checking out Revision 20c4fe3a8a66547d116fe35e2879da35dc08a01a (origin/branch_9x)
> git config core.sparsecheckout # timeout=10
> git checkout -f 20c4fe3a8a66547d116fe35e2879da35dc08a01a # timeout=10
> git branch -a -v --no-abbrev # timeout=10
> git checkout -b branch_9x 20c4fe3a8a66547d116fe35e2879da35dc08a01a # timeout=10
Commit message: "SOLR-17172 Fix the test failure - sometimes execution was faster than 1 ms. (#2338) (#2339)"
> git rev-list --no-walk c373a61be7c58eec81e0aa344f54ce7864a17dd6 # timeout=10
No emails were triggered.
provisioning config files...
copy managed file [gradle.properties] to file:/home/jenkins/jenkins-slave/workspace/Solr/Solr-Smoketest-9.x/gradle.properties
[Gradle] - Launching build.
[Solr-Smoketest-9.x] $ /home/jenkins/jenkins-slave/workspace/Solr/Solr-Smoketest-9.x/gradlew -Dversion.suffix= -Dgradle.user.home=/home/jenkins/jenkins-slave/workspace/Solr/.gradle -Porg.gradle.daemon=false -Pvalidation.git.failOnModified=false --continue clean assembleRelease
Downloading gradle-wrapper.jar from https://raw.githubusercontent.com/gradle/gradle/v8.4.0/gradle/wrapper/gradle-wrapper.jar
To honour the JVM settings for this build a single-use Daemon process will be forked. For more on this, please refer to https://docs.gradle.org/8.4/userguide/gradle_daemon.html#sec:disabling_the_daemon in the Gradle documentation.
Daemon will be stopped at the end of the build
> Task :buildSrc:compileJava
Note: /home/jenkins/jenkins-slave/workspace/Solr/Solr-Smoketest-9.x/buildSrc/src/main/java/org/apache/lucene/gradle/Checksum.java uses or overrides a deprecated API.
Note: Recompile with -Xlint:deprecation for details.
> Task :buildSrc:compileGroovy NO-SOURCE
> Task :buildSrc:processResources NO-SOURCE
> Task :buildSrc:classes
> Task :buildSrc:jar
> Task :clean
> Task :solr:clean UP-TO-DATE
> Task :solr:api:clean
> Task :solr:benchmark:clean
> Task :solr:core:clean
> Task :solr:distribution:clean UP-TO-DATE
> Task :solr:docker:clean UP-TO-DATE
> Task :solr:documentation:clean UP-TO-DATE
> Task :solr:example:clean UP-TO-DATE
> Task :solr:modules:clean UP-TO-DATE
> Task :solr:packaging:clean UP-TO-DATE
> Task :solr:prometheus-exporter:clean
> Task :solr:server:clean
> Task :solr:solr-ref-guide:clean
> Task :solr:solrj:clean
> Task :solr:solrj-streaming:clean
> Task :solr:solrj-zookeeper:clean
> Task :solr:test-framework:clean
> Task :solr:webapp:clean
> Task :solr:modules:analysis-extras:clean
> Task :solr:modules:analytics:clean
> Task :solr:modules:clustering:clean
> Task :solr:modules:extraction:clean
> Task :solr:modules:gcs-repository:clean
> Task :solr:modules:hadoop-auth:clean
> Task :solr:modules:hdfs:clean
> Task :solr:modules:jaegertracer-configurator:clean
> Task :solr:modules:jwt-auth:clean
> Task :solr:modules:langid:clean
> Task :solr:modules:ltr:clean
> Task :solr:modules:opentelemetry:clean
> Task :solr:modules:s3-repository:clean
> Task :solr:modules:scripting:clean
> Task :solr:modules:sql:clean
> Task :mavenLocalClean UP-TO-DATE
> Task :solr-missing-doclet:compileJava
> Task :solr-missing-doclet:processResources NO-SOURCE
> Task :solr-missing-doclet:classes
> Task :solr-missing-doclet:jar
> Task :gitStatus
> Task :checkJdkInternalsExportedToGradle
> Task :solr:api:compileJava
> Task :solr:api:processResources NO-SOURCE
> Task :solr:api:classes
> Task :solr:api:jar
> Task :solr:api:generateMetadataFileForJarsPublication SKIPPED
> Task :solr:api:generatePomFileForJarsPublication
> Task :solr:api:renderJavadoc
> Task :solr:api:javadoc SKIPPED
> Task :solr:api:javadocJar
> Task :solr:api:sourcesJar
> Task :solr:api:signJarsPublication SKIPPED
> Task :solr:api:publishJarsPublicationToBuildRepository
> Task :solr:api:resolve
SLF4J(W): No SLF4J providers were found.
SLF4J(W): Defaulting to no-operation (NOP) logger implementation
SLF4J(W): See https://www.slf4j.org/codes.html#noProviders for further details.
> Task :solr:solrj:openApiGenerate
################################################################################
# Thanks for using OpenAPI Generator. #
# Please consider donation to help us maintain this project ๐ #
# https://opencollective.com/openapi_generator/donate #
################################################################################
Successfully generated code to /home/jenkins/jenkins-slave/workspace/Solr/Solr-Smoketest-9.x/solr/solrj/build/generated/
> Task :spotlessInternalRegisterDependencies
> Task :solr:solrj:generatedSpotlessHelper
> Task :solr:solrj:generatedSpotless
> Task :solr:solrj:compileJava
Note: Some input files use or override a deprecated API.
Note: Recompile with -Xlint:deprecation for details.
> Task :solr:solrj-streaming:compileJava
Note: Some input files use or override a deprecated API.
Note: Recompile with -Xlint:deprecation for details.
> Task :solr:solrj-zookeeper:compileJava
Note: Some input files use or override a deprecated API.
Note: Recompile with -Xlint:deprecation for details.
> Task :solr:core:compileJava
Note: Some input files use or override a deprecated API.
Note: Recompile with -Xlint:deprecation for details.
> Task :solr:core:processResources
> Task :solr:core:classes
> Task :solr:core:jar
> Task :solr:core:generateMetadataFileForJarsPublication SKIPPED
> Task :solr:core:generatePomFileForJarsPublication
> Task :solr:solrj:renderJavadoc
> Task :solr:solrj-streaming:renderJavadoc
> Task :solr:solrj-zookeeper:renderJavadoc
> Task :solr:core:renderJavadoc
> Task :solr:core:javadoc SKIPPED
> Task :solr:core:javadocJar
> Task :solr:core:sourcesJar
> Task :solr:core:signJarsPublication SKIPPED
> Task :solr:core:publishJarsPublicationToBuildRepository
> Task :solr:prometheus-exporter:compileJava
Note: Some input files use or override a deprecated API.
Note: Recompile with -Xlint:deprecation for details.
> Task :solr:prometheus-exporter:processResources NO-SOURCE
> Task :solr:prometheus-exporter:classes
> Task :solr:prometheus-exporter:jar
> Task :solr:prometheus-exporter:generateMetadataFileForJarsPublication SKIPPED
> Task :solr:prometheus-exporter:generatePomFileForJarsPublication
> Task :solr:prometheus-exporter:renderJavadoc
> Task :solr:prometheus-exporter:javadoc SKIPPED
> Task :solr:prometheus-exporter:javadocJar
> Task :solr:prometheus-exporter:sourcesJar
> Task :solr:prometheus-exporter:signJarsPublication SKIPPED
> Task :solr:prometheus-exporter:publishJarsPublicationToBuildRepository
> Task :solr:solrj:processResources
> Task :solr:solrj:classes
> Task :solr:solrj:jar
> Task :solr:solrj:generateMetadataFileForJarsPublication SKIPPED
> Task :solr:solrj:generatePomFileForJarsPublication
> Task :solr:solrj:javadoc SKIPPED
> Task :solr:solrj:javadocJar
> Task :solr:solrj:sourcesJar
> Task :solr:solrj:signJarsPublication SKIPPED
> Task :solr:solrj:publishJarsPublicationToBuildRepository
> Task :solr:solrj-streaming:processResources
> Task :solr:solrj-streaming:classes
> Task :solr:solrj-streaming:jar
> Task :solr:solrj-streaming:generateMetadataFileForJarsPublication SKIPPED
> Task :solr:solrj-streaming:generatePomFileForJarsPublication
> Task :solr:solrj-streaming:javadoc SKIPPED
> Task :solr:solrj-streaming:javadocJar
> Task :solr:solrj-streaming:sourcesJar
> Task :solr:solrj-streaming:signJarsPublication SKIPPED
> Task :solr:solrj-streaming:publishJarsPublicationToBuildRepository
> Task :solr:solrj-zookeeper:processResources NO-SOURCE
> Task :solr:solrj-zookeeper:classes
> Task :solr:solrj-zookeeper:jar
> Task :solr:solrj-zookeeper:generateMetadataFileForJarsPublication SKIPPED
> Task :solr:solrj-zookeeper:generatePomFileForJarsPublication
> Task :solr:solrj-zookeeper:javadoc SKIPPED
> Task :solr:solrj-zookeeper:javadocJar
> Task :solr:solrj-zookeeper:sourcesJar
> Task :solr:solrj-zookeeper:signJarsPublication SKIPPED
> Task :solr:solrj-zookeeper:publishJarsPublicationToBuildRepository
> Task :solr:test-framework:compileJava
Note: Some input files use or override a deprecated API.
Note: Recompile with -Xlint:deprecation for details.
> Task :solr:test-framework:processResources
> Task :solr:test-framework:classes
> Task :solr:test-framework:jar
> Task :solr:test-framework:generateMetadataFileForJarsPublication SKIPPED
> Task :solr:test-framework:generatePomFileForJarsPublication
> Task :solr:test-framework:renderJavadoc
> Task :solr:test-framework:javadoc SKIPPED
> Task :solr:test-framework:javadocJar
> Task :solr:test-framework:sourcesJar
> Task :solr:test-framework:signJarsPublication SKIPPED
> Task :solr:test-framework:publishJarsPublicationToBuildRepository
> Task :solr:modules:analysis-extras:compileJava
Note: /home/jenkins/jenkins-slave/workspace/Solr/Solr-Smoketest-9.x/solr/modules/analysis-extras/src/java/org/apache/solr/schema/ICUCollationField.java uses or overrides a deprecated API.
Note: Recompile with -Xlint:deprecation for details.
> Task :solr:modules:analysis-extras:processResources NO-SOURCE
> Task :solr:modules:analysis-extras:classes
> Task :solr:modules:analysis-extras:jar
> Task :solr:modules:analysis-extras:generateMetadataFileForJarsPublication SKIPPED
> Task :solr:modules:analysis-extras:generatePomFileForJarsPublication
> Task :solr:modules:analysis-extras:renderJavadoc
> Task :solr:modules:analysis-extras:javadoc SKIPPED
> Task :solr:modules:analysis-extras:javadocJar
> Task :solr:modules:analysis-extras:sourcesJar
> Task :solr:modules:analysis-extras:signJarsPublication SKIPPED
> Task :solr:modules:analysis-extras:publishJarsPublicationToBuildRepository
> Task :solr:modules:analytics:compileJava
Note: Some input files use or override a deprecated API.
Note: Recompile with -Xlint:deprecation for details.
> Task :solr:modules:analytics:processResources NO-SOURCE
> Task :solr:modules:analytics:classes
> Task :solr:modules:analytics:jar
> Task :solr:modules:analytics:generateMetadataFileForJarsPublication SKIPPED
> Task :solr:modules:analytics:generatePomFileForJarsPublication
> Task :solr:modules:analytics:renderJavadoc
> Task :solr:modules:analytics:javadoc SKIPPED
> Task :solr:modules:analytics:javadocJar
> Task :solr:modules:analytics:sourcesJar
> Task :solr:modules:analytics:signJarsPublication SKIPPED
> Task :solr:modules:analytics:publishJarsPublicationToBuildRepository
> Task :solr:modules:clustering:compileJava
> Task :solr:modules:clustering:processResources NO-SOURCE
> Task :solr:modules:clustering:classes
> Task :solr:modules:clustering:jar
> Task :solr:modules:clustering:generateMetadataFileForJarsPublication SKIPPED
> Task :solr:modules:clustering:generatePomFileForJarsPublication
> Task :solr:modules:clustering:renderJavadoc
> Task :solr:modules:clustering:javadoc SKIPPED
> Task :solr:modules:clustering:javadocJar
> Task :solr:modules:clustering:sourcesJar
> Task :solr:modules:clustering:signJarsPublication SKIPPED
> Task :solr:modules:clustering:publishJarsPublicationToBuildRepository
> Task :solr:modules:extraction:compileJava
Note: /home/jenkins/jenkins-slave/workspace/Solr/Solr-Smoketest-9.x/solr/modules/extraction/src/java/org/apache/solr/handler/extraction/ExtractingDocumentLoader.java uses or overrides a deprecated API.
Note: Recompile with -Xlint:deprecation for details.
> Task :solr:modules:extraction:processResources
> Task :solr:modules:extraction:classes
> Task :solr:modules:extraction:jar
> Task :solr:modules:extraction:generateMetadataFileForJarsPublication SKIPPED
> Task :solr:modules:extraction:generatePomFileForJarsPublication
> Task :solr:modules:extraction:renderJavadoc
> Task :solr:modules:extraction:javadoc SKIPPED
> Task :solr:modules:extraction:javadocJar
> Task :solr:modules:extraction:sourcesJar
> Task :solr:modules:extraction:signJarsPublication SKIPPED
> Task :solr:modules:extraction:publishJarsPublicationToBuildRepository
> Task :solr:modules:gcs-repository:compileJava
Note: /home/jenkins/jenkins-slave/workspace/Solr/Solr-Smoketest-9.x/solr/modules/gcs-repository/src/java/org/apache/solr/gcs/GCSConfigParser.java uses or overrides a deprecated API.
Note: Recompile with -Xlint:deprecation for details.
> Task :solr:modules:gcs-repository:processResources NO-SOURCE
> Task :solr:modules:gcs-repository:classes
> Task :solr:modules:gcs-repository:jar
> Task :solr:modules:gcs-repository:generateMetadataFileForJarsPublication SKIPPED
> Task :solr:modules:gcs-repository:generatePomFileForJarsPublication
> Task :solr:modules:gcs-repository:renderJavadoc
> Task :solr:modules:gcs-repository:javadoc SKIPPED
> Task :solr:modules:gcs-repository:javadocJar
> Task :solr:modules:gcs-repository:sourcesJar
> Task :solr:modules:gcs-repository:signJarsPublication SKIPPED
> Task :solr:modules:gcs-repository:publishJarsPublicationToBuildRepository
> Task :solr:modules:hadoop-auth:compileJava
Note: Some input files use or override a deprecated API.
Note: Recompile with -Xlint:deprecation for details.
> Task :solr:modules:hadoop-auth:processResources NO-SOURCE
> Task :solr:modules:hadoop-auth:classes
> Task :solr:modules:hadoop-auth:jar
> Task :solr:modules:hadoop-auth:generateMetadataFileForJarsPublication SKIPPED
> Task :solr:modules:hadoop-auth:generatePomFileForJarsPublication
> Task :solr:modules:hadoop-auth:renderJavadoc
> Task :solr:modules:hadoop-auth:javadoc SKIPPED
> Task :solr:modules:hadoop-auth:javadocJar
> Task :solr:modules:hadoop-auth:sourcesJar
> Task :solr:modules:hadoop-auth:signJarsPublication SKIPPED
> Task :solr:modules:hadoop-auth:publishJarsPublicationToBuildRepository
> Task :solr:modules:hdfs:compileJava
Note: Some input files use or override a deprecated API.
Note: Recompile with -Xlint:deprecation for details.
> Task :solr:modules:hdfs:processResources NO-SOURCE
> Task :solr:modules:hdfs:classes
> Task :solr:modules:hdfs:jar
> Task :solr:modules:hdfs:generateMetadataFileForJarsPublication SKIPPED
> Task :solr:modules:hdfs:generatePomFileForJarsPublication
> Task :solr:modules:hdfs:renderJavadoc
> Task :solr:modules:hdfs:javadoc SKIPPED
> Task :solr:modules:hdfs:javadocJar
> Task :solr:modules:hdfs:sourcesJar
> Task :solr:modules:hdfs:signJarsPublication SKIPPED
> Task :solr:modules:hdfs:publishJarsPublicationToBuildRepository
> Task :solr:modules:jaegertracer-configurator:compileJava
> Task :solr:modules:jaegertracer-configurator:processResources NO-SOURCE
> Task :solr:modules:jaegertracer-configurator:classes
> Task :solr:modules:jaegertracer-configurator:jar
> Task :solr:modules:jaegertracer-configurator:generateMetadataFileForJarsPublication SKIPPED
> Task :solr:modules:jaegertracer-configurator:generatePomFileForJarsPublication
> Task :solr:modules:jaegertracer-configurator:renderJavadoc
> Task :solr:modules:jaegertracer-configurator:javadoc SKIPPED
> Task :solr:modules:jaegertracer-configurator:javadocJar
> Task :solr:modules:jaegertracer-configurator:sourcesJar
> Task :solr:modules:jaegertracer-configurator:signJarsPublication SKIPPED
> Task :solr:modules:jaegertracer-configurator:publishJarsPublicationToBuildRepository
> Task :solr:modules:jwt-auth:compileJava
> Task :solr:modules:jwt-auth:processResources NO-SOURCE
> Task :solr:modules:jwt-auth:classes
> Task :solr:modules:jwt-auth:jar
> Task :solr:modules:jwt-auth:generateMetadataFileForJarsPublication SKIPPED
> Task :solr:modules:jwt-auth:generatePomFileForJarsPublication
> Task :solr:modules:jwt-auth:renderJavadoc
> Task :solr:modules:jwt-auth:javadoc SKIPPED
> Task :solr:modules:jwt-auth:javadocJar
> Task :solr:modules:jwt-auth:sourcesJar
> Task :solr:modules:jwt-auth:signJarsPublication SKIPPED
> Task :solr:modules:jwt-auth:publishJarsPublicationToBuildRepository
> Task :solr:modules:langid:compileJava
Note: Some input files use or override a deprecated API.
Note: Recompile with -Xlint:deprecation for details.
> Task :solr:modules:langid:processResources
> Task :solr:modules:langid:classes
> Task :solr:modules:langid:jar
> Task :solr:modules:langid:generateMetadataFileForJarsPublication SKIPPED
> Task :solr:modules:langid:generatePomFileForJarsPublication
> Task :solr:modules:langid:renderJavadoc
> Task :solr:modules:langid:javadoc SKIPPED
> Task :solr:modules:langid:javadocJar
> Task :solr:modules:langid:sourcesJar
> Task :solr:modules:langid:signJarsPublication SKIPPED
> Task :solr:modules:langid:publishJarsPublicationToBuildRepository
> Task :solr:modules:ltr:compileJava
Note: Some input files use or override a deprecated API.
Note: Recompile with -Xlint:deprecation for details.
> Task :solr:modules:ltr:processResources NO-SOURCE
> Task :solr:modules:ltr:classes
> Task :solr:modules:ltr:jar
> Task :solr:modules:ltr:generateMetadataFileForJarsPublication SKIPPED
> Task :solr:modules:ltr:generatePomFileForJarsPublication
> Task :solr:modules:ltr:renderJavadoc
> Task :solr:modules:ltr:javadoc SKIPPED
> Task :solr:modules:ltr:javadocJar
> Task :solr:modules:ltr:sourcesJar
> Task :solr:modules:ltr:signJarsPublication SKIPPED
> Task :solr:modules:ltr:publishJarsPublicationToBuildRepository
> Task :solr:modules:opentelemetry:compileJava
> Task :solr:modules:opentelemetry:processResources NO-SOURCE
> Task :solr:modules:opentelemetry:classes
> Task :solr:modules:opentelemetry:jar
> Task :solr:modules:opentelemetry:generateMetadataFileForJarsPublication SKIPPED
> Task :solr:modules:opentelemetry:generatePomFileForJarsPublication
> Task :solr:modules:opentelemetry:renderJavadoc
> Task :solr:modules:opentelemetry:javadoc SKIPPED
> Task :solr:modules:opentelemetry:javadocJar
> Task :solr:modules:opentelemetry:sourcesJar
> Task :solr:modules:opentelemetry:signJarsPublication SKIPPED
> Task :solr:modules:opentelemetry:publishJarsPublicationToBuildRepository
> Task :solr:modules:s3-repository:compileJava
> Task :solr:modules:s3-repository:processResources NO-SOURCE
> Task :solr:modules:s3-repository:classes
> Task :solr:modules:s3-repository:jar
> Task :solr:modules:s3-repository:generateMetadataFileForJarsPublication SKIPPED
> Task :solr:modules:s3-repository:generatePomFileForJarsPublication
> Task :solr:modules:s3-repository:renderJavadoc
> Task :solr:modules:s3-repository:javadoc SKIPPED
> Task :solr:modules:s3-repository:javadocJar
> Task :solr:modules:s3-repository:sourcesJar
> Task :solr:modules:s3-repository:signJarsPublication SKIPPED
> Task :solr:modules:s3-repository:publishJarsPublicationToBuildRepository
> Task :solr:modules:scripting:compileJava
Note: /home/jenkins/jenkins-slave/workspace/Solr/Solr-Smoketest-9.x/solr/modules/scripting/src/java/org/apache/solr/scripting/xslt/XSLTUpdateRequestHandler.java uses or overrides a deprecated API.
Note: Recompile with -Xlint:deprecation for details.
> Task :solr:modules:scripting:processResources NO-SOURCE
> Task :solr:modules:scripting:classes
> Task :solr:modules:scripting:jar
> Task :solr:modules:scripting:generateMetadataFileForJarsPublication SKIPPED
> Task :solr:modules:scripting:generatePomFileForJarsPublication
> Task :solr:modules:scripting:renderJavadoc
> Task :solr:modules:scripting:javadoc SKIPPED
> Task :solr:modules:scripting:javadocJar
> Task :solr:modules:scripting:sourcesJar
> Task :solr:modules:scripting:signJarsPublication SKIPPED
> Task :solr:modules:scripting:publishJarsPublicationToBuildRepository
> Task :solr:modules:sql:compileJava
Note: Some input files use or override a deprecated API.
Note: Recompile with -Xlint:deprecation for details.
> Task :solr:modules:sql:processResources
> Task :solr:modules:sql:classes
> Task :solr:modules:sql:jar
> Task :solr:modules:sql:generateMetadataFileForJarsPublication SKIPPED
> Task :solr:modules:sql:generatePomFileForJarsPublication
> Task :solr:modules:sql:renderJavadoc
> Task :solr:modules:sql:javadoc SKIPPED
> Task :solr:modules:sql:javadocJar
> Task :solr:modules:sql:sourcesJar
> Task :solr:modules:sql:signJarsPublication SKIPPED
> Task :solr:modules:sql:publishJarsPublicationToBuildRepository
> Task :mavenToLocalFolder
Local maven artifacts (poms, jars) created at: /home/jenkins/jenkins-slave/workspace/Solr/Solr-Smoketest-9.x/build/maven-local
> Task :checkWorkingCopyClean
> Task :solr:distribution:assembleSourceTgz
> Task :solr:docker:createBodySnippetDockerfile
> Task :solr:docker:createDockerfileLocal
> Task :solr:docker:assemblePackaging
> Task :solr:documentation:changesToHtml
> Task :solr:documentation:copyDocumentationAssets
> Task :solr:documentation:markdownToHtml
> Task :solr:documentation:copyChangesToHtmlForMiniSite
> Task :solr:documentation:copyMiniDocumentationAssets
> Task :solr:documentation:createMiniDocumentationIndex
> Task :solr:documentation:documentationMinimal
> Task :solr:core:assemblePostJar
> Task :solr:example:assemblePackaging
> Task :solr:prometheus-exporter:assemblePackaging
> Task :solr:webapp:compileJava NO-SOURCE
> Task :solr:webapp:processResources NO-SOURCE
> Task :solr:webapp:classes UP-TO-DATE
> Task :solr:api:buildJSClient
################################################################################
# Thanks for using OpenAPI Generator. #
# Please consider donation to help us maintain this project ๐ #
# https://opencollective.com/openapi_generator/donate #
################################################################################
Successfully generated code to /home/jenkins/jenkins-slave/workspace/Solr/Solr-Smoketest-9.x/solr/api/build/generated/js
> Task :solr:webapp:nodeSetup
> Task :solr:webapp:npmSetup SKIPPED
> Task :solr:webapp:downloadBrowserify
added 163 packages, changed 1 package, and audited 165 packages in 6s
31 packages are looking for funding
run `npm fund` for details
found 0 vulnerabilities
> Task :solr:webapp:syncJSClientSourceCode
> Task :solr:webapp:jsClientDownloadDeps FAILED
npm ERR! code E400
npm ERR! 400 Bad Request - GET https://registry.npmjs.org/@babel%2fplugin-proposal-throw-expressions - Bad request
npm ERR! A complete log of this run can be found in:
npm ERR! /home/jenkins/.npm/_logs/2024-03-09T07_02_20_585Z-debug-0.log
> Task :solr:modules:analysis-extras:assemblePackaging
> Task :solr:modules:analytics:assemblePackaging
> Task :solr:modules:clustering:assemblePackaging
> Task :solr:modules:extraction:assemblePackaging
> Task :solr:modules:gcs-repository:assemblePackaging
> Task :solr:modules:hadoop-auth:assemblePackaging
> Task :solr:modules:hdfs:assemblePackaging
> Task :solr:modules:jaegertracer-configurator:assemblePackaging
> Task :solr:modules:jwt-auth:assemblePackaging
> Task :solr:modules:langid:assemblePackaging
> Task :solr:modules:ltr:assemblePackaging
> Task :solr:modules:opentelemetry:assemblePackaging
> Task :solr:modules:s3-repository:assemblePackaging
> Task :solr:modules:scripting:assemblePackaging
> Task :solr:modules:sql:assemblePackaging
> Task :solr:distribution:prepareGitRev
FAILURE: Build failed with an exception.
* What went wrong:
Execution failed for task ':solr:webapp:jsClientDownloadDeps'.
> Process 'command '/home/jenkins/jenkins-slave/workspace/Solr/Solr-Smoketest-9.x/.gradle/node/nodejs/node-v16.20.2-linux-x64/bin/npm'' finished with non-zero exit value 1
* Try:
> Run with --stacktrace option to get the stack trace.
> Run with --info or --debug option to get more log output.
> Get more help at https://help.gradle.org.
Deprecated Gradle features were used in this build, making it incompatible with Gradle 9.0.
You can use '--warning-mode all' to show the individual deprecation warnings and determine if they come from your own scripts or plugins.
For more on this, please refer to https://docs.gradle.org/8.4/userguide/command_line_interface.html#sec:command_line_warnings in the Gradle documentation.
BUILD FAILED in 4m 32s
243 actionable tasks: 235 executed, 8 up-to-date
Publishing build scan...
https://ge.apache.org/s/6l3s73mf7omj2
Build step 'Invoke Gradle script' changed build result to FAILURE
Build step 'Invoke Gradle script' marked build as failure
Email was triggered for: Failure - Any
Sending email for trigger: Failure - Any
[JENKINS] Solr ยป Solr-Smoketest-9.x - Build # 344 - Still Failing!
Posted by Apache Jenkins Server <je...@builds.apache.org>.
Build: https://ci-builds.apache.org/job/Solr/job/Solr-Smoketest-9.x/344/
Log:
Started by timer
Running as SYSTEM
[EnvInject] - Loading node environment variables.
Building remotely on lucene-solr-2 (solr lucene) in workspace /home/jenkins/jenkins-slave/workspace/Solr/Solr-Smoketest-9.x
[WS-CLEANUP] Deleting project workspace...
[WS-CLEANUP] Deferred wipeout is used...
[WS-CLEANUP] Done
The recommended git tool is: NONE
No credentials specified
Cloning the remote Git repository
Cloning repository https://github.com/apache/solr.git
> git init /home/jenkins/jenkins-slave/workspace/Solr/Solr-Smoketest-9.x # timeout=10
Fetching upstream changes from https://github.com/apache/solr.git
> git --version # timeout=10
> git --version # 'git version 2.25.1'
> git fetch --tags --force --progress -- https://github.com/apache/solr.git +refs/heads/*:refs/remotes/origin/* # timeout=10
> git config remote.origin.url https://github.com/apache/solr.git # timeout=10
> git config --add remote.origin.fetch +refs/heads/*:refs/remotes/origin/* # timeout=10
Avoid second fetch
> git rev-parse origin/branch_9x^{commit} # timeout=10
Checking out Revision c373a61be7c58eec81e0aa344f54ce7864a17dd6 (origin/branch_9x)
> git config core.sparsecheckout # timeout=10
> git checkout -f c373a61be7c58eec81e0aa344f54ce7864a17dd6 # timeout=10
> git branch -a -v --no-abbrev # timeout=10
> git checkout -b branch_9x c373a61be7c58eec81e0aa344f54ce7864a17dd6 # timeout=10
Commit message: "Update dependency io.swagger.core.v3:swagger-annotations-jakarta to v2.2.20 (#2064)"
> git rev-list --no-walk 7c0fc6f8164ad8ade9db74a1646efd147ee32874 # timeout=10
No emails were triggered.
provisioning config files...
copy managed file [gradle.properties] to file:/home/jenkins/jenkins-slave/workspace/Solr/Solr-Smoketest-9.x/gradle.properties
[Gradle] - Launching build.
[Solr-Smoketest-9.x] $ /home/jenkins/jenkins-slave/workspace/Solr/Solr-Smoketest-9.x/gradlew -Dversion.suffix= -Dgradle.user.home=/home/jenkins/jenkins-slave/workspace/Solr/.gradle -Porg.gradle.daemon=false -Pvalidation.git.failOnModified=false --continue clean assembleRelease
Downloading gradle-wrapper.jar from https://raw.githubusercontent.com/gradle/gradle/v8.4.0/gradle/wrapper/gradle-wrapper.jar
To honour the JVM settings for this build a single-use Daemon process will be forked. For more on this, please refer to https://docs.gradle.org/8.4/userguide/gradle_daemon.html#sec:disabling_the_daemon in the Gradle documentation.
Daemon will be stopped at the end of the build
> Task :buildSrc:compileJava
Note: /home/jenkins/jenkins-slave/workspace/Solr/Solr-Smoketest-9.x/buildSrc/src/main/java/org/apache/lucene/gradle/Checksum.java uses or overrides a deprecated API.
Note: Recompile with -Xlint:deprecation for details.
> Task :buildSrc:compileGroovy NO-SOURCE
> Task :buildSrc:processResources NO-SOURCE
> Task :buildSrc:classes
> Task :buildSrc:jar
> Task :clean
> Task :solr:clean UP-TO-DATE
> Task :solr:api:clean
> Task :solr:benchmark:clean
> Task :solr:core:clean
> Task :solr:distribution:clean UP-TO-DATE
> Task :solr:docker:clean UP-TO-DATE
> Task :solr:documentation:clean UP-TO-DATE
> Task :solr:example:clean UP-TO-DATE
> Task :solr:modules:clean UP-TO-DATE
> Task :solr:packaging:clean UP-TO-DATE
> Task :solr:prometheus-exporter:clean
> Task :solr:server:clean
> Task :solr:solr-ref-guide:clean
> Task :solr:solrj:clean
> Task :solr:solrj-streaming:clean
> Task :solr:solrj-zookeeper:clean
> Task :solr:test-framework:clean
> Task :solr:webapp:clean
> Task :solr:modules:analysis-extras:clean
> Task :solr:modules:analytics:clean
> Task :solr:modules:clustering:clean
> Task :solr:modules:extraction:clean
> Task :solr:modules:gcs-repository:clean
> Task :solr:modules:hadoop-auth:clean
> Task :solr:modules:hdfs:clean
> Task :solr:modules:jaegertracer-configurator:clean
> Task :solr:modules:jwt-auth:clean
> Task :solr:modules:langid:clean
> Task :solr:modules:ltr:clean
> Task :solr:modules:opentelemetry:clean
> Task :solr:modules:s3-repository:clean
> Task :solr:modules:scripting:clean
> Task :solr:modules:sql:clean
> Task :mavenLocalClean UP-TO-DATE
> Task :solr-missing-doclet:compileJava
> Task :solr-missing-doclet:processResources NO-SOURCE
> Task :solr-missing-doclet:classes
> Task :solr-missing-doclet:jar
> Task :gitStatus
> Task :checkJdkInternalsExportedToGradle
> Task :solr:api:compileJava
> Task :solr:api:processResources NO-SOURCE
> Task :solr:api:classes
> Task :solr:api:jar
> Task :solr:api:generateMetadataFileForJarsPublication SKIPPED
> Task :solr:api:generatePomFileForJarsPublication
> Task :solr:api:renderJavadoc
> Task :solr:api:javadoc SKIPPED
> Task :solr:api:javadocJar
> Task :solr:api:sourcesJar
> Task :solr:api:signJarsPublication SKIPPED
> Task :solr:api:publishJarsPublicationToBuildRepository
> Task :solr:api:resolve
SLF4J(W): No SLF4J providers were found.
SLF4J(W): Defaulting to no-operation (NOP) logger implementation
SLF4J(W): See https://www.slf4j.org/codes.html#noProviders for further details.
> Task :solr:solrj:openApiGenerate
################################################################################
# Thanks for using OpenAPI Generator. #
# Please consider donation to help us maintain this project ๐ #
# https://opencollective.com/openapi_generator/donate #
################################################################################
Successfully generated code to /home/jenkins/jenkins-slave/workspace/Solr/Solr-Smoketest-9.x/solr/solrj/build/generated/
> Task :spotlessInternalRegisterDependencies
> Task :solr:solrj:generatedSpotlessHelper
> Task :solr:solrj:generatedSpotless
> Task :solr:solrj:compileJava
Note: Some input files use or override a deprecated API.
Note: Recompile with -Xlint:deprecation for details.
> Task :solr:solrj-streaming:compileJava
Note: Some input files use or override a deprecated API.
Note: Recompile with -Xlint:deprecation for details.
> Task :solr:solrj-zookeeper:compileJava
Note: Some input files use or override a deprecated API.
Note: Recompile with -Xlint:deprecation for details.
> Task :solr:core:compileJava
Note: Some input files use or override a deprecated API.
Note: Recompile with -Xlint:deprecation for details.
> Task :solr:core:processResources
> Task :solr:core:classes
> Task :solr:core:jar
> Task :solr:core:generateMetadataFileForJarsPublication SKIPPED
> Task :solr:core:generatePomFileForJarsPublication
> Task :solr:solrj:renderJavadoc
> Task :solr:solrj-streaming:renderJavadoc
> Task :solr:solrj-zookeeper:renderJavadoc
> Task :solr:core:renderJavadoc
> Task :solr:core:javadoc SKIPPED
> Task :solr:core:javadocJar
> Task :solr:core:sourcesJar
> Task :solr:core:signJarsPublication SKIPPED
> Task :solr:core:publishJarsPublicationToBuildRepository
> Task :solr:prometheus-exporter:compileJava
Note: Some input files use or override a deprecated API.
Note: Recompile with -Xlint:deprecation for details.
> Task :solr:prometheus-exporter:processResources NO-SOURCE
> Task :solr:prometheus-exporter:classes
> Task :solr:prometheus-exporter:jar
> Task :solr:prometheus-exporter:generateMetadataFileForJarsPublication SKIPPED
> Task :solr:prometheus-exporter:generatePomFileForJarsPublication
> Task :solr:prometheus-exporter:renderJavadoc
> Task :solr:prometheus-exporter:javadoc SKIPPED
> Task :solr:prometheus-exporter:javadocJar
> Task :solr:prometheus-exporter:sourcesJar
> Task :solr:prometheus-exporter:signJarsPublication SKIPPED
> Task :solr:prometheus-exporter:publishJarsPublicationToBuildRepository
> Task :solr:solrj:processResources
> Task :solr:solrj:classes
> Task :solr:solrj:jar
> Task :solr:solrj:generateMetadataFileForJarsPublication SKIPPED
> Task :solr:solrj:generatePomFileForJarsPublication
> Task :solr:solrj:javadoc SKIPPED
> Task :solr:solrj:javadocJar
> Task :solr:solrj:sourcesJar
> Task :solr:solrj:signJarsPublication SKIPPED
> Task :solr:solrj:publishJarsPublicationToBuildRepository
> Task :solr:solrj-streaming:processResources
> Task :solr:solrj-streaming:classes
> Task :solr:solrj-streaming:jar
> Task :solr:solrj-streaming:generateMetadataFileForJarsPublication SKIPPED
> Task :solr:solrj-streaming:generatePomFileForJarsPublication
> Task :solr:solrj-streaming:javadoc SKIPPED
> Task :solr:solrj-streaming:javadocJar
> Task :solr:solrj-streaming:sourcesJar
> Task :solr:solrj-streaming:signJarsPublication SKIPPED
> Task :solr:solrj-streaming:publishJarsPublicationToBuildRepository
> Task :solr:solrj-zookeeper:processResources NO-SOURCE
> Task :solr:solrj-zookeeper:classes
> Task :solr:solrj-zookeeper:jar
> Task :solr:solrj-zookeeper:generateMetadataFileForJarsPublication SKIPPED
> Task :solr:solrj-zookeeper:generatePomFileForJarsPublication
> Task :solr:solrj-zookeeper:javadoc SKIPPED
> Task :solr:solrj-zookeeper:javadocJar
> Task :solr:solrj-zookeeper:sourcesJar
> Task :solr:solrj-zookeeper:signJarsPublication SKIPPED
> Task :solr:solrj-zookeeper:publishJarsPublicationToBuildRepository
> Task :solr:test-framework:compileJava
Note: Some input files use or override a deprecated API.
Note: Recompile with -Xlint:deprecation for details.
> Task :solr:test-framework:processResources
> Task :solr:test-framework:classes
> Task :solr:test-framework:jar
> Task :solr:test-framework:generateMetadataFileForJarsPublication SKIPPED
> Task :solr:test-framework:generatePomFileForJarsPublication
> Task :solr:test-framework:renderJavadoc
> Task :solr:test-framework:javadoc SKIPPED
> Task :solr:test-framework:javadocJar
> Task :solr:test-framework:sourcesJar
> Task :solr:test-framework:signJarsPublication SKIPPED
> Task :solr:test-framework:publishJarsPublicationToBuildRepository
> Task :solr:modules:analysis-extras:compileJava
Note: /home/jenkins/jenkins-slave/workspace/Solr/Solr-Smoketest-9.x/solr/modules/analysis-extras/src/java/org/apache/solr/schema/ICUCollationField.java uses or overrides a deprecated API.
Note: Recompile with -Xlint:deprecation for details.
> Task :solr:modules:analysis-extras:processResources NO-SOURCE
> Task :solr:modules:analysis-extras:classes
> Task :solr:modules:analysis-extras:jar
> Task :solr:modules:analysis-extras:generateMetadataFileForJarsPublication SKIPPED
> Task :solr:modules:analysis-extras:generatePomFileForJarsPublication
> Task :solr:modules:analysis-extras:renderJavadoc
> Task :solr:modules:analysis-extras:javadoc SKIPPED
> Task :solr:modules:analysis-extras:javadocJar
> Task :solr:modules:analysis-extras:sourcesJar
> Task :solr:modules:analysis-extras:signJarsPublication SKIPPED
> Task :solr:modules:analysis-extras:publishJarsPublicationToBuildRepository
> Task :solr:modules:analytics:compileJava
Note: Some input files use or override a deprecated API.
Note: Recompile with -Xlint:deprecation for details.
> Task :solr:modules:analytics:processResources NO-SOURCE
> Task :solr:modules:analytics:classes
> Task :solr:modules:analytics:jar
> Task :solr:modules:analytics:generateMetadataFileForJarsPublication SKIPPED
> Task :solr:modules:analytics:generatePomFileForJarsPublication
> Task :solr:modules:analytics:renderJavadoc
> Task :solr:modules:analytics:javadoc SKIPPED
> Task :solr:modules:analytics:javadocJar
> Task :solr:modules:analytics:sourcesJar
> Task :solr:modules:analytics:signJarsPublication SKIPPED
> Task :solr:modules:analytics:publishJarsPublicationToBuildRepository
> Task :solr:modules:clustering:compileJava
> Task :solr:modules:clustering:processResources NO-SOURCE
> Task :solr:modules:clustering:classes
> Task :solr:modules:clustering:jar
> Task :solr:modules:clustering:generateMetadataFileForJarsPublication SKIPPED
> Task :solr:modules:clustering:generatePomFileForJarsPublication
> Task :solr:modules:clustering:renderJavadoc
> Task :solr:modules:clustering:javadoc SKIPPED
> Task :solr:modules:clustering:javadocJar
> Task :solr:modules:clustering:sourcesJar
> Task :solr:modules:clustering:signJarsPublication SKIPPED
> Task :solr:modules:clustering:publishJarsPublicationToBuildRepository
> Task :solr:modules:extraction:compileJava
Note: /home/jenkins/jenkins-slave/workspace/Solr/Solr-Smoketest-9.x/solr/modules/extraction/src/java/org/apache/solr/handler/extraction/ExtractingDocumentLoader.java uses or overrides a deprecated API.
Note: Recompile with -Xlint:deprecation for details.
> Task :solr:modules:extraction:processResources
> Task :solr:modules:extraction:classes
> Task :solr:modules:extraction:jar
> Task :solr:modules:extraction:generateMetadataFileForJarsPublication SKIPPED
> Task :solr:modules:extraction:generatePomFileForJarsPublication
> Task :solr:modules:extraction:renderJavadoc
> Task :solr:modules:extraction:javadoc SKIPPED
> Task :solr:modules:extraction:javadocJar
> Task :solr:modules:extraction:sourcesJar
> Task :solr:modules:extraction:signJarsPublication SKIPPED
> Task :solr:modules:extraction:publishJarsPublicationToBuildRepository
> Task :solr:modules:gcs-repository:compileJava
Note: /home/jenkins/jenkins-slave/workspace/Solr/Solr-Smoketest-9.x/solr/modules/gcs-repository/src/java/org/apache/solr/gcs/GCSConfigParser.java uses or overrides a deprecated API.
Note: Recompile with -Xlint:deprecation for details.
> Task :solr:modules:gcs-repository:processResources NO-SOURCE
> Task :solr:modules:gcs-repository:classes
> Task :solr:modules:gcs-repository:jar
> Task :solr:modules:gcs-repository:generateMetadataFileForJarsPublication SKIPPED
> Task :solr:modules:gcs-repository:generatePomFileForJarsPublication
> Task :solr:modules:gcs-repository:renderJavadoc
> Task :solr:modules:gcs-repository:javadoc SKIPPED
> Task :solr:modules:gcs-repository:javadocJar
> Task :solr:modules:gcs-repository:sourcesJar
> Task :solr:modules:gcs-repository:signJarsPublication SKIPPED
> Task :solr:modules:gcs-repository:publishJarsPublicationToBuildRepository
> Task :solr:modules:hadoop-auth:compileJava
Note: Some input files use or override a deprecated API.
Note: Recompile with -Xlint:deprecation for details.
> Task :solr:modules:hadoop-auth:processResources NO-SOURCE
> Task :solr:modules:hadoop-auth:classes
> Task :solr:modules:hadoop-auth:jar
> Task :solr:modules:hadoop-auth:generateMetadataFileForJarsPublication SKIPPED
> Task :solr:modules:hadoop-auth:generatePomFileForJarsPublication
> Task :solr:modules:hadoop-auth:renderJavadoc
> Task :solr:modules:hadoop-auth:javadoc SKIPPED
> Task :solr:modules:hadoop-auth:javadocJar
> Task :solr:modules:hadoop-auth:sourcesJar
> Task :solr:modules:hadoop-auth:signJarsPublication SKIPPED
> Task :solr:modules:hadoop-auth:publishJarsPublicationToBuildRepository
> Task :solr:modules:hdfs:compileJava
Note: Some input files use or override a deprecated API.
Note: Recompile with -Xlint:deprecation for details.
> Task :solr:modules:hdfs:processResources NO-SOURCE
> Task :solr:modules:hdfs:classes
> Task :solr:modules:hdfs:jar
> Task :solr:modules:hdfs:generateMetadataFileForJarsPublication SKIPPED
> Task :solr:modules:hdfs:generatePomFileForJarsPublication
> Task :solr:modules:hdfs:renderJavadoc
> Task :solr:modules:hdfs:javadoc SKIPPED
> Task :solr:modules:hdfs:javadocJar
> Task :solr:modules:hdfs:sourcesJar
> Task :solr:modules:hdfs:signJarsPublication SKIPPED
> Task :solr:modules:hdfs:publishJarsPublicationToBuildRepository
> Task :solr:modules:jaegertracer-configurator:compileJava
> Task :solr:modules:jaegertracer-configurator:processResources NO-SOURCE
> Task :solr:modules:jaegertracer-configurator:classes
> Task :solr:modules:jaegertracer-configurator:jar
> Task :solr:modules:jaegertracer-configurator:generateMetadataFileForJarsPublication SKIPPED
> Task :solr:modules:jaegertracer-configurator:generatePomFileForJarsPublication
> Task :solr:modules:jaegertracer-configurator:renderJavadoc
> Task :solr:modules:jaegertracer-configurator:javadoc SKIPPED
> Task :solr:modules:jaegertracer-configurator:javadocJar
> Task :solr:modules:jaegertracer-configurator:sourcesJar
> Task :solr:modules:jaegertracer-configurator:signJarsPublication SKIPPED
> Task :solr:modules:jaegertracer-configurator:publishJarsPublicationToBuildRepository
> Task :solr:modules:jwt-auth:compileJava
> Task :solr:modules:jwt-auth:processResources NO-SOURCE
> Task :solr:modules:jwt-auth:classes
> Task :solr:modules:jwt-auth:jar
> Task :solr:modules:jwt-auth:generateMetadataFileForJarsPublication SKIPPED
> Task :solr:modules:jwt-auth:generatePomFileForJarsPublication
> Task :solr:modules:jwt-auth:renderJavadoc
> Task :solr:modules:jwt-auth:javadoc SKIPPED
> Task :solr:modules:jwt-auth:javadocJar
> Task :solr:modules:jwt-auth:sourcesJar
> Task :solr:modules:jwt-auth:signJarsPublication SKIPPED
> Task :solr:modules:jwt-auth:publishJarsPublicationToBuildRepository
> Task :solr:modules:langid:compileJava
Note: Some input files use or override a deprecated API.
Note: Recompile with -Xlint:deprecation for details.
> Task :solr:modules:langid:processResources
> Task :solr:modules:langid:classes
> Task :solr:modules:langid:jar
> Task :solr:modules:langid:generateMetadataFileForJarsPublication SKIPPED
> Task :solr:modules:langid:generatePomFileForJarsPublication
> Task :solr:modules:langid:renderJavadoc
> Task :solr:modules:langid:javadoc SKIPPED
> Task :solr:modules:langid:javadocJar
> Task :solr:modules:langid:sourcesJar
> Task :solr:modules:langid:signJarsPublication SKIPPED
> Task :solr:modules:langid:publishJarsPublicationToBuildRepository
> Task :solr:modules:ltr:compileJava
Note: Some input files use or override a deprecated API.
Note: Recompile with -Xlint:deprecation for details.
> Task :solr:modules:ltr:processResources NO-SOURCE
> Task :solr:modules:ltr:classes
> Task :solr:modules:ltr:jar
> Task :solr:modules:ltr:generateMetadataFileForJarsPublication SKIPPED
> Task :solr:modules:ltr:generatePomFileForJarsPublication
> Task :solr:modules:ltr:renderJavadoc
> Task :solr:modules:ltr:javadoc SKIPPED
> Task :solr:modules:ltr:javadocJar
> Task :solr:modules:ltr:sourcesJar
> Task :solr:modules:ltr:signJarsPublication SKIPPED
> Task :solr:modules:ltr:publishJarsPublicationToBuildRepository
> Task :solr:modules:opentelemetry:compileJava
> Task :solr:modules:opentelemetry:processResources NO-SOURCE
> Task :solr:modules:opentelemetry:classes
> Task :solr:modules:opentelemetry:jar
> Task :solr:modules:opentelemetry:generateMetadataFileForJarsPublication SKIPPED
> Task :solr:modules:opentelemetry:generatePomFileForJarsPublication
> Task :solr:modules:opentelemetry:renderJavadoc
> Task :solr:modules:opentelemetry:javadoc SKIPPED
> Task :solr:modules:opentelemetry:javadocJar
> Task :solr:modules:opentelemetry:sourcesJar
> Task :solr:modules:opentelemetry:signJarsPublication SKIPPED
> Task :solr:modules:opentelemetry:publishJarsPublicationToBuildRepository
> Task :solr:modules:s3-repository:compileJava
> Task :solr:modules:s3-repository:processResources NO-SOURCE
> Task :solr:modules:s3-repository:classes
> Task :solr:modules:s3-repository:jar
> Task :solr:modules:s3-repository:generateMetadataFileForJarsPublication SKIPPED
> Task :solr:modules:s3-repository:generatePomFileForJarsPublication
> Task :solr:modules:s3-repository:renderJavadoc
> Task :solr:modules:s3-repository:javadoc SKIPPED
> Task :solr:modules:s3-repository:javadocJar
> Task :solr:modules:s3-repository:sourcesJar
> Task :solr:modules:s3-repository:signJarsPublication SKIPPED
> Task :solr:modules:s3-repository:publishJarsPublicationToBuildRepository
> Task :solr:modules:scripting:compileJava
Note: /home/jenkins/jenkins-slave/workspace/Solr/Solr-Smoketest-9.x/solr/modules/scripting/src/java/org/apache/solr/scripting/xslt/XSLTUpdateRequestHandler.java uses or overrides a deprecated API.
Note: Recompile with -Xlint:deprecation for details.
> Task :solr:modules:scripting:processResources NO-SOURCE
> Task :solr:modules:scripting:classes
> Task :solr:modules:scripting:jar
> Task :solr:modules:scripting:generateMetadataFileForJarsPublication SKIPPED
> Task :solr:modules:scripting:generatePomFileForJarsPublication
> Task :solr:modules:scripting:renderJavadoc
> Task :solr:modules:scripting:javadoc SKIPPED
> Task :solr:modules:scripting:javadocJar
> Task :solr:modules:scripting:sourcesJar
> Task :solr:modules:scripting:signJarsPublication SKIPPED
> Task :solr:modules:scripting:publishJarsPublicationToBuildRepository
> Task :solr:modules:sql:compileJava
Note: Some input files use or override a deprecated API.
Note: Recompile with -Xlint:deprecation for details.
> Task :solr:modules:sql:processResources
> Task :solr:modules:sql:classes
> Task :solr:modules:sql:jar
> Task :solr:modules:sql:generateMetadataFileForJarsPublication SKIPPED
> Task :solr:modules:sql:generatePomFileForJarsPublication
> Task :solr:modules:sql:renderJavadoc
> Task :solr:modules:sql:javadoc SKIPPED
> Task :solr:modules:sql:javadocJar
> Task :solr:modules:sql:sourcesJar
> Task :solr:modules:sql:signJarsPublication SKIPPED
> Task :solr:modules:sql:publishJarsPublicationToBuildRepository
> Task :mavenToLocalFolder
Local maven artifacts (poms, jars) created at: /home/jenkins/jenkins-slave/workspace/Solr/Solr-Smoketest-9.x/build/maven-local
> Task :checkWorkingCopyClean
> Task :solr:distribution:assembleSourceTgz
> Task :solr:docker:createBodySnippetDockerfile
> Task :solr:docker:createDockerfileLocal
> Task :solr:docker:assemblePackaging
> Task :solr:documentation:changesToHtml
> Task :solr:documentation:copyDocumentationAssets
> Task :solr:documentation:markdownToHtml
> Task :solr:documentation:copyChangesToHtmlForMiniSite
> Task :solr:documentation:copyMiniDocumentationAssets
> Task :solr:documentation:createMiniDocumentationIndex
> Task :solr:documentation:documentationMinimal
> Task :solr:core:assemblePostJar
> Task :solr:example:assemblePackaging
> Task :solr:prometheus-exporter:assemblePackaging
> Task :solr:webapp:compileJava NO-SOURCE
> Task :solr:webapp:processResources NO-SOURCE
> Task :solr:webapp:classes UP-TO-DATE
> Task :solr:api:buildJSClient
################################################################################
# Thanks for using OpenAPI Generator. #
# Please consider donation to help us maintain this project ๐ #
# https://opencollective.com/openapi_generator/donate #
################################################################################
Successfully generated code to /home/jenkins/jenkins-slave/workspace/Solr/Solr-Smoketest-9.x/solr/api/build/generated/js
> Task :solr:webapp:nodeSetup
> Task :solr:webapp:npmSetup SKIPPED
> Task :solr:webapp:downloadBrowserify
added 163 packages, changed 1 package, and audited 165 packages in 3s
31 packages are looking for funding
run `npm fund` for details
found 0 vulnerabilities
> Task :solr:webapp:syncJSClientSourceCode
> Task :solr:webapp:jsClientDownloadDeps
npm WARN deprecated @babel/plugin-proposal-numeric-separator@7.18.6: This proposal has been merged to the ECMAScript standard and thus this plugin is no longer maintained. Please use @babel/plugin-transform-numeric-separator instead.
npm WARN deprecated @babel/plugin-proposal-nullish-coalescing-operator@7.18.6: This proposal has been merged to the ECMAScript standard and thus this plugin is no longer maintained. Please use @babel/plugin-transform-nullish-coalescing-operator instead.
npm WARN deprecated @babel/plugin-proposal-json-strings@7.18.6: This proposal has been merged to the ECMAScript standard and thus this plugin is no longer maintained. Please use @babel/plugin-transform-json-strings instead.
npm WARN deprecated @babel/plugin-proposal-export-namespace-from@7.18.9: This proposal has been merged to the ECMAScript standard and thus this plugin is no longer maintained. Please use @babel/plugin-transform-export-namespace-from instead.
npm WARN deprecated @babel/plugin-proposal-class-properties@7.18.6: This proposal has been merged to the ECMAScript standard and thus this plugin is no longer maintained. Please use @babel/plugin-transform-class-properties instead.
npm WARN deprecated @babel/plugin-proposal-logical-assignment-operators@7.20.7: This proposal has been merged to the ECMAScript standard and thus this plugin is no longer maintained. Please use @babel/plugin-transform-logical-assignment-operators instead.
npm WARN deprecated @babel/plugin-proposal-optional-chaining@7.21.0: This proposal has been merged to the ECMAScript standard and thus this plugin is no longer maintained. Please use @babel/plugin-transform-optional-chaining instead.
npm WARN deprecated formidable@1.2.6: Please upgrade to latest, formidable@v2 or formidable@v3! Check these notes: https://bit.ly/2ZEqIau
npm WARN deprecated superagent@5.3.1: Please upgrade to v7.0.2+ of superagent. We have fixed numerous issues with streams, form-data, attach(), filesystem errors not bubbling up (ENOENT on attach()), and all tests are now passing. See the releases tab for more information at <https://github.com/visionmedia/superagent/releases>.
npm WARN deprecated sinon@7.5.0: 16.1.1
> v2_api@9.6.0 prepare
> npm run build
> v2_api@9.6.0 build
> babel src -d dist
Successfully compiled 80 files with Babel (2007ms).
added 356 packages, and audited 357 packages in 11s
41 packages are looking for funding
run `npm fund` for details
3 vulnerabilities (1 moderate, 2 high)
To address all issues (including breaking changes), run:
npm audit fix --force
Run `npm audit` for details.
> Task :solr:webapp:jsClientBuild
> v2_api@9.6.0 build
> babel src -d dist
Successfully compiled 80 files with Babel (2087ms).
> Task :solr:webapp:generateJsClientBundle
> Task :solr:webapp:finalizeJsBundleDir
> Task :solr:webapp:war
> Task :solr:server:assemblePackaging
> Task :solr:modules:analysis-extras:assemblePackaging
> Task :solr:modules:analytics:assemblePackaging
> Task :solr:modules:clustering:assemblePackaging
> Task :solr:modules:extraction:assemblePackaging
> Task :solr:modules:gcs-repository:assemblePackaging
> Task :solr:modules:hadoop-auth:assemblePackaging
> Task :solr:modules:hdfs:assemblePackaging
> Task :solr:modules:jaegertracer-configurator:assemblePackaging
> Task :solr:modules:jwt-auth:assemblePackaging
> Task :solr:modules:langid:assemblePackaging
> Task :solr:modules:ltr:assemblePackaging
> Task :solr:modules:opentelemetry:assemblePackaging
> Task :solr:modules:s3-repository:assemblePackaging
> Task :solr:modules:scripting:assemblePackaging
> Task :solr:modules:sql:assemblePackaging
> Task :solr:packaging:fullDistTar
> Task :solr:packaging:slimDistTar
> Task :solr:distribution:computeChecksums
> Task :solr:distribution:prepareGitRev
> Task :solr:docker:createDockerfileOfficialFull
> Task :solr:docker:createDockerfileOfficialSlim
> Task :solr:distribution:assembleRelease
Deprecated Gradle features were used in this build, making it incompatible with Gradle 9.0.
You can use '--warning-mode all' to show the individual deprecation warnings and determine if they come from your own scripts or plugins.
For more on this, please refer to https://docs.gradle.org/8.4/userguide/command_line_interface.html#sec:command_line_warnings in the Gradle documentation.
BUILD SUCCESSFUL in 4m 48s
254 actionable tasks: 246 executed, 8 up-to-date
Publishing build scan...
https://ge.apache.org/s/6zmf5tmm2k4t6
Build step 'Invoke Gradle script' changed build result to SUCCESS
Run condition [Always] enabling perform for step [Execute shell]
[Solr-Smoketest-9.x] $ /bin/bash /tmp/jenkins11736077389859115357.sh
Installing Python script requirements
Defaulting to user installation because normal site-packages is not writeable
Requirement already satisfied: six~=1.16.0 in /home/jenkins/.local/lib/python3.8/site-packages (from -r dev-tools/scripts/requirements.txt (line 1)) (1.16.0)
Requirement already satisfied: Jinja2~=3.1.1 in /home/jenkins/.local/lib/python3.8/site-packages (from -r dev-tools/scripts/requirements.txt (line 2)) (3.1.2)
Requirement already satisfied: PyYAML~=6.0 in /home/jenkins/.local/lib/python3.8/site-packages (from -r dev-tools/scripts/requirements.txt (line 3)) (6.0)
Requirement already satisfied: holidays~=0.16 in /home/jenkins/.local/lib/python3.8/site-packages (from -r dev-tools/scripts/requirements.txt (line 4)) (0.21)
Requirement already satisfied: ics~=0.7.2 in /home/jenkins/.local/lib/python3.8/site-packages (from -r dev-tools/scripts/requirements.txt (line 5)) (0.7.2)
Requirement already satisfied: console-menu~=0.7.1 in /home/jenkins/.local/lib/python3.8/site-packages (from -r dev-tools/scripts/requirements.txt (line 6)) (0.7.1)
Requirement already satisfied: PyGithub~=1.56 in /home/jenkins/.local/lib/python3.8/site-packages (from -r dev-tools/scripts/requirements.txt (line 7)) (1.58.0)
Requirement already satisfied: jira~=3.4.1 in /home/jenkins/.local/lib/python3.8/site-packages (from -r dev-tools/scripts/requirements.txt (line 8)) (3.4.1)
Requirement already satisfied: MarkupSafe>=2.0 in /home/jenkins/.local/lib/python3.8/site-packages (from Jinja2~=3.1.1->-r dev-tools/scripts/requirements.txt (line 2)) (2.1.2)
Requirement already satisfied: PyMeeus in /home/jenkins/.local/lib/python3.8/site-packages (from holidays~=0.16->-r dev-tools/scripts/requirements.txt (line 4)) (0.5.11)
Requirement already satisfied: convertdate>=2.3.0 in /home/jenkins/.local/lib/python3.8/site-packages (from holidays~=0.16->-r dev-tools/scripts/requirements.txt (line 4)) (2.4.0)
Requirement already satisfied: hijri-converter in /home/jenkins/.local/lib/python3.8/site-packages (from holidays~=0.16->-r dev-tools/scripts/requirements.txt (line 4)) (2.2.3)
Requirement already satisfied: korean-lunar-calendar in /home/jenkins/.local/lib/python3.8/site-packages (from holidays~=0.16->-r dev-tools/scripts/requirements.txt (line 4)) (0.2.1)
Requirement already satisfied: python-dateutil in /usr/lib/python3/dist-packages (from holidays~=0.16->-r dev-tools/scripts/requirements.txt (line 4)) (2.7.3)
Requirement already satisfied: backports.zoneinfo in /home/jenkins/.local/lib/python3.8/site-packages (from holidays~=0.16->-r dev-tools/scripts/requirements.txt (line 4)) (0.2.1)
Requirement already satisfied: arrow>=0.11 in /home/jenkins/.local/lib/python3.8/site-packages (from ics~=0.7.2->-r dev-tools/scripts/requirements.txt (line 5)) (0.14.7)
Requirement already satisfied: tatsu>4.2 in /home/jenkins/.local/lib/python3.8/site-packages (from ics~=0.7.2->-r dev-tools/scripts/requirements.txt (line 5)) (5.6.1)
Requirement already satisfied: attrs>=19.1.0 in /usr/lib/python3/dist-packages (from ics~=0.7.2->-r dev-tools/scripts/requirements.txt (line 5)) (19.3.0)
Requirement already satisfied: ansiwrap in /home/jenkins/.local/lib/python3.8/site-packages (from console-menu~=0.7.1->-r dev-tools/scripts/requirements.txt (line 6)) (0.8.4)
Requirement already satisfied: deprecated in /home/jenkins/.local/lib/python3.8/site-packages (from PyGithub~=1.56->-r dev-tools/scripts/requirements.txt (line 7)) (1.2.13)
Requirement already satisfied: pyjwt>=2.4.0 in /home/jenkins/.local/lib/python3.8/site-packages (from PyGithub~=1.56->-r dev-tools/scripts/requirements.txt (line 7)) (2.6.0)
Requirement already satisfied: pynacl>=1.4.0 in /home/jenkins/.local/lib/python3.8/site-packages (from PyGithub~=1.56->-r dev-tools/scripts/requirements.txt (line 7)) (1.5.0)
Requirement already satisfied: requests>=2.14.0 in /usr/lib/python3/dist-packages (from PyGithub~=1.56->-r dev-tools/scripts/requirements.txt (line 7)) (2.22.0)
Requirement already satisfied: defusedxml in /home/jenkins/.local/lib/python3.8/site-packages (from jira~=3.4.1->-r dev-tools/scripts/requirements.txt (line 8)) (0.7.1)
Requirement already satisfied: packaging in /home/jenkins/.local/lib/python3.8/site-packages (from jira~=3.4.1->-r dev-tools/scripts/requirements.txt (line 8)) (23.0)
Requirement already satisfied: requests-oauthlib>=1.1.0 in /home/jenkins/.local/lib/python3.8/site-packages (from jira~=3.4.1->-r dev-tools/scripts/requirements.txt (line 8)) (1.3.1)
Requirement already satisfied: requests-toolbelt in /home/jenkins/.local/lib/python3.8/site-packages (from jira~=3.4.1->-r dev-tools/scripts/requirements.txt (line 8)) (0.9.1)
Requirement already satisfied: typing-extensions>=3.7.4.2 in /home/jenkins/.local/lib/python3.8/site-packages (from jira~=3.4.1->-r dev-tools/scripts/requirements.txt (line 8)) (4.5.0)
Requirement already satisfied: cffi>=1.4.1 in /usr/local/lib/python3.8/dist-packages (from pynacl>=1.4.0->PyGithub~=1.56->-r dev-tools/scripts/requirements.txt (line 7)) (1.14.2)
Requirement already satisfied: oauthlib>=3.0.0 in /usr/lib/python3/dist-packages (from requests-oauthlib>=1.1.0->jira~=3.4.1->-r dev-tools/scripts/requirements.txt (line 8)) (3.1.0)
Requirement already satisfied: textwrap3>=0.9.2 in /home/jenkins/.local/lib/python3.8/site-packages (from ansiwrap->console-menu~=0.7.1->-r dev-tools/scripts/requirements.txt (line 6)) (0.9.2)
Requirement already satisfied: wrapt<2,>=1.10 in /home/jenkins/.local/lib/python3.8/site-packages (from deprecated->PyGithub~=1.56->-r dev-tools/scripts/requirements.txt (line 7)) (1.13.3)
Requirement already satisfied: pycparser in /usr/local/lib/python3.8/dist-packages (from cffi>=1.4.1->pynacl>=1.4.0->PyGithub~=1.56->-r dev-tools/scripts/requirements.txt (line 7)) (2.20)
DEPRECATION: dblatex 0.3.11py3 has a non-standard version number. pip 24.1 will enforce this behaviour change. A possible replacement is to upgrade to a newer version of dblatex or contact the author to suggest that they release a version with a conforming version number. Discussion can be found at https://github.com/pypa/pip/issues/12063
DEPRECATION: devscripts 2.20.2ubuntu2 has a non-standard version number. pip 24.1 will enforce this behaviour change. A possible replacement is to upgrade to a newer version of devscripts or contact the author to suggest that they release a version with a conforming version number. Discussion can be found at https://github.com/pypa/pip/issues/12063
Starting Smoke tester in folder /home/jenkins/jenkins-slave/workspace/Solr/Solr-Smoketest-9.x
Java 11 JAVA_HOME=/home/jenkins/tools/java/latest11
NOTE: output encoding is utf-8
NOTE: Not running @Nightly or @BadApple tests. Please verify that recent Jenkins runs have passed.
Load release URL "file:///home/jenkins/jenkins-slave/workspace/Solr/Solr-Smoketest-9.x/solr/distribution/build/release"...
Get KEYS...
Downloading online KEYS file https://archive.apache.org/dist/solr/KEYS
Downloading https://archive.apache.org/dist/solr/KEYS
0.3 MB in 1.20 sec (0.3 MB/sec)
Test Solr...
test basics...
check changes HTML...
check OpenAPI specification...
download solr-9.6.0-slim.tgz...
Downloading file:///home/jenkins/jenkins-slave/workspace/Solr/Solr-Smoketest-9.x/solr/distribution/build/release/solr-9.6.0-slim.tgz
61.2 MB in 0.05 sec (1242.5 MB/sec)
verify sha512 digest
download solr-9.6.0-src.tgz...
Downloading file:///home/jenkins/jenkins-slave/workspace/Solr/Solr-Smoketest-9.x/solr/distribution/build/release/solr-9.6.0-src.tgz
86.0 MB in 0.07 sec (1181.3 MB/sec)
verify sha512 digest
download solr-9.6.0.tgz...
Downloading file:///home/jenkins/jenkins-slave/workspace/Solr/Solr-Smoketest-9.x/solr/distribution/build/release/solr-9.6.0.tgz
269.0 MB in 0.21 sec (1265.6 MB/sec)
verify sha512 digest
unpack solr-9.6.0.tgz...
solr-9.6.0.tgz
Checking LICENSE.txt
Checking NOTICE.txt
Checking README.txt
Checking CHANGES.txt
Checking bin
Checking modules
Checking docker
Checking prometheus-exporter
Checking docs
Checking example
Checking licenses
Checking server
Checking lib
verify JAR metadata/identity/no javax.* or java.* classes...
**WARNING**: skipping check of /home/jenkins/jenkins-slave/workspace/Solr/Solr-Smoketest-9.x/_tmp/smoke_1709888201/unpack/solr-9.6.0/modules/extraction/lib/unit-api-1.0.jar: it has javax.* classes
**WARNING**: skipping check of /home/jenkins/jenkins-slave/workspace/Solr/Solr-Smoketest-9.x/_tmp/smoke_1709888201/unpack/solr-9.6.0/modules/extraction/lib/jakarta.activation-1.2.2.jar: it has javax.* classes
**WARNING**: skipping check of /home/jenkins/jenkins-slave/workspace/Solr/Solr-Smoketest-9.x/_tmp/smoke_1709888201/unpack/solr-9.6.0/modules/extraction/lib/jakarta.activation-api-1.2.2.jar: it has javax.* classes
**WARNING**: skipping check of /home/jenkins/jenkins-slave/workspace/Solr/Solr-Smoketest-9.x/_tmp/smoke_1709888201/unpack/solr-9.6.0/modules/extraction/lib/jakarta.xml.bind-api-2.3.3.jar: it has javax.* classes
**WARNING**: skipping check of /home/jenkins/jenkins-slave/workspace/Solr/Solr-Smoketest-9.x/_tmp/smoke_1709888201/unpack/solr-9.6.0/server/solr-webapp/webapp/WEB-INF/lib/jakarta.validation-api-3.0.2.jar: it has javax.* classes
**WARNING**: skipping check of /home/jenkins/jenkins-slave/workspace/Solr/Solr-Smoketest-9.x/_tmp/smoke_1709888201/unpack/solr-9.6.0/server/solr-webapp/webapp/WEB-INF/lib/jakarta.annotation-api-2.1.1.jar: it has javax.* classes
**WARNING**: skipping check of /home/jenkins/jenkins-slave/workspace/Solr/Solr-Smoketest-9.x/_tmp/smoke_1709888201/unpack/solr-9.6.0/server/solr-webapp/webapp/WEB-INF/lib/jakarta.inject-api-2.0.1.jar: it has javax.* classes
**WARNING**: skipping check of /home/jenkins/jenkins-slave/workspace/Solr/Solr-Smoketest-9.x/_tmp/smoke_1709888201/unpack/solr-9.6.0/server/solr-webapp/webapp/WEB-INF/lib/jakarta.ws.rs-api-3.1.0.jar: it has javax.* classes
**WARNING**: skipping check of /home/jenkins/jenkins-slave/workspace/Solr/Solr-Smoketest-9.x/_tmp/smoke_1709888201/unpack/solr-9.6.0/server/lib/ext/jetty-servlet-api-4.0.6.jar: it has javax.* classes
copying unpacked distribution for Java 11 ...
test solr example w/ Java 11...
start Solr instance (log=/home/jenkins/jenkins-slave/workspace/Solr/Solr-Smoketest-9.x/_tmp/smoke_1709888201/unpack/solr-9.6.0-java11/solr-example.log)...
No process found for Solr node running on port 8983
Running techproducts example on port 8983 from /home/jenkins/jenkins-slave/workspace/Solr/Solr-Smoketest-9.x/_tmp/smoke_1709888201/unpack/solr-9.6.0-java11
*** [WARN] *** Your open file limit is currently 60000.
It should be set to 65000 to avoid operational disruption.
If you no longer wish to see this warning, set SOLR_ULIMIT_CHECKS to false in your profile or solr.in.sh
*** [WARN] *** Your Max Processes Limit is currently 30000.
It should be set to 65000 to avoid operational disruption.
If you no longer wish to see this warning, set SOLR_ULIMIT_CHECKS to false in your profile or solr.in.sh
Creating Solr home directory /home/jenkins/jenkins-slave/workspace/Solr/Solr-Smoketest-9.x/_tmp/smoke_1709888201/unpack/solr-9.6.0-java11/example/techproducts/solr
Starting up Solr on port 8983 using command:
"bin/solr" start -p 8983 -s "example/techproducts/solr"
*** [WARN] *** Your open file limit is currently 60000.
It should be set to 65000 to avoid operational disruption.
If you no longer wish to see this warning, set SOLR_ULIMIT_CHECKS to false in your profile or solr.in.sh
*** [WARN] *** Your Max Processes Limit is currently 30000.
It should be set to 65000 to avoid operational disruption.
If you no longer wish to see this warning, set SOLR_ULIMIT_CHECKS to false in your profile or solr.in.sh
Waiting up to 180 seconds to see Solr running on port 8983 [|] [/] [-] [\] [|]
Started Solr server on port 8983 (pid=3454170). Happy searching!
Created new core 'techproducts'
Indexing tech product example docs from /home/jenkins/jenkins-slave/workspace/Solr/Solr-Smoketest-9.x/_tmp/smoke_1709888201/unpack/solr-9.6.0-java11/example/exampledocs
Posting files to [base] url http://localhost:8983/solr/techproducts/update using content-type application/xml...
POSTing file solr.xml to [base]
POSTing file sd500.xml to [base]
POSTing file hd.xml to [base]
POSTing file manufacturers.xml to [base]
POSTing file ipod_other.xml to [base]
POSTing file gb18030-example.xml to [base]
POSTing file mp500.xml to [base]
POSTing file vidcard.xml to [base]
POSTing file utf8-example.xml to [base]
POSTing file monitor2.xml to [base]
POSTing file money.xml to [base]
POSTing file monitor.xml to [base]
POSTing file ipod_video.xml to [base]
POSTing file mem.xml to [base]
14 files indexed.
COMMITting Solr index changes to http://localhost:8983/solr/techproducts/update...
Time spent: 0:00:00.525
test utf8...
run query...
stop server using: bin/solr stop -p 8983
Sending stop command to Solr running on port 8983 ... waiting up to 180 seconds to allow Jetty process 3454170 to stop gracefully.
[|] [/] [-] [\] unpack solr-9.6.0-slim.tgz...
solr-9.6.0-slim.tgz
Checking LICENSE.txt
Checking NOTICE.txt
Checking README.txt
Checking CHANGES.txt
Checking bin
Checking docker
Checking docs
Checking example
Checking licenses
Checking server
Checking lib
verify JAR metadata/identity/no javax.* or java.* classes...
**WARNING**: skipping check of /home/jenkins/jenkins-slave/workspace/Solr/Solr-Smoketest-9.x/_tmp/smoke_1709888201/unpack/solr-9.6.0-slim/server/solr-webapp/webapp/WEB-INF/lib/jakarta.validation-api-3.0.2.jar: it has javax.* classes
**WARNING**: skipping check of /home/jenkins/jenkins-slave/workspace/Solr/Solr-Smoketest-9.x/_tmp/smoke_1709888201/unpack/solr-9.6.0-slim/server/solr-webapp/webapp/WEB-INF/lib/jakarta.annotation-api-2.1.1.jar: it has javax.* classes
**WARNING**: skipping check of /home/jenkins/jenkins-slave/workspace/Solr/Solr-Smoketest-9.x/_tmp/smoke_1709888201/unpack/solr-9.6.0-slim/server/solr-webapp/webapp/WEB-INF/lib/jakarta.inject-api-2.0.1.jar: it has javax.* classes
**WARNING**: skipping check of /home/jenkins/jenkins-slave/workspace/Solr/Solr-Smoketest-9.x/_tmp/smoke_1709888201/unpack/solr-9.6.0-slim/server/solr-webapp/webapp/WEB-INF/lib/jakarta.ws.rs-api-3.1.0.jar: it has javax.* classes
**WARNING**: skipping check of /home/jenkins/jenkins-slave/workspace/Solr/Solr-Smoketest-9.x/_tmp/smoke_1709888201/unpack/solr-9.6.0-slim/server/lib/ext/jetty-servlet-api-4.0.6.jar: it has javax.* classes
copying unpacked distribution for Java 11 ...
test solr example w/ Java 11...
start Solr instance (log=/home/jenkins/jenkins-slave/workspace/Solr/Solr-Smoketest-9.x/_tmp/smoke_1709888201/unpack/solr-9.6.0-slim-java11/solr-example.log)...
No process found for Solr node running on port 8983
Running techproducts example on port 8983 from /home/jenkins/jenkins-slave/workspace/Solr/Solr-Smoketest-9.x/_tmp/smoke_1709888201/unpack/solr-9.6.0-slim-java11
*** [WARN] *** Your open file limit is currently 60000.
It should be set to 65000 to avoid operational disruption.
If you no longer wish to see this warning, set SOLR_ULIMIT_CHECKS to false in your profile or solr.in.sh
*** [WARN] *** Your Max Processes Limit is currently 30000.
It should be set to 65000 to avoid operational disruption.
If you no longer wish to see this warning, set SOLR_ULIMIT_CHECKS to false in your profile or solr.in.sh
Creating Solr home directory /home/jenkins/jenkins-slave/workspace/Solr/Solr-Smoketest-9.x/_tmp/smoke_1709888201/unpack/solr-9.6.0-slim-java11/example/techproducts/solr
Starting up Solr on port 8983 using command:
"bin/solr" start -p 8983 -s "example/techproducts/solr"
*** [WARN] *** Your open file limit is currently 60000.
It should be set to 65000 to avoid operational disruption.
If you no longer wish to see this warning, set SOLR_ULIMIT_CHECKS to false in your profile or solr.in.sh
*** [WARN] *** Your Max Processes Limit is currently 30000.
It should be set to 65000 to avoid operational disruption.
If you no longer wish to see this warning, set SOLR_ULIMIT_CHECKS to false in your profile or solr.in.sh
Waiting up to 180 seconds to see Solr running on port 8983 [|] [/] [-] [\] [|]
Started Solr server on port 8983 (pid=3454847). Happy searching!
Created new core 'techproducts'
Indexing tech product example docs from /home/jenkins/jenkins-slave/workspace/Solr/Solr-Smoketest-9.x/_tmp/smoke_1709888201/unpack/solr-9.6.0-slim-java11/example/exampledocs
Posting files to [base] url http://localhost:8983/solr/techproducts/update using content-type application/xml...
POSTing file solr.xml to [base]
POSTing file sd500.xml to [base]
POSTing file hd.xml to [base]
POSTing file manufacturers.xml to [base]
POSTing file ipod_other.xml to [base]
POSTing file gb18030-example.xml to [base]
POSTing file mp500.xml to [base]
POSTing file vidcard.xml to [base]
POSTing file utf8-example.xml to [base]
POSTing file monitor2.xml to [base]
POSTing file money.xml to [base]
POSTing file monitor.xml to [base]
POSTing file ipod_video.xml to [base]
POSTing file mem.xml to [base]
14 files indexed.
COMMITting Solr index changes to http://localhost:8983/solr/techproducts/update...
Time spent: 0:00:00.771
test utf8...
run query...
stop server using: bin/solr stop -p 8983
Sending stop command to Solr running on port 8983 ... waiting up to 180 seconds to allow Jetty process 3454847 to stop gracefully.
[|] [/] [-] [\] [|] unpack solr-9.6.0-src.tgz...
solr-9.6.0-src.tgz
Checking LICENSE.txt
Checking NOTICE.txt
Checking README.md
Checking CONTRIBUTING.md
Checking CHANGES.txt
Checking README.adoc
Checking buildSrc
Checking dev-docs
Checking dev-tools
Checking gradle
Checking help
Checking solr
Checking build.gradle
Checking gradlew
Checking gradlew.bat
Checking settings.gradle
Checking versions.lock
Checking versions.props
Checking benchmark
Checking bin
Checking modules
Checking api
Checking core
Checking docker
Checking documentation
Checking example
Checking licenses
Checking packaging
Checking distribution
Checking prometheus-exporter
Checking server
Checking solr-ref-guide
Checking solrj
Checking solrj-streaming
Checking solrj-zookeeper
Checking test-framework
Checking webapp
Checking .gitignore
Checking .gitattributes
Checking build.gradle
make sure no JARs/WARs in src dist...
run "./gradlew --no-daemon check -p solr/documentation"
run tests w/ Java 11 and testArgs='-Dtests.nightly=false -Dtests.badapples=false '...
command "export JAVA_HOME="/home/jenkins/tools/java/latest11" PATH="/home/jenkins/tools/java/latest11/bin:$PATH" JAVACMD="/home/jenkins/tools/java/latest11/bin/java"; ./gradlew --no-daemon test -Dtests.nightly=false -Dtests.badapples=false " failed:
To honour the JVM settings for this build a single-use Daemon process will be forked. For more on this, please refer to https://docs.gradle.org/8.4/userguide/gradle_daemon.html#sec:disabling_the_daemon in the Gradle documentation.
Daemon will be stopped at the end of the build
Gradle Enterprise plugins resolution: https://plugins.gradle.org/m2
Enforcing Gradle Enterprise: https://ge.apache.org, allowUntrustedServer: false
> Task :buildSrc:compileJava UP-TO-DATE
> Task :buildSrc:compileGroovy NO-SOURCE
> Task :buildSrc:processResources NO-SOURCE
> Task :buildSrc:classes UP-TO-DATE
> Task :buildSrc:jar UP-TO-DATE
> Task :solr:api:processResources NO-SOURCE
> Task :solr:api:processTestResources
> Task :solr:core:processResources UP-TO-DATE
> Task :solr:solrj:processResources UP-TO-DATE
> Task :solr:solrj-streaming:processResources UP-TO-DATE
> Task :solr:solrj-zookeeper:processResources NO-SOURCE
> Task :solr:test-framework:processResources
> Task :solr:benchmark:processResources
> Task :solr:benchmark:processTestResources
> Task :gitStatus
> Task :checkJdkInternalsExportedToGradle
> Task :solr:api:compileJava UP-TO-DATE
> Task :solr:api:classes UP-TO-DATE
> Task :solr:api:jar UP-TO-DATE
> Task :ensureJdkSupported
> Task :randomizationInfo
Running tests with randomization seed: tests.seed=A99AE5B9B6D5CB18
> Task :solr:api:resolve UP-TO-DATE
> Task :solr:core:processTestResources
> Task :solr:modules:analysis-extras:processResources NO-SOURCE
> Task :solr:prometheus-exporter:processResources NO-SOURCE
> Task :solr:prometheus-exporter:processTestResources
> Task :solr:server:compileJava SKIPPED
> Task :solr:server:processResources NO-SOURCE
> Task :solr:server:classes UP-TO-DATE
> Task :solr:server:compileTestJava NO-SOURCE
> Task :solr:server:processTestResources NO-SOURCE
> Task :solr:server:testClasses UP-TO-DATE
> Task :solr:server:test NO-SOURCE
> Task :solr:server:wipeTaskTemp
> Task :solr:solr-ref-guide:compileJava NO-SOURCE
> Task :solr:solr-ref-guide:processResources NO-SOURCE
> Task :solr:solr-ref-guide:classes UP-TO-DATE
> Task :solr:solr-ref-guide:copySolrjTestResources
> Task :solr:solr-ref-guide:processTestResources NO-SOURCE
> Task :solr:solrj-streaming:processTestResources
> Task :solr:modules:sql:processResources
> Task :solr:solrj-zookeeper:processTestResources
> Task :solr:test-framework:processTestResources
> Task :solr:webapp:processResources NO-SOURCE
> Task :solr:webapp:processTestResources NO-SOURCE
> Task :solr:modules:analysis-extras:processTestResources
> Task :solr:modules:analytics:processResources NO-SOURCE
> Task :solr:modules:analytics:processTestResources
> Task :solr:modules:clustering:processResources NO-SOURCE
> Task :solr:modules:clustering:processTestResources
> Task :solr:modules:extraction:processResources
> Task :solr:modules:extraction:processTestResources
> Task :solr:modules:gcs-repository:processResources NO-SOURCE
> Task :solr:modules:gcs-repository:processTestResources
> Task :solr:modules:hadoop-auth:processResources NO-SOURCE
> Task :solr:modules:hadoop-auth:copySolrCoreTestResources
> Task :solr:modules:hadoop-auth:processTestResources
> Task :solr:modules:hdfs:processResources NO-SOURCE
> Task :solr:modules:hdfs:copySolrCoreTestResources
> Task :solr:modules:hdfs:processTestResources
> Task :solr:modules:jaegertracer-configurator:processResources NO-SOURCE
> Task :solr:modules:jaegertracer-configurator:processTestResources
> Task :solr:modules:jwt-auth:processResources NO-SOURCE
> Task :solr:modules:jwt-auth:processTestResources
> Task :solr:modules:langid:processResources
> Task :solr:modules:langid:processTestResources
> Task :solr:modules:ltr:processResources NO-SOURCE
> Task :solr:modules:ltr:processTestResources
> Task :solr:modules:opentelemetry:processResources NO-SOURCE
> Task :solr:modules:opentelemetry:processTestResources
> Task :solr:modules:s3-repository:processResources NO-SOURCE
> Task :solr:modules:s3-repository:processTestResources
> Task :solr:modules:scripting:processResources NO-SOURCE
> Task :solr:modules:scripting:processTestResources
> Task :solr:modules:sql:copySolrCoreTestResources
> Task :solr:modules:sql:processTestResources
> Task :solr:solrj:openApiGenerate
################################################################################
# Thanks for using OpenAPI Generator. #
# Please consider donation to help us maintain this project ๐ #
# https://opencollective.com/openapi_generator/donate #
################################################################################
Successfully generated code to /home/jenkins/jenkins-slave/workspace/Solr/Solr-Smoketest-9.x/_tmp/smoke_1709888201/unpack/solr-9.6.0/solr/solrj/build/generated/
> Task :spotlessInternalRegisterDependencies UP-TO-DATE
> Task :solr:solrj:compileJava UP-TO-DATE
> Task :solr:solrj-streaming:compileJava UP-TO-DATE
> Task :solr:solrj-zookeeper:compileJava UP-TO-DATE
> Task :solr:core:compileJava UP-TO-DATE
> Task :solr:test-framework:compileJava UP-TO-DATE
> Task :solr:solrj:generatedSpotlessHelper
> Task :solr:solrj:generatedSpotless
> Task :solr:core:classes UP-TO-DATE
> Task :solr:core:jar UP-TO-DATE
> Task :solr:solrj:classes UP-TO-DATE
> Task :solr:solrj:jar UP-TO-DATE
> Task :solr:solrj-streaming:classes UP-TO-DATE
> Task :solr:solrj-streaming:jar UP-TO-DATE
> Task :solr:solrj-zookeeper:classes UP-TO-DATE
> Task :solr:solrj-zookeeper:jar UP-TO-DATE
> Task :solr:test-framework:classes
> Task :solr:test-framework:jar
> Task :solr:api:compileTestJava
> Task :solr:api:testClasses
> Task :solr:benchmark:compileJava
Note: /home/jenkins/jenkins-slave/workspace/Solr/Solr-Smoketest-9.x/_tmp/smoke_1709888201/unpack/solr-9.6.0/solr/benchmark/src/java/org/apache/solr/bench/search/StreamingSearch.java uses or overrides a deprecated API.
Note: Recompile with -Xlint:deprecation for details.
> Task :solr:benchmark:classes
> Task :solr:benchmark:compileTestJava
> Task :solr:benchmark:testClasses
> Task :solr:api:test
:solr:api:test (SUCCESS): 6 test(s)
> Task :solr:api:wipeTaskTemp
> Task :solr:benchmark:test
:solr:benchmark:test (SUCCESS): 11 test(s)
> Task :solr:benchmark:wipeTaskTemp
> Task :solr:modules:analysis-extras:compileJava
Note: /home/jenkins/jenkins-slave/workspace/Solr/Solr-Smoketest-9.x/_tmp/smoke_1709888201/unpack/solr-9.6.0/solr/modules/analysis-extras/src/java/org/apache/solr/schema/ICUCollationField.java uses or overrides a deprecated API.
Note: Recompile with -Xlint:deprecation for details.
> Task :solr:modules:analysis-extras:classes
> Task :solr:modules:analysis-extras:jar
> Task :solr:prometheus-exporter:compileJava
Note: Some input files use or override a deprecated API.
Note: Recompile with -Xlint:deprecation for details.
> Task :solr:prometheus-exporter:classes
> Task :solr:prometheus-exporter:compileTestJava
Note: /home/jenkins/jenkins-slave/workspace/Solr/Solr-Smoketest-9.x/_tmp/smoke_1709888201/unpack/solr-9.6.0/solr/prometheus-exporter/src/test/org/apache/solr/prometheus/exporter/MetricsQueryTemplateTest.java uses or overrides a deprecated API.
Note: Recompile with -Xlint:deprecation for details.
> Task :solr:prometheus-exporter:testClasses
> Task :solr:core:compileTestJava
> Task :solr:prometheus-exporter:test
:solr:prometheus-exporter:test (SUCCESS): 23 test(s)
> Task :solr:prometheus-exporter:wipeTaskTemp
> Task :solr:solr-ref-guide:compileTestJava
Note: Some input files use or override a deprecated API.
Note: Recompile with -Xlint:deprecation for details.
> Task :solr:solr-ref-guide:testClasses
> Task :solr:solr-ref-guide:test
:solr:solr-ref-guide:test (SUCCESS): 32 test(s)
> Task :solr:solr-ref-guide:wipeTaskTemp
> Task :solr:core:compileTestJava
Note: Some input files use or override a deprecated API.
Note: Recompile with -Xlint:deprecation for details.
> Task :solr:core:testClasses
> Task :solr:solrj:compileTestJava
Note: Some input files use or override a deprecated API.
Note: Recompile with -Xlint:deprecation for details.
> Task :solr:core:test
org.apache.solr.TestGroupingSearch > testGroupingWithTimeAllowed FAILED
java.lang.RuntimeException: Path not found: /responseHeader/partialResults
at __randomizedtesting.SeedInfo.seed([A99AE5B9B6D5CB18:F9DA34C74B4D2F93]:0)
at org.apache.solr.SolrTestCaseJ4.assertJQ(SolrTestCaseJ4.java:1113)
at org.apache.solr.SolrTestCaseJ4.assertJQ(SolrTestCaseJ4.java:1059)
at org.apache.solr.TestGroupingSearch.testGroupingWithTimeAllowed(TestGroupingSearch.java:464)
at java.base/jdk.internal.reflect.NativeMethodAccessorImpl.invoke0(Native Method)
at java.base/jdk.internal.reflect.NativeMethodAccessorImpl.invoke(NativeMethodAccessorImpl.java:62)
at java.base/jdk.internal.reflect.DelegatingMethodAccessorImpl.invoke(DelegatingMethodAccessorImpl.java:43)
at java.base/java.lang.reflect.Method.invoke(Method.java:566)
at com.carrotsearch.randomizedtesting.RandomizedRunner.invoke(RandomizedRunner.java:1758)
at com.carrotsearch.randomizedtesting.RandomizedRunner$8.evaluate(RandomizedRunner.java:946)
at com.carrotsearch.randomizedtesting.RandomizedRunner$9.evaluate(RandomizedRunner.java:982)
at com.carrotsearch.randomizedtesting.RandomizedRunner$10.evaluate(RandomizedRunner.java:996)
at com.carrotsearch.randomizedtesting.rules.SystemPropertiesRestoreRule$1.evaluate(SystemPropertiesRestoreRule.java:80)
at org.junit.rules.RunRules.evaluate(RunRules.java:20)
at org.apache.lucene.tests.util.TestRuleSetupTeardownChained$1.evaluate(TestRuleSetupTeardownChained.java:48)
at org.apache.lucene.tests.util.AbstractBeforeAfterRule$1.evaluate(AbstractBeforeAfterRule.java:43)
at org.apache.lucene.tests.util.TestRuleThreadAndTestName$1.evaluate(TestRuleThreadAndTestName.java:45)
at org.apache.lucene.tests.util.TestRuleIgnoreAfterMaxFailures$1.evaluate(TestRuleIgnoreAfterMaxFailures.java:60)
at org.apache.lucene.tests.util.TestRuleMarkFailure$1.evaluate(TestRuleMarkFailure.java:44)
at org.junit.rules.RunRules.evaluate(RunRules.java:20)
at com.carrotsearch.randomizedtesting.rules.StatementAdapter.evaluate(StatementAdapter.java:36)
at com.carrotsearch.randomizedtesting.ThreadLeakControl$StatementRunner.run(ThreadLeakControl.java:390)
at com.carrotsearch.randomizedtesting.ThreadLeakControl.forkTimeoutingTask(ThreadLeakControl.java:843)
at com.carrotsearch.randomizedtesting.ThreadLeakControl$3.evaluate(ThreadLeakControl.java:490)
at com.carrotsearch.randomizedtesting.RandomizedRunner.runSingleTest(RandomizedRunner.java:955)
at com.carrotsearch.randomizedtesting.RandomizedRunner$5.evaluate(RandomizedRunner.java:840)
at com.carrotsearch.randomizedtesting.RandomizedRunner$6.evaluate(RandomizedRunner.java:891)
at com.carrotsearch.randomizedtesting.RandomizedRunner$7.evaluate(RandomizedRunner.java:902)
at com.carrotsearch.randomizedtesting.rules.StatementAdapter.evaluate(StatementAdapter.java:36)
at com.carrotsearch.randomizedtesting.rules.StatementAdapter.evaluate(StatementAdapter.java:36)
at org.apache.lucene.tests.util.AbstractBeforeAfterRule$1.evaluate(AbstractBeforeAfterRule.java:43)
at org.apache.lucene.tests.util.AbstractBeforeAfterRule$1.evaluate(AbstractBeforeAfterRule.java:43)
at com.carrotsearch.randomizedtesting.rules.SystemPropertiesRestoreRule$1.evaluate(SystemPropertiesRestoreRule.java:80)
at org.junit.rules.RunRules.evaluate(RunRules.java:20)
at org.apache.lucene.tests.util.AbstractBeforeAfterRule$1.evaluate(AbstractBeforeAfterRule.java:43)
at com.carrotsearch.randomizedtesting.rules.StatementAdapter.evaluate(StatementAdapter.java:36)
at org.apache.lucene.tests.util.TestRuleStoreClassName$1.evaluate(TestRuleStoreClassName.java:38)
at com.carrotsearch.randomizedtesting.rules.NoShadowingOrOverridesOnMethodsRule$1.evaluate(NoShadowingOrOverridesOnMethodsRule.java:40)
at com.carrotsearch.randomizedtesting.rules.NoShadowingOrOverridesOnMethodsRule$1.evaluate(NoShadowingOrOverridesOnMethodsRule.java:40)
at com.carrotsearch.randomizedtesting.rules.StatementAdapter.evaluate(StatementAdapter.java:36)
at com.carrotsearch.randomizedtesting.rules.StatementAdapter.evaluate(StatementAdapter.java:36)
at org.apache.lucene.tests.util.TestRuleAssertionsRequired$1.evaluate(TestRuleAssertionsRequired.java:53)
at org.apache.lucene.tests.util.AbstractBeforeAfterRule$1.evaluate(AbstractBeforeAfterRule.java:43)
at org.apache.lucene.tests.util.TestRuleMarkFailure$1.evaluate(TestRuleMarkFailure.java:44)
at org.apache.lucene.tests.util.TestRuleIgnoreAfterMaxFailures$1.evaluate(TestRuleIgnoreAfterMaxFailures.java:60)
at org.apache.lucene.tests.util.TestRuleIgnoreTestSuites$1.evaluate(TestRuleIgnoreTestSuites.java:47)
at org.junit.rules.RunRules.evaluate(RunRules.java:20)
at com.carrotsearch.randomizedtesting.rules.StatementAdapter.evaluate(StatementAdapter.java:36)
at com.carrotsearch.randomizedtesting.ThreadLeakControl$StatementRunner.run(ThreadLeakControl.java:390)
at com.carrotsearch.randomizedtesting.ThreadLeakControl.lambda$forkTimeoutingTask$0(ThreadLeakControl.java:850)
at java.base/java.lang.Thread.run(Thread.java:829)
org.apache.solr.TestGroupingSearch > test suite's output saved to /home/jenkins/jenkins-slave/workspace/Solr/Solr-Smoketest-9.x/_tmp/smoke_1709888201/unpack/solr-9.6.0/solr/core/build/test-results/test/outputs/OUTPUT-org.apache.solr.TestGroupingSearch.txt, copied below:
2> 43605 INFO (SUITE-TestGroupingSearch-seed#[A99AE5B9B6D5CB18]-worker) [n: c: s: r: x: t:] o.a.s.SolrTestCase Setting 'solr.default.confdir' system property to test-framework derived value of '/home/jenkins/jenkins-slave/workspace/Solr/Solr-Smoketest-9.x/_tmp/smoke_1709888201/unpack/solr-9.6.0/solr/server/solr/configsets/_default/conf'
2> 43606 INFO (SUITE-TestGroupingSearch-seed#[A99AE5B9B6D5CB18]-worker) [n: c: s: r: x: t:] o.a.s.u.ErrorLogMuter Closing ErrorLogMuter-regex-35 after mutting 0 log messages
2> 43606 INFO (SUITE-TestGroupingSearch-seed#[A99AE5B9B6D5CB18]-worker) [n: c: s: r: x: t:] o.a.s.u.ErrorLogMuter Creating ErrorLogMuter-regex-36 for ERROR logs matching regex: ignore_exception
2> 43607 INFO (SUITE-TestGroupingSearch-seed#[A99AE5B9B6D5CB18]-worker) [n: c: s: r: x: t:] o.a.s.SolrTestCaseJ4 Created dataDir: /home/jenkins/jenkins-slave/workspace/Solr/Solr-Smoketest-9.x/_tmp/smoke_1709888201/unpack/solr-9.6.0/solr/core/build/tmp/tests-tmp/solr.TestGroupingSearch_A99AE5B9B6D5CB18-001/data-dir-12-001
2> 43607 WARN (SUITE-TestGroupingSearch-seed#[A99AE5B9B6D5CB18]-worker) [n: c: s: r: x: t:] o.a.s.SolrTestCaseJ4 startTrackingSearchers: numOpens=23 numCloses=23
2> 43607 INFO (SUITE-TestGroupingSearch-seed#[A99AE5B9B6D5CB18]-worker) [n: c: s: r: x: t:] o.a.s.SolrTestCaseJ4 Using PointFields (NUMERIC_POINTS_SYSPROP=true) w/NUMERIC_DOCVALUES_SYSPROP=false
2> 43607 INFO (SUITE-TestGroupingSearch-seed#[A99AE5B9B6D5CB18]-worker) [n: c: s: r: x: t:] o.a.s.SolrTestCaseJ4 Randomized ssl (false) and clientAuth (false) via: @org.apache.solr.util.RandomizeSSL(reason="", ssl=0.0/0.0, value=0.0/0.0, clientAuth=0.0/0.0)
2> 43608 INFO (SUITE-TestGroupingSearch-seed#[A99AE5B9B6D5CB18]-worker) [n: c: s: r: x: t:] o.a.s.SolrTestCaseJ4 SecureRandom sanity checks: test.solr.allowed.securerandom=null & java.security.egd=file:/dev/./urandom
2> 43609 INFO (SUITE-TestGroupingSearch-seed#[A99AE5B9B6D5CB18]-worker) [n: c: s: r: x: t:] o.a.s.SolrTestCaseJ4 ####initCore
2> 43613 INFO (SUITE-TestGroupingSearch-seed#[A99AE5B9B6D5CB18]-worker) [n: c: s: r: x: t:] o.a.s.c.SolrResourceLoader Added 2 libs to classloader, from paths: [/home/jenkins/jenkins-slave/workspace/Solr/Solr-Smoketest-9.x/_tmp/smoke_1709888201/unpack/solr-9.6.0/solr/core/build/resources/test/solr/collection1/lib, /home/jenkins/jenkins-slave/workspace/Solr/Solr-Smoketest-9.x/_tmp/smoke_1709888201/unpack/solr-9.6.0/solr/core/build/resources/test/solr/collection1/lib/classes]
2> 43626 INFO (SUITE-TestGroupingSearch-seed#[A99AE5B9B6D5CB18]-worker) [n: c: s: r: x: t:] o.a.s.c.SolrConfig Using Lucene MatchVersion: 9.9.2
2> 43627 WARN (SUITE-TestGroupingSearch-seed#[A99AE5B9B6D5CB18]-worker) [n: c: s: r: x: t:] o.a.s.c.SolrConfig solrconfig.xml: <boolTofilterOptimizer> is currently not implemented and has no effect.
2> 43630 INFO (SUITE-TestGroupingSearch-seed#[A99AE5B9B6D5CB18]-worker) [n: c: s: r: x: t:] o.a.s.s.IndexSchema Schema name=test
2> 43633 WARN (SUITE-TestGroupingSearch-seed#[A99AE5B9B6D5CB18]-worker) [n: c: s: r: x: t:] o.a.s.s.IndexSchema Field text is not multivalued and destination for multiple copyFields (2)
2> 43651 INFO (SUITE-TestGroupingSearch-seed#[A99AE5B9B6D5CB18]-worker) [n: c: s: r: x: t:] o.a.s.s.IndexSchema Loaded schema test/1.4 with uniqueid field id
2> 44237 INFO (SUITE-TestGroupingSearch-seed#[A99AE5B9B6D5CB18]-worker) [n: c: s: r: x: t:] o.a.s.u.t.SimplePropagator Always-on trace id generation enabled.
2> 44244 WARN (SUITE-TestGroupingSearch-seed#[A99AE5B9B6D5CB18]-worker) [n: c: s: r: x: t:] o.a.s.c.CoreContainer Not all security plugins configured! authentication=disabled authorization=disabled. Solr is only as secure as you make it. Consider configuring authentication/authorization before exposing Solr to users internal or external. See https://s.apache.org/solrsecurity for more info
2> 44268 INFO (coreLoadExecutor-324-thread-1) [n: c: s: r: x:collection1 t:] o.a.s.c.SolrResourceLoader Added 2 libs to classloader, from paths: [/home/jenkins/jenkins-slave/workspace/Solr/Solr-Smoketest-9.x/_tmp/smoke_1709888201/unpack/solr-9.6.0/solr/core/build/resources/test/solr/collection1/lib, /home/jenkins/jenkins-slave/workspace/Solr/Solr-Smoketest-9.x/_tmp/smoke_1709888201/unpack/solr-9.6.0/solr/core/build/resources/test/solr/collection1/lib/classes]
2> 44283 INFO (coreLoadExecutor-324-thread-1) [n: c: s: r: x:collection1 t:] o.a.s.c.SolrConfig Using Lucene MatchVersion: 9.9.2
2> 44283 WARN (coreLoadExecutor-324-thread-1) [n: c: s: r: x:collection1 t:] o.a.s.c.SolrConfig solrconfig.xml: <boolTofilterOptimizer> is currently not implemented and has no effect.
2> 44287 INFO (coreLoadExecutor-324-thread-1) [n: c: s: r: x:collection1 t:] o.a.s.s.IndexSchema Schema name=test
2> 44290 WARN (coreLoadExecutor-324-thread-1) [n: c: s: r: x:collection1 t:] o.a.s.s.IndexSchema Field text is not multivalued and destination for multiple copyFields (2)
2> 44321 INFO (coreLoadExecutor-324-thread-1) [n: c: s: r: x:collection1 t:] o.a.s.s.IndexSchema Loaded schema test/1.4 with uniqueid field id
2> 44343 INFO (coreLoadExecutor-324-thread-1) [n: c: s: r: x:collection1 t:] o.a.s.c.CoreContainer Creating SolrCore 'collection1' using configuration from instancedir /home/jenkins/jenkins-slave/workspace/Solr/Solr-Smoketest-9.x/_tmp/smoke_1709888201/unpack/solr-9.6.0/solr/core/build/resources/test/solr/collection1, trusted=true
2> 44343 INFO (coreLoadExecutor-324-thread-1) [n: c: s: r: x:collection1 t:] o.a.s.c.SolrCore Opening new SolrCore at [/home/jenkins/jenkins-slave/workspace/Solr/Solr-Smoketest-9.x/_tmp/smoke_1709888201/unpack/solr-9.6.0/solr/core/build/resources/test/solr/collection1], dataDir=[/home/jenkins/jenkins-slave/workspace/Solr/Solr-Smoketest-9.x/_tmp/smoke_1709888201/unpack/solr-9.6.0/solr/core/build/tmp/tests-tmp/solr.TestGroupingSearch_A99AE5B9B6D5CB18-001/data-dir-12-001/]
2> 44380 INFO (coreLoadExecutor-324-thread-1) [n: c: s: r: x:collection1 t:] o.a.s.j.SolrRequestAuthorizer Creating a new SolrRequestAuthorizer
2> 44384 INFO (coreLoadExecutor-324-thread-1) [n: c: s: r: x:collection1 t:] o.a.s.u.CommitTracker Hard AutoCommit: disabled
2> 44384 INFO (coreLoadExecutor-324-thread-1) [n: c: s: r: x:collection1 t:] o.a.s.u.CommitTracker Soft AutoCommit: disabled
2> 44451 INFO (coreLoadExecutor-324-thread-1) [n: c: s: r: x:collection1 t:] o.a.s.s.DirectSolrSpellChecker init: {minQueryLength=3, name=direct, classname=DirectSolrSpellChecker, field=lowerfilt}
2> 44451 INFO (coreLoadExecutor-324-thread-1) [n: c: s: r: x:collection1 t:] o.a.s.s.DirectSolrSpellChecker init: {minQueryLength=3, maxQueryFrequency=2, name=directMQF2, classname=DirectSolrSpellChecker, field=lowerfilt}
2> 44644 INFO (coreLoadExecutor-324-thread-1) [n: c: s: r: x:collection1 t:] o.a.s.h.ReplicationHandler Commits will be reserved for 10000 ms
2> 44645 INFO (searcherExecutor-326-thread-1-processing-collection1) [n: c: s: r: x:collection1 t:] o.a.s.h.c.SpellCheckComponent Loading spell index for spellchecker: default
2> 44645 INFO (searcherExecutor-326-thread-1-processing-collection1) [n: c: s: r: x:collection1 t:] o.a.s.h.c.SpellCheckComponent Loading spell index for spellchecker: direct
2> 44645 INFO (searcherExecutor-326-thread-1-processing-collection1) [n: c: s: r: x:collection1 t:] o.a.s.h.c.SpellCheckComponent Loading spell index for spellchecker: directMQF2
2> 44645 INFO (searcherExecutor-326-thread-1-processing-collection1) [n: c: s: r: x:collection1 t:] o.a.s.h.c.SpellCheckComponent Loading spell index for spellchecker: wordbreak
2> 44645 INFO (searcherExecutor-326-thread-1-processing-collection1) [n: c: s: r: x:collection1 t:] o.a.s.h.c.SpellCheckComponent Loading spell index for spellchecker: multipleFields
2> 44646 INFO (searcherExecutor-326-thread-1-processing-collection1) [n: c: s: r: x:collection1 t:] o.a.s.h.c.SpellCheckComponent Loading spell index for spellchecker: jarowinkler
2> 44646 INFO (searcherExecutor-326-thread-1-processing-collection1) [n: c: s: r: x:collection1 t:] o.a.s.h.c.SpellCheckComponent Loading spell index for spellchecker: external
2> 44646 INFO (searcherExecutor-326-thread-1-processing-collection1) [n: c: s: r: x:collection1 t:] o.a.s.h.c.SpellCheckComponent Loading spell index for spellchecker: freq
2> 44647 INFO (searcherExecutor-326-thread-1-processing-collection1) [n: c: s: r: x:collection1 t:] o.a.s.h.c.SpellCheckComponent Loading spell index for spellchecker: fqcn
2> 44647 INFO (searcherExecutor-326-thread-1-processing-collection1) [n: c: s: r: x:collection1 t:] o.a.s.h.c.SpellCheckComponent Loading spell index for spellchecker: perDict
2> 44648 INFO (searcherExecutor-326-thread-1-processing-collection1) [n: c: s: r: x:collection1 t:] o.a.s.c.SolrCore Registered new searcher autowarm time: 0 ms
2> 44669 INFO (SUITE-TestGroupingSearch-seed#[A99AE5B9B6D5CB18]-worker) [n: c: s: r: x: t:] o.a.s.j.SolrRequestAuthorizer Creating a new SolrRequestAuthorizer
2> 44679 INFO (SUITE-TestGroupingSearch-seed#[A99AE5B9B6D5CB18]-worker) [n: c: s: r: x: t:] o.a.s.SolrTestCaseJ4 ####initCore end
2> 44682 INFO (TEST-TestGroupingSearch.testGroupingSimpleFormatArrayIndexOutOfBoundsExceptionWithJavaBin-seed#[A99AE5B9B6D5CB18]) [n: c: s: r: x: t:] o.a.s.SolrTestCaseJ4 ###Starting testGroupingSimpleFormatArrayIndexOutOfBoundsExceptionWithJavaBin
2> 44683 INFO (TEST-TestGroupingSearch.testGroupingSimpleFormatArrayIndexOutOfBoundsExceptionWithJavaBin-seed#[A99AE5B9B6D5CB18]) [n: c: s: r: x:collection1 t:] o.a.s.u.DirectUpdateHandler2 REMOVING ALL DOCUMENTS FROM INDEX
2> 44684 INFO (TEST-TestGroupingSearch.testGroupingSimpleFormatArrayIndexOutOfBoundsExceptionWithJavaBin-seed#[A99AE5B9B6D5CB18]) [n: c: s: r: x:collection1 t:] o.a.s.u.p.LogUpdateProcessorFactory webapp=null path=null params={}{deleteByQuery=*:*} 0 1
2> 44689 INFO (searcherExecutor-326-thread-1-processing-collection1) [n: c: s: r: x:collection1 t:] o.a.s.c.SolrCore Registered new searcher autowarm time: 0 ms
2> 44689 INFO (TEST-TestGroupingSearch.testGroupingSimpleFormatArrayIndexOutOfBoundsExceptionWithJavaBin-seed#[A99AE5B9B6D5CB18]) [n: c: s: r: x:collection1 t:] o.a.s.u.p.LogUpdateProcessorFactory webapp=null path=null params={}{commit=} 0 4
2> 44690 INFO (TEST-TestGroupingSearch.testGroupingSimpleFormatArrayIndexOutOfBoundsExceptionWithJavaBin-seed#[A99AE5B9B6D5CB18]) [n: c: s: r: x:collection1 t:] o.a.s.u.p.LogUpdateProcessorFactory webapp=null path=null params={}{add=[1]} 0 0
2> 44690 INFO (TEST-TestGroupingSearch.testGroupingSimpleFormatArrayIndexOutOfBoundsExceptionWithJavaBin-seed#[A99AE5B9B6D5CB18]) [n: c: s: r: x:collection1 t:] o.a.s.u.p.LogUpdateProcessorFactory webapp=null path=null params={}{add=[2]} 0 0
2> 44691 INFO (TEST-TestGroupingSearch.testGroupingSimpleFormatArrayIndexOutOfBoundsExceptionWithJavaBin-seed#[A99AE5B9B6D5CB18]) [n: c: s: r: x:collection1 t:] o.a.s.u.p.LogUpdateProcessorFactory webapp=null path=null params={}{add=[3]} 0 0
2> 44691 INFO (TEST-TestGroupingSearch.testGroupingSimpleFormatArrayIndexOutOfBoundsExceptionWithJavaBin-seed#[A99AE5B9B6D5CB18]) [n: c: s: r: x:collection1 t:] o.a.s.u.p.LogUpdateProcessorFactory webapp=null path=null params={}{add=[4]} 0 0
2> 44691 INFO (TEST-TestGroupingSearch.testGroupingSimpleFormatArrayIndexOutOfBoundsExceptionWithJavaBin-seed#[A99AE5B9B6D5CB18]) [n: c: s: r: x:collection1 t:] o.a.s.u.p.LogUpdateProcessorFactory webapp=null path=null params={}{add=[5]} 0 0
2> 44692 INFO (TEST-TestGroupingSearch.testGroupingSimpleFormatArrayIndexOutOfBoundsExceptionWithJavaBin-seed#[A99AE5B9B6D5CB18]) [n: c: s: r: x:collection1 t:] o.a.s.u.p.LogUpdateProcessorFactory webapp=null path=null params={}{add=[6]} 0 0
2> 44698 INFO (searcherExecutor-326-thread-1-processing-collection1) [n: c: s: r: x:collection1 t:] o.a.s.c.SolrCore Registered new searcher autowarm time: 0 ms
2> 44698 INFO (TEST-TestGroupingSearch.testGroupingSimpleFormatArrayIndexOutOfBoundsExceptionWithJavaBin-seed#[A99AE5B9B6D5CB18]) [n: c: s: r: x:collection1 t:] o.a.s.u.p.LogUpdateProcessorFactory webapp=null path=null params={}{commit=} 0 5
2> 44699 INFO (TEST-TestGroupingSearch.testGroupingSimpleFormatArrayIndexOutOfBoundsExceptionWithJavaBin-seed#[A99AE5B9B6D5CB18]) [n: c: s: r: x: t:] o.a.s.c.S.Request webapp=null path=null params={q=*:*&group.main=true&start=4&rows=10&wt=javabin&group.field=nullfirst&group=true} hits=6 status=0 QTime=0
2> 44699 INFO (TEST-TestGroupingSearch.testGroupingSimpleFormatArrayIndexOutOfBoundsExceptionWithJavaBin-seed#[A99AE5B9B6D5CB18]) [n: c: s: r: x: t:] o.a.s.SolrTestCaseJ4 ###Ending testGroupingSimpleFormatArrayIndexOutOfBoundsExceptionWithJavaBin
2> 44704 INFO (TEST-TestGroupingSearch.testGroupingOnDateField-seed#[A99AE5B9B6D5CB18]) [n: c: s: r: x: t:] o.a.s.SolrTestCaseJ4 ###Starting testGroupingOnDateField
2> 44704 INFO (TEST-TestGroupingSearch.testGroupingOnDateField-seed#[A99AE5B9B6D5CB18]) [n: c: s: r: x:collection1 t:] o.a.s.u.DirectUpdateHandler2 REMOVING ALL DOCUMENTS FROM INDEX
2> 44704 INFO (TEST-TestGroupingSearch.testGroupingOnDateField-seed#[A99AE5B9B6D5CB18]) [n: c: s: r: x:collection1 t:] o.a.s.u.p.LogUpdateProcessorFactory webapp=null path=null params={}{deleteByQuery=*:*} 0 0
2> 44707 INFO (searcherExecutor-326-thread-1-processing-testNode-300 collection1) [n: c: s: r: x:collection1 t:] o.a.s.c.SolrCore Registered new searcher autowarm time: 0 ms
2> 44708 INFO (TEST-TestGroupingSearch.testGroupingOnDateField-seed#[A99AE5B9B6D5CB18]) [n: c: s: r: x:collection1 t:] o.a.s.u.p.LogUpdateProcessorFactory webapp=null path=null params={}{commit=} 0 3
2> 44708 INFO (TEST-TestGroupingSearch.testGroupingOnDateField-seed#[A99AE5B9B6D5CB18]) [n: c: s: r: x:collection1 t:] o.a.s.u.p.LogUpdateProcessorFactory webapp=null path=null params={}{add=[1]} 0 0
2> 44709 INFO (TEST-TestGroupingSearch.testGroupingOnDateField-seed#[A99AE5B9B6D5CB18]) [n: c: s: r: x:collection1 t:] o.a.s.u.p.LogUpdateProcessorFactory webapp=null path=null params={}{add=[2]} 0 0
2> 44714 INFO (searcherExecutor-326-thread-1-processing-testNode-300 collection1) [n: c: s: r: x:collection1 t:] o.a.s.c.SolrCore Registered new searcher autowarm time: 0 ms
2> 44714 INFO (TEST-TestGroupingSearch.testGroupingOnDateField-seed#[A99AE5B9B6D5CB18]) [n: c: s: r: x:collection1 t:] o.a.s.u.p.LogUpdateProcessorFactory webapp=null path=null params={}{commit=} 0 5
2> 44715 INFO (TEST-TestGroupingSearch.testGroupingOnDateField-seed#[A99AE5B9B6D5CB18]) [n: c: s: r: x:collection1 t:] o.a.s.u.p.LogUpdateProcessorFactory webapp=null path=null params={}{add=[3]} 0 0
2> 44715 INFO (TEST-TestGroupingSearch.testGroupingOnDateField-seed#[A99AE5B9B6D5CB18]) [n: c: s: r: x:collection1 t:] o.a.s.u.p.LogUpdateProcessorFactory webapp=null path=null params={}{add=[4]} 0 0
2> 44716 INFO (TEST-TestGroupingSearch.testGroupingOnDateField-seed#[A99AE5B9B6D5CB18]) [n: c: s: r: x:collection1 t:] o.a.s.u.p.LogUpdateProcessorFactory webapp=null path=null params={}{add=[5]} 0 0
2> 44721 INFO (searcherExecutor-326-thread-1-processing-testNode-300 collection1) [n: c: s: r: x:collection1 t:] o.a.s.c.SolrCore Registered new searcher autowarm time: 0 ms
2> 44721 INFO (TEST-TestGroupingSearch.testGroupingOnDateField-seed#[A99AE5B9B6D5CB18]) [n: c: s: r: x:collection1 t:] o.a.s.u.p.LogUpdateProcessorFactory webapp=null path=null params={}{commit=} 0 5
2> 44723 INFO (TEST-TestGroupingSearch.testGroupingOnDateField-seed#[A99AE5B9B6D5CB18]) [n: c: s: r: x: t:] o.a.s.c.S.Request webapp=null path=null params={q=*:*&group.limit=10&group=true&fl=id&group.ngroups=true&group.field=date_dt&sort=id+asc} hits=5 status=0 QTime=1
2> 44724 INFO (TEST-TestGroupingSearch.testGroupingOnDateField-seed#[A99AE5B9B6D5CB18]) [n: c: s: r: x: t:] o.a.s.SolrTestCaseJ4 ###Ending testGroupingOnDateField
2> 44728 INFO (TEST-TestGroupingSearch.testGroupingSimpleFormatArrayIndexOutOfBoundsException-seed#[A99AE5B9B6D5CB18]) [n: c: s: r: x: t:] o.a.s.SolrTestCaseJ4 ###Starting testGroupingSimpleFormatArrayIndexOutOfBoundsException
2> 44728 INFO (TEST-TestGroupingSearch.testGroupingSimpleFormatArrayIndexOutOfBoundsException-seed#[A99AE5B9B6D5CB18]) [n: c: s: r: x:collection1 t:] o.a.s.u.DirectUpdateHandler2 REMOVING ALL DOCUMENTS FROM INDEX
2> 44728 INFO (TEST-TestGroupingSearch.testGroupingSimpleFormatArrayIndexOutOfBoundsException-seed#[A99AE5B9B6D5CB18]) [n: c: s: r: x:collection1 t:] o.a.s.u.p.LogUpdateProcessorFactory webapp=null path=null params={}{deleteByQuery=*:*} 0 0
2> 44732 INFO (searcherExecutor-326-thread-1-processing-testNode-300 collection1) [n: c: s: r: x:collection1 t:] o.a.s.c.SolrCore Registered new searcher autowarm time: 0 ms
2> 44734 INFO (TEST-TestGroupingSearch.testGroupingSimpleFormatArrayIndexOutOfBoundsException-seed#[A99AE5B9B6D5CB18]) [n: c: s: r: x:collection1 t:] o.a.s.u.p.LogUpdateProcessorFactory webapp=null path=null params={}{commit=} 0 5
2> 44735 INFO (TEST-TestGroupingSearch.testGroupingSimpleFormatArrayIndexOutOfBoundsException-seed#[A99AE5B9B6D5CB18]) [n: c: s: r: x:collection1 t:] o.a.s.u.p.LogUpdateProcessorFactory webapp=null path=null params={}{add=[1]} 0 0
2> 44736 INFO (TEST-TestGroupingSearch.testGroupingSimpleFormatArrayIndexOutOfBoundsException-seed#[A99AE5B9B6D5CB18]) [n: c: s: r: x:collection1 t:] o.a.s.u.p.LogUpdateProcessorFactory webapp=null path=null params={}{add=[2]} 0 0
2> 44736 INFO (TEST-TestGroupingSearch.testGroupingSimpleFormatArrayIndexOutOfBoundsException-seed#[A99AE5B9B6D5CB18]) [n: c: s: r: x:collection1 t:] o.a.s.u.p.LogUpdateProcessorFactory webapp=null path=null params={}{add=[3]} 0 0
2> 44741 INFO (searcherExecutor-326-thread-1-processing-testNode-300 collection1) [n: c: s: r: x:collection1 t:] o.a.s.c.SolrCore Registered new searcher autowarm time: 0 ms
2> 44741 INFO (TEST-TestGroupingSearch.testGroupingSimpleFormatArrayIndexOutOfBoundsException-seed#[A99AE5B9B6D5CB18]) [n: c: s: r: x:collection1 t:] o.a.s.u.p.LogUpdateProcessorFactory webapp=null path=null params={}{commit=} 0 5
2> 44742 INFO (TEST-TestGroupingSearch.testGroupingSimpleFormatArrayIndexOutOfBoundsException-seed#[A99AE5B9B6D5CB18]) [n: c: s: r: x: t:] o.a.s.c.S.Request webapp=null path=null params={q=*:*&group.main=true&start=1&wt=xml&group.field=id&group=true} hits=3 status=0 QTime=0
2> 44742 INFO (TEST-TestGroupingSearch.testGroupingSimpleFormatArrayIndexOutOfBoundsException-seed#[A99AE5B9B6D5CB18]) [n: c: s: r: x: t:] o.a.s.c.S.Request webapp=null path=null params={q=*:*&group.main=true&start=1&rows=1&wt=xml&group.field=id&group=true} hits=3 status=0 QTime=0
2> 44743 INFO (TEST-TestGroupingSearch.testGroupingSimpleFormatArrayIndexOutOfBoundsException-seed#[A99AE5B9B6D5CB18]) [n: c: s: r: x: t:] o.a.s.SolrTestCaseJ4 ###Ending testGroupingSimpleFormatArrayIndexOutOfBoundsException
2> 44747 INFO (TEST-TestGroupingSearch.testGroupingWithTimeAllowed-seed#[A99AE5B9B6D5CB18]) [n: c: s: r: x: t:] o.a.s.SolrTestCaseJ4 ###Starting testGroupingWithTimeAllowed
2> 44747 INFO (TEST-TestGroupingSearch.testGroupingWithTimeAllowed-seed#[A99AE5B9B6D5CB18]) [n: c: s: r: x:collection1 t:] o.a.s.u.DirectUpdateHandler2 REMOVING ALL DOCUMENTS FROM INDEX
2> 44747 INFO (TEST-TestGroupingSearch.testGroupingWithTimeAllowed-seed#[A99AE5B9B6D5CB18]) [n: c: s: r: x:collection1 t:] o.a.s.u.p.LogUpdateProcessorFactory webapp=null path=null params={}{deleteByQuery=*:*} 0 0
2> 44751 INFO (searcherExecutor-326-thread-1-processing-testNode-300 collection1) [n: c: s: r: x:collection1 t:] o.a.s.c.SolrCore Registered new searcher autowarm time: 0 ms
2> 44752 INFO (TEST-TestGroupingSearch.testGroupingWithTimeAllowed-seed#[A99AE5B9B6D5CB18]) [n: c: s: r: x:collection1 t:] o.a.s.u.p.LogUpdateProcessorFactory webapp=null path=null params={}{commit=} 0 4
2> 44753 INFO (TEST-TestGroupingSearch.testGroupingWithTimeAllowed-seed#[A99AE5B9B6D5CB18]) [n: c: s: r: x:collection1 t:] o.a.s.u.p.LogUpdateProcessorFactory webapp=null path=null params={}{add=[1]} 0 0
2> 44753 INFO (TEST-TestGroupingSearch.testGroupingWithTimeAllowed-seed#[A99AE5B9B6D5CB18]) [n: c: s: r: x:collection1 t:] o.a.s.u.p.LogUpdateProcessorFactory webapp=null path=null params={}{add=[2]} 0 0
2> 44753 INFO (TEST-TestGroupingSearch.testGroupingWithTimeAllowed-seed#[A99AE5B9B6D5CB18]) [n: c: s: r: x:collection1 t:] o.a.s.u.p.LogUpdateProcessorFactory webapp=null path=null params={}{add=[3]} 0 0
2> 44754 INFO (TEST-TestGroupingSearch.testGroupingWithTimeAllowed-seed#[A99AE5B9B6D5CB18]) [n: c: s: r: x:collection1 t:] o.a.s.u.p.LogUpdateProcessorFactory webapp=null path=null params={}{add=[4]} 0 0
2> 44754 INFO (TEST-TestGroupingSearch.testGroupingWithTimeAllowed-seed#[A99AE5B9B6D5CB18]) [n: c: s: r: x:collection1 t:] o.a.s.u.p.LogUpdateProcessorFactory webapp=null path=null params={}{add=[5]} 0 0
2> 44758 INFO (searcherExecutor-326-thread-1-processing-testNode-300 collection1) [n: c: s: r: x:collection1 t:] o.a.s.c.SolrCore Registered new searcher autowarm time: 0 ms
2> 44760 INFO (TEST-TestGroupingSearch.testGroupingWithTimeAllowed-seed#[A99AE5B9B6D5CB18]) [n: c: s: r: x:collection1 t:] o.a.s.u.p.LogUpdateProcessorFactory webapp=null path=null params={}{commit=} 0 6
2> 44761 INFO (TEST-TestGroupingSearch.testGroupingWithTimeAllowed-seed#[A99AE5B9B6D5CB18]) [n: c: s: r: x: t:] o.a.s.c.S.Request webapp=null path=null params={q=*:*&timeAllowed=1&group.query=id:1&group.query=id:2&wt=xml&group=true} hits=5 status=0 QTime=0
2> 44762 ERROR (TEST-TestGroupingSearch.testGroupingWithTimeAllowed-seed#[A99AE5B9B6D5CB18]) [n: c: s: r: x: t:] o.a.s.SolrTestCaseJ4 query failed JSON validation. error=Path not found: /responseHeader/partialResults
2> expected =/responseHeader/partialResults==true
2> response = {
2> "responseHeader":{
2> "status":0,
2> "QTime":0
2> },
2> "grouped":{
2> "id:1":{
2> "matches":5,
2> "doclist":{
2> "numFound":1,
2> "start":0,
2> "numFoundExact":true,
2> "docs":[{
2> "id":"1"
2> }]
2> }
2> },
2> "id:2":{
2> "matches":5,
2> "doclist":{
2> "numFound":1,
2> "start":0,
2> "numFoundExact":true,
2> "docs":[{
2> "id":"2"
2> }]
2> }
2> }
2> }
2> }
2> request = q=*:*&timeAllowed=1&group.query=id:1&group.query=id:2&wt=xml&group=true
2> 44762 INFO (TEST-TestGroupingSearch.testGroupingWithTimeAllowed-seed#[A99AE5B9B6D5CB18]) [n: c: s: r: x: t:] o.a.s.SolrTestCaseJ4 ###Ending testGroupingWithTimeAllowed
> java.lang.RuntimeException: Path not found: /responseHeader/partialResults
> at __randomizedtesting.SeedInfo.seed([A99AE5B9B6D5CB18:F9DA34C74B4D2F93]:0)
> at org.apache.solr.SolrTestCaseJ4.assertJQ(SolrTestCaseJ4.java:1113)
> at org.apache.solr.SolrTestCaseJ4.assertJQ(SolrTestCaseJ4.java:1059)
> at org.apache.solr.TestGroupingSearch.testGroupingWithTimeAllowed(TestGroupingSearch.java:464)
> at java.base/jdk.internal.reflect.NativeMethodAccessorImpl.invoke0(Native Method)
> at java.base/jdk.internal.reflect.NativeMethodAccessorImpl.invoke(NativeMethodAccessorImpl.java:62)
> at java.base/jdk.internal.reflect.DelegatingMethodAccessorImpl.invoke(DelegatingMethodAccessorImpl.java:43)
> at java.base/java.lang.reflect.Method.invoke(Method.java:566)
> at com.carrotsearch.randomizedtesting.RandomizedRunner.invoke(RandomizedRunner.java:1758)
> at com.carrotsearch.randomizedtesting.RandomizedRunner$8.evaluate(RandomizedRunner.java:946)
> at com.carrotsearch.randomizedtesting.RandomizedRunner$9.evaluate(RandomizedRunner.java:982)
> at com.carrotsearch.randomizedtesting.RandomizedRunner$10.evaluate(RandomizedRunner.java:996)
> at com.carrotsearch.randomizedtesting.rules.SystemPropertiesRestoreRule$1.evaluate(SystemPropertiesRestoreRule.java:80)
> at org.junit.rules.RunRules.evaluate(RunRules.java:20)
> at org.apache.lucene.tests.util.TestRuleSetupTeardownChained$1.evaluate(TestRuleSetupTeardownChained.java:48)
> at org.apache.lucene.tests.util.AbstractBeforeAfterRule$1.evaluate(AbstractBeforeAfterRule.java:43)
> at org.apache.lucene.tests.util.TestRuleThreadAndTestName$1.evaluate(TestRuleThreadAndTestName.java:45)
> at org.apache.lucene.tests.util.TestRuleIgnoreAfterMaxFailures$1.evaluate(TestRuleIgnoreAfterMaxFailures.java:60)
> at org.apache.lucene.tests.util.TestRuleMarkFailure$1.evaluate(TestRuleMarkFailure.java:44)
> at org.junit.rules.RunRules.evaluate(RunRules.java:20)
> at com.carrotsearch.randomizedtesting.rules.StatementAdapter.evaluate(StatementAdapter.java:36)
> at com.carrotsearch.randomizedtesting.ThreadLeakControl$StatementRunner.run(ThreadLeakControl.java:390)
> at com.carrotsearch.randomizedtesting.ThreadLeakControl.forkTimeoutingTask(ThreadLeakControl.java:843)
> at com.carrotsearch.randomizedtesting.ThreadLeakControl$3.evaluate(ThreadLeakControl.java:490)
> at com.carrotsearch.randomizedtesting.RandomizedRunner.runSingleTest(RandomizedRunner.java:955)
> at com.carrotsearch.randomizedtesting.RandomizedRunner$5.evaluate(RandomizedRunner.java:840)
> at com.carrotsearch.randomizedtesting.RandomizedRunner$6.evaluate(RandomizedRunner.java:891)
> at com.carrotsearch.randomizedtesting.RandomizedRunner$7.evaluate(RandomizedRunner.java:902)
> at com.carrotsearch.randomizedtesting.rules.StatementAdapter.evaluate(StatementAdapter.java:36)
> at com.carrotsearch.randomizedtesting.rules.StatementAdapter.evaluate(StatementAdapter.java:36)
> at org.apache.lucene.tests.util.AbstractBeforeAfterRule$1.evaluate(AbstractBeforeAfterRule.java:43)
> at org.apache.lucene.tests.util.AbstractBeforeAfterRule$1.evaluate(AbstractBeforeAfterRule.java:43)
> at com.carrotsearch.randomizedtesting.rules.SystemPropertiesRestoreRule$1.evaluate(SystemPropertiesRestoreRule.java:80)
> at org.junit.rules.RunRules.evaluate(RunRules.java:20)
> at org.apache.lucene.tests.util.AbstractBeforeAfterRule$1.evaluate(AbstractBeforeAfterRule.java:43)
> at com.carrotsearch.randomizedtesting.rules.StatementAdapter.evaluate(StatementAdapter.java:36)
> at org.apache.lucene.tests.util.TestRuleStoreClassName$1.evaluate(TestRuleStoreClassName.java:38)
> at com.carrotsearch.randomizedtesting.rules.NoShadowingOrOverridesOnMethodsRule$1.evaluate(NoShadowingOrOverridesOnMethodsRule.java:40)
> at com.carrotsearch.randomizedtesting.rules.NoShadowingOrOverridesOnMethodsRule$1.evaluate(NoShadowingOrOverridesOnMethodsRule.java:40)
> at com.carrotsearch.randomizedtesting.rules.StatementAdapter.evaluate(StatementAdapter.java:36)
> at com.carrotsearch.randomizedtesting.rules.StatementAdapter.evaluate(StatementAdapter.java:36)
> at org.apache.lucene.tests.util.TestRuleAssertionsRequired$1.evaluate(TestRuleAssertionsRequired.java:53)
> at org.apache.lucene.tests.util.AbstractBeforeAfterRule$1.evaluate(AbstractBeforeAfterRule.java:43)
> at org.apache.lucene.tests.util.TestRuleMarkFailure$1.evaluate(TestRuleMarkFailure.java:44)
> at org.apache.lucene.tests.util.TestRuleIgnoreAfterMaxFailures$1.evaluate(TestRuleIgnoreAfterMaxFailures.java:60)
> at org.apache.lucene.tests.util.TestRuleIgnoreTestSuites$1.evaluate(TestRuleIgnoreTestSuites.java:47)
> at org.junit.rules.RunRules.evaluate(RunRules.java:20)
> at com.carrotsearch.randomizedtesting.rules.StatementAdapter.evaluate(StatementAdapter.java:36)
> at com.carrotsearch.randomizedtesting.ThreadLeakControl$StatementRunner.run(ThreadLeakControl.java:390)
> at com.carrotsearch.randomizedtesting.ThreadLeakControl.lambda$forkTimeoutingTask$0(ThreadLeakControl.java:850)
> at java.base/java.lang.Thread.run(Thread.java:829)
2> NOTE: reproduce with: gradlew test --tests TestGroupingSearch.testGroupingWithTimeAllowed -Dtests.seed=A99AE5B9B6D5CB18 -Dtests.locale=tt-RU -Dtests.timezone=Etc/GMT+8 -Dtests.asserts=true -Dtests.file.encoding=UTF-8
2> 44777 INFO (TEST-TestGroupingSearch.testGroupingSortByFunction-seed#[A99AE5B9B6D5CB18]) [n: c: s: r: x: t:] o.a.s.SolrTestCaseJ4 ###Starting testGroupingSortByFunction
2> 44777 INFO (TEST-TestGroupingSearch.testGroupingSortByFunction-seed#[A99AE5B9B6D5CB18]) [n: c: s: r: x:collection1 t:] o.a.s.u.DirectUpdateHandler2 REMOVING ALL DOCUMENTS FROM INDEX
2> 44777 INFO (TEST-TestGroupingSearch.testGroupingSortByFunction-seed#[A99AE5B9B6D5CB18]) [n: c: s: r: x:collection1 t:] o.a.s.u.p.LogUpdateProcessorFactory webapp=null path=null params={}{deleteByQuery=*:*} 0 0
2> 44782 INFO (searcherExecutor-326-thread-1-processing-testNode-300 collection1) [n: c: s: r: x:collection1 t:] o.a.s.c.SolrCore Registered new searcher autowarm time: 0 ms
2> 44785 INFO (TEST-TestGroupingSearch.testGroupingSortByFunction-seed#[A99AE5B9B6D5CB18]) [n: c: s: r: x:collection1 t:] o.a.s.u.p.LogUpdateProcessorFactory webapp=null path=null params={}{commit=} 0 7
2> 44801 INFO (TEST-TestGroupingSearch.testGroupingSortByFunction-seed#[A99AE5B9B6D5CB18]) [n: c: s: r: x:collection1 t:] o.a.s.u.p.LogUpdateP
[...truncated too long message...]
app=null path=null params={q=bogus_s:nothing&fl=id&group.limit=3&fq=foo_i:[*+TO+*]&group.query=id:[2+TO+5]&group.query=id:1000&wt=xml&group=true} hits=0 status=0 QTime=0
2> 46321 INFO (TEST-TestGroupingSearch.testGroupAPI-seed#[A99AE5B9B6D5CB18]) [n: c: s: r: x: t:] o.a.s.SolrTestCaseJ4 ###Ending testGroupAPI
2> 46326 INFO (TEST-TestGroupingSearch.testGroupingNonIndexedOrStoredDocValues-seed#[A99AE5B9B6D5CB18]) [n: c: s: r: x: t:] o.a.s.SolrTestCaseJ4 ###Starting testGroupingNonIndexedOrStoredDocValues
2> 46326 INFO (TEST-TestGroupingSearch.testGroupingNonIndexedOrStoredDocValues-seed#[A99AE5B9B6D5CB18]) [n: c: s: r: x:collection1 t:] o.a.s.u.DirectUpdateHandler2 REMOVING ALL DOCUMENTS FROM INDEX
2> 46326 INFO (TEST-TestGroupingSearch.testGroupingNonIndexedOrStoredDocValues-seed#[A99AE5B9B6D5CB18]) [n: c: s: r: x:collection1 t:] o.a.s.u.p.LogUpdateProcessorFactory webapp=null path=null params={}{deleteByQuery=*:*} 0 0
2> 46331 INFO (searcherExecutor-326-thread-1-processing-testNode-300 collection1) [n: c: s: r: x:collection1 t:] o.a.s.c.SolrCore Registered new searcher autowarm time: 0 ms
2> 46332 INFO (TEST-TestGroupingSearch.testGroupingNonIndexedOrStoredDocValues-seed#[A99AE5B9B6D5CB18]) [n: c: s: r: x:collection1 t:] o.a.s.u.p.LogUpdateProcessorFactory webapp=null path=null params={}{commit=} 0 5
2> 46334 INFO (TEST-TestGroupingSearch.testGroupingNonIndexedOrStoredDocValues-seed#[A99AE5B9B6D5CB18]) [n: c: s: r: x:collection1 t:] o.a.s.u.p.LogUpdateProcessorFactory webapp=null path=null params={}{add=[1]} 0 0
2> 46334 INFO (TEST-TestGroupingSearch.testGroupingNonIndexedOrStoredDocValues-seed#[A99AE5B9B6D5CB18]) [n: c: s: r: x:collection1 t:] o.a.s.u.p.LogUpdateProcessorFactory webapp=null path=null params={}{add=[2]} 0 0
2> 46334 INFO (TEST-TestGroupingSearch.testGroupingNonIndexedOrStoredDocValues-seed#[A99AE5B9B6D5CB18]) [n: c: s: r: x:collection1 t:] o.a.s.u.p.LogUpdateProcessorFactory webapp=null path=null params={}{add=[3]} 0 0
2> 46335 INFO (TEST-TestGroupingSearch.testGroupingNonIndexedOrStoredDocValues-seed#[A99AE5B9B6D5CB18]) [n: c: s: r: x:collection1 t:] o.a.s.u.p.LogUpdateProcessorFactory webapp=null path=null params={}{add=[4]} 0 0
2> 46335 INFO (TEST-TestGroupingSearch.testGroupingNonIndexedOrStoredDocValues-seed#[A99AE5B9B6D5CB18]) [n: c: s: r: x:collection1 t:] o.a.s.u.p.LogUpdateProcessorFactory webapp=null path=null params={}{add=[5]} 0 0
2> 46343 INFO (searcherExecutor-326-thread-1-processing-testNode-300 collection1) [n: c: s: r: x:collection1 t:] o.a.s.c.SolrCore Registered new searcher autowarm time: 0 ms
2> 46344 INFO (TEST-TestGroupingSearch.testGroupingNonIndexedOrStoredDocValues-seed#[A99AE5B9B6D5CB18]) [n: c: s: r: x:collection1 t:] o.a.s.u.p.LogUpdateProcessorFactory webapp=null path=null params={}{commit=} 0 8
2> 46345 INFO (TEST-TestGroupingSearch.testGroupingNonIndexedOrStoredDocValues-seed#[A99AE5B9B6D5CB18]) [n: c: s: r: x: t:] o.a.s.c.S.Request webapp=null path=null params={facet.query={!ex%3Dchk+key%3DLW1}bday:[2013-01-11T00:00:00Z+TO+2013-01-17T23:59:59Z]&facet.query={!ex%3Dchk+key%3DLM1}bday:[2012-12-18T00:00:00Z+TO+2013-01-17T23:59:59Z]&facet.query={!ex%3Dchk+key%3DLM3}bday:[2012-10-18T00:00:00Z+TO+2013-01-17T23:59:59Z]&q=*:*&group.sort=bday+desc&group.truncate=true&fl=id&sort=foo_sdv+asc&fq={!tag%3Dchk}bday:[2012-12-18T00:00:00Z+TO+2013-01-17T23:59:59Z]&rows=1&facet=true&wt=xml&group.field=foo_sdv&group=true} hits=2 status=0 QTime=1
2> 46345 INFO (TEST-TestGroupingSearch.testGroupingNonIndexedOrStoredDocValues-seed#[A99AE5B9B6D5CB18]) [n: c: s: r: x: t:] o.a.s.SolrTestCaseJ4 ###Ending testGroupingNonIndexedOrStoredDocValues
2> 46346 INFO (SUITE-TestGroupingSearch-seed#[A99AE5B9B6D5CB18]-worker) [n: c: s: r: x: t:] o.a.s.SolrTestCaseJ4 ###deleteCore
2> 46346 INFO (SUITE-TestGroupingSearch-seed#[A99AE5B9B6D5CB18]-worker) [n: c: s: r: x: t:] o.a.s.c.CoreContainer Shutting down CoreContainer instance=2066006233
2> 46346 INFO (coreCloseExecutor-331-thread-1-processing-testNode-300) [n: c: s: r: x:collection1 t:] o.a.s.c.SolrCore CLOSING SolrCore org.apache.solr.core.SolrCore@5533a435 collection1
2> 46346 INFO (coreCloseExecutor-331-thread-1-processing-testNode-300) [n: c: s: r: x:collection1 t:] o.a.s.m.SolrMetricManager Closing metric reporters for registry=solr.core.collection1 tag=SolrCore@5533a435
2> 46366 INFO (coreCloseExecutor-331-thread-1-processing-testNode-300) [n: c: s: r: x:collection1 t:] o.a.s.u.DirectUpdateHandler2 Committing on IndexWriter.close() ... SKIPPED (unnecessary).
2> 46370 INFO (SUITE-TestGroupingSearch-seed#[A99AE5B9B6D5CB18]-worker) [n: c: s: r: x: t:] o.a.s.m.SolrMetricManager Closing metric reporters for registry=solr.node tag=null
2> 46375 INFO (SUITE-TestGroupingSearch-seed#[A99AE5B9B6D5CB18]-worker) [n: c: s: r: x: t:] o.a.s.m.SolrMetricManager Closing metric reporters for registry=solr.jvm tag=null
2> 46377 INFO (SUITE-TestGroupingSearch-seed#[A99AE5B9B6D5CB18]-worker) [n: c: s: r: x: t:] o.a.s.m.SolrMetricManager Closing metric reporters for registry=solr.jetty tag=null
2> 46379 INFO (SUITE-TestGroupingSearch-seed#[A99AE5B9B6D5CB18]-worker) [n: c: s: r: x: t:] o.a.s.u.ErrorLogMuter Closing ErrorLogMuter-regex-36 after mutting 0 log messages
2> 46379 INFO (SUITE-TestGroupingSearch-seed#[A99AE5B9B6D5CB18]-worker) [n: c: s: r: x: t:] o.a.s.u.ErrorLogMuter Creating ErrorLogMuter-regex-37 for ERROR logs matching regex: ignore_exception
2> NOTE: leaving temporary files on disk at: /home/jenkins/jenkins-slave/workspace/Solr/Solr-Smoketest-9.x/_tmp/smoke_1709888201/unpack/solr-9.6.0/solr/core/build/tmp/tests-tmp/solr.TestGroupingSearch_A99AE5B9B6D5CB18-001
2> NOTE: test params are: codec=HighCompressionCompressingStoredFieldsData(storedFieldsFormat=Lucene90CompressingStoredFieldsFormat(compressionMode=HIGH_COMPRESSION, chunkSize=82, maxDocsPerChunk=873, blockShift=8), termVectorsFormat=Lucene90CompressingTermVectorsFormat(compressionMode=HIGH_COMPRESSION, chunkSize=82, maxDocsPerChunk=873, blockSize=8)), sim=Asserting(RandomSimilarity(queryNorm=false): {}), locale=tt-RU, timezone=Etc/GMT+8
2> NOTE: Linux 5.4.0-173-generic amd64/Eclipse Adoptium 11.0.16.1 (64-bit)/cpus=1,threads=1,free=215000496,total=350748672
2> NOTE: All tests run in this JVM: [AnalysisAfterCoreReloadTest, ConvertedLegacyTest, DisMaxRequestHandlerTest, EchoParamsTest, MinimalSchemaTest, SampleTest, SolrTestCaseJ4DeleteCoreTest, TestCrossCoreJoin, TestDistributedGrouping, TestDistributedSearch, TestGroupingSearch]
WARNING: Test org.apache.solr.TestRandomFaceting wrote 13,074,569 bytes of output.
WARNING: Test org.apache.solr.schema.DocValuesTest wrote 11,319,993 bytes of output.
WARNING: Test org.apache.solr.schema.TestCloudSchemaless wrote 13,055,136 bytes of output.
WARNING: Test org.apache.solr.search.TestRandomCollapseQParserPlugin wrote 10,655,552 bytes of output.
> Task :solr:solrj:processTestResources
> Task :solr:solrj:testClasses
> Task :solr:solrj:test
> Task :solr:core:test
:solr:core:test (FAILURE): 5003 test(s), 1 failure(s), 217 skipped
5003 tests completed, 1 failed, 217 skipped
> Task :solr:core:test FAILED
> Task :solr:core:wipeTaskTemp
> Task :solr:solrj:test
:solr:solrj:test (SUCCESS): 1168 test(s), 40 skipped
> Task :solr:solrj:wipeTaskTemp
ERROR: The following test(s) have failed:
- org.apache.solr.TestGroupingSearch.testGroupingWithTimeAllowed (:solr:core)
Test output: /home/jenkins/jenkins-slave/workspace/Solr/Solr-Smoketest-9.x/_tmp/smoke_1709888201/unpack/solr-9.6.0/solr/core/build/test-results/test/outputs/OUTPUT-org.apache.solr.TestGroupingSearch.txt
Reproduce with: gradlew :solr:core:test --tests "org.apache.solr.TestGroupingSearch.testGroupingWithTimeAllowed" -Ptests.jvms=2 "-Ptests.jvmargs=-XX:TieredStopAtLevel=1 -XX:+UseParallelGC -XX:ActiveProcessorCount=1 -XX:ReservedCodeCacheSize=120m" -Ptests.seed=A99AE5B9B6D5CB18 -Ptests.badapples=false -Ptests.file.encoding=US-ASCII
FAILURE: Build failed with an exception.
* What went wrong:
Execution failed for task ':solr:core:test'.
> There were failing tests. See the results at: file:///home/jenkins/jenkins-slave/workspace/Solr/Solr-Smoketest-9.x/_tmp/smoke_1709888201/unpack/solr-9.6.0/solr/core/build/test-results/test/
BUILD FAILED in 42m 1s
81 actionable tasks: 63 executed, 18 up-to-date
Publishing build scan...
https://ge.apache.org/s/hxheqxhyzoume
Traceback (most recent call last):
File "dev-tools/scripts/smokeTestRelease.py", line 1196, in <module>
main()
File "dev-tools/scripts/smokeTestRelease.py", line 1122, in main
smokeTest(c.java, c.url, c.revision, c.version, c.tmp_dir, c.is_signed, c.local_keys, ' '.join(c.test_args),
File "dev-tools/scripts/smokeTestRelease.py", line 1184, in smokeTest
unpackAndVerify(java, tmpDir, 'solr-%s-src.tgz' % version, gitRevision, version, testArgs)
File "dev-tools/scripts/smokeTestRelease.py", line 575, in unpackAndVerify
verifyUnpacked(java, artifact, unpackPath, gitRevision, version, testArgs)
File "dev-tools/scripts/smokeTestRelease.py", line 666, in verifyUnpacked
java.run_java11('./gradlew --no-daemon test %s' % testArgs, '%s/test.log' % unpackPath)
File "dev-tools/scripts/smokeTestRelease.py", line 1032, in run_java
run('%s; %s' % (cmd_prefix, cmd), logfile)
File "dev-tools/scripts/smokeTestRelease.py", line 505, in run
raise RuntimeError('command "%s" failed; see log file %s' % (command, logPath))
RuntimeError: command "export JAVA_HOME="/home/jenkins/tools/java/latest11" PATH="/home/jenkins/tools/java/latest11/bin:$PATH" JAVACMD="/home/jenkins/tools/java/latest11/bin/java"; ./gradlew --no-daemon test -Dtests.nightly=false -Dtests.badapples=false " failed; see log file /home/jenkins/jenkins-slave/workspace/Solr/Solr-Smoketest-9.x/_tmp/smoke_1709888201/unpack/solr-9.6.0/test.log
Build step 'Run with timeout' marked build as failure
Email was triggered for: Failure - Any
Sending email for trigger: Failure - Any